Show logfile
Automated smoke report for branch blead 5.32.0 patch f12bbb761071acfd5663d673ad891ffbb2ffdbd9 v5.31.10-15-gf12bbb7610
cjg-netbsd8: Intel 686-class (amd64/1 cpus)
    on        netbsd 8.1
    using     g++ version 5.5.0 (*1)
    smoketime 5 hours 53 minutes (average 44 minutes 10 seconds)

Summary: PASS

O = OK  F = Failure(s), extended report at the bottom
X = Failure(s) under TEST but not under harness
? = still running or test results not (yet) available
Build failures during:       - = unknown or N/A
c = Configure, m = make, M = make (after miniperl), t = make test-prep

v5.31.10-15-gf12bbb7610
---------------------- ----------------------------------------------------
O  O                    -Dcc=g++ (*1)
O  O                    -Dcc=g++ -Duse64bitall (*1)
O  O                    -Dcc=g++ -Duseithreads (*1)
O  O                    -Dcc=g++ -Duseithreads -Duse64bitall (*1)
|  |
|  +------------------  stdio DEBUGGING
+---------------------  stdio

Applied patches:
  RC0
  uncommitted-changes
  SMOKEf12bbb761071acfd5663d673ad891ffbb2ffdbd9

Skipped tests:
      # One test name on a line

Test failures:

Test todo-passed:

MANIFEST messages:
  MANIFEST did not declare '.mailmap'

Compiler messages:
  /usr/include/sys/cdefs_elf.h:67:20: error: missing binary operator before token "("
  /usr/include/sys/cdefs_elf.h:73:20: error: missing binary operator before token "("
  /usr/include/sys/cdefs_elf.h:79:20: error: missing binary operator before token "("
  DB_File.xs: In function 'DB_File_type* ParseOpenInfo(int, char*, int, int, SV*)':
  DB_File.xs:476:44: warning: suggest braces around empty body in an 'if' statement [-Wempty-body]
  DB_File.xs:1044:13: note: in expansion of macro 'croak_and_free'
  DB_File.xs:1050:13: note: in expansion of macro 'croak_and_free'
  DB_File.xs:1056:17: note: in expansion of macro 'croak_and_free'
  DB_File.xs:1091:17: note: in expansion of macro 'croak_and_free'
  DB_File.xs:1140:17: note: in expansion of macro 'croak_and_free'
  DB_File.xs:1229:13: note: in expansion of macro 'croak_and_free'
  Socket.c: In function 'void XS_Socket_pack_ip_mreq_source(CV*)':
  Socket.c:1673:7: warning: variable 'interface' set but not used [-Wunused-but-set-variable]
  const-c.inc:351:42: warning: unused parameter 'iv_return' [-Wunused-parameter]
  re_exec.c: In function 'bool S_regtry(regmatch_info*, char**)':
  re_exec.c:6539:38: warning: 'fold_array' may be used uninitialized in this function [-Wmaybe-uninitialized]
  re_exec.c:6443:17: note: 'fold_array' was declared here
  re_exec.c:6545:28: warning: 'folder' may be used uninitialized in this function [-Wmaybe-uninitialized]
  re_exec.c:6442:16: note: 'folder' was declared here
  regexec.c: In function 'bool S_regtry(regmatch_info*, char**)':
  regexec.c:6539:38: warning: 'fold_array' may be used uninitialized in this function [-Wmaybe-uninitialized]
  regexec.c:6443:17: note: 'fold_array' was declared here
  regexec.c:6545:28: warning: 'folder' may be used uninitialized in this function [-Wmaybe-uninitialized]
  regexec.c:6442:16: note: 'folder' was declared here
  time64.c: In function 'TM64* Perl_localtime64_r(const Time64_T*, TM64*)':
  time64.c:573:32: warning: 'orig_year' may be used uninitialized in this function [-Wmaybe-uninitialized]
  DB_File.xs: In function 'DB_File_type* ParseOpenInfo(PerlInterpreter*, int, char*, int, int, SV*)':
  Socket.c: In function 'void XS_Socket_pack_ip_mreq_source(PerlInterpreter*, CV*)':
  re_exec.c: In function 'bool S_regtry(PerlInterpreter*, regmatch_info*, char**)':
  regexec.c: In function 'bool S_regtry(PerlInterpreter*, regmatch_info*, char**)':

About this smoke:
    smoking-perl: 5.26.1
  smoker-version: 1.71/0.046
       timestamp: 2020-03-25 13:24:25+00
          tester: core

-- 
Report generated by Test::Smoke::Gateway v0.09_01