Show logfile
Automated smoke report for branch blead 5.32.0 patch afd41ae4e769eb6f4f106977edabdca9ab36b497 v5.31.10-14-gafd41ae
x1: Intel(R) Itanium 2 processor/1600 MHz (ia64/2 cpus)
    on        HP-UX B.11.23/64
    using     ccache cc version B3910B A.06.25.02 (*1)
    smoketime 17 hours (average 2 hours 7 minutes)

Summary: FAIL(F)

O = OK  F = Failure(s), extended report at the bottom
X = Failure(s) under TEST but not under harness
? = still running or test results not (yet) available
Build failures during:       - = unknown or N/A
c = Configure, m = make, M = make (after miniperl), t = make test-prep

v5.31.10-14-gafd41ae
---------------------- ----------------------------------------------------
F  F  F  F  F  F         (*1)
F  F  F  F  F  F        -Duse64bitall (*1)
F  F  F  F  F  F        -Duseithreads (*1)
F  F  F  F  F  F        -Duseithreads -Duse64bitall (*1)
|  |  |  |  |  |
|  |  |  |  |  +------  locale:en_US.utf8 DEBUGGING
|  |  |  |  +---------  perlio DEBUGGING
|  |  |  +------------  stdio DEBUGGING
|  |  +---------------  locale:en_US.utf8
|  +------------------  perlio
+---------------------  stdio

Applied patches:
  RC0
  uncommitted-changes
  SMOKEafd41ae4e769eb6f4f106977edabdca9ab36b497

Skipped tests:
      lib/Test/Simple/t/utf8.t

Test failures:
~~ ../lib/charnames.t .......................................... FAILED Non-zero exit status: 9
  [locale:en_US.utf8] -Duseithreads -Duse64bitall
  [stdio] -Duse64bitall
~~ ../dist/IO/t/cachepropagate-unix.t .......................... FAILED 2 10 Non-zero exit status: 2
  [stdio/perlio/locale:en_US.utf8] 
  [stdio/perlio/locale:en_US.utf8] -Duseithreads DEBUGGING
  [stdio/perlio/locale:en_US.utf8] -Duseithreads -Duse64bitall DEBUGGING
  [stdio/perlio/locale:en_US.utf8] -Duse64bitall DEBUGGING
  [stdio/perlio/locale:en_US.utf8]  DEBUGGING
  [stdio/perlio/locale:en_US.utf8] -Duseithreads
  [stdio/perlio/locale:en_US.utf8] -Duse64bitall
  [stdio/perlio/locale:en_US.utf8] -Duseithreads -Duse64bitall
~~ ../ext/XS-APItest/t/hv_macro.t .............................. FAILED 2-49 60-61 Non-zero exit status: 52 Bad plan.  You planned 63 tests but ran 61.
  [stdio/perlio/locale:en_US.utf8] -Duseithreads -Duse64bitall DEBUGGING
  [stdio/perlio/locale:en_US.utf8] -Duseithreads -Duse64bitall
  [stdio/perlio/locale:en_US.utf8] -Duse64bitall DEBUGGING
  [stdio/perlio/locale:en_US.utf8] -Duse64bitall
~~ ../ext/XS-APItest/t/hv_macro.t .............................. FAILED 2-33 Non-zero exit status: 32
  [stdio/perlio/locale:en_US.utf8] 
  [stdio/perlio/locale:en_US.utf8] -Duseithreads DEBUGGING
  [stdio/perlio/locale:en_US.utf8]  DEBUGGING
  [stdio/perlio/locale:en_US.utf8] -Duseithreads
~~ ../cpan/Socket/t/Socket.t ................................... FAILED Non-zero exit status: 255 Bad plan.  You planned 6 tests but ran 2.
  [locale:en_US.utf8] 
  [locale:en_US.utf8] -Duseithreads DEBUGGING
  [locale:en_US.utf8] -Duseithreads -Duse64bitall DEBUGGING
  [locale:en_US.utf8] -Duse64bitall DEBUGGING
  [locale:en_US.utf8]  DEBUGGING
  [locale:en_US.utf8] -Duseithreads
  [locale:en_US.utf8] -Duse64bitall
  [locale:en_US.utf8] -Duseithreads -Duse64bitall

Test todo-passed:
~~ ../dist/Net-Ping/t/450_service.t ............................ PASSED 9 18
  [stdio/perlio/locale:en_US.utf8] 
  [stdio/perlio/locale:en_US.utf8] -Duseithreads DEBUGGING
  [stdio/perlio/locale:en_US.utf8] -Duseithreads -Duse64bitall DEBUGGING
  [stdio/perlio/locale:en_US.utf8] -Duse64bitall DEBUGGING
  [stdio/perlio/locale:en_US.utf8]  DEBUGGING
  [stdio/perlio/locale:en_US.utf8] -Duseithreads
  [stdio/perlio/locale:en_US.utf8] -Duse64bitall
  [stdio/perlio/locale:en_US.utf8] -Duseithreads -Duse64bitall

MANIFEST messages:
  MANIFEST did not declare '.mailmap'

Compiler messages:

About this smoke:
    smoking-perl: 5.14.2
  smoker-version: 1.72_06/0.046
       timestamp: 2020-03-24 21:45:07+00
          tester: merijn

Status overview available here: https://tux.nl/perl5/smoke/
-- 
Report generated by Test::Smoke::Gateway v0.09_01