Show logfile
Automated smoke report for branch smoke-me/khw-Kloop 5.31.9 patch 415a51686aa83096ea704976527386e7bc584fd9 v5.31.8-158-g415a51686a
cjg-mac.local: Mac mini (2.6 GHz) (Dual-Core Intel Core i5/1[2 cores] cpus)
    on        darwin 19.3.0 (Mac OS X - macOS 10.15.3 (19D76))
    using     clang++ version 4.2.1 Compatible Apple LLVM 11.0.0 (clang-1100.0.33.16) (*1)
    smoketime 4 hours 56 minutes (average 24 minutes 43 seconds)

Summary: FAIL(F)

O = OK  F = Failure(s), extended report at the bottom
X = Failure(s) under TEST but not under harness
? = still running or test results not (yet) available
Build failures during:       - = unknown or N/A
c = Configure, m = make, M = make (after miniperl), t = make test-prep

v5.31.8-158-g415a51686a
---------------------- ----------------------------------------------------
F  F                    -Dcc=clang++ (*1)
F  F                    -Dcc=clang++ -Duse64bitall (*1)
F  F                    -Dcc=clang++ -Duselongdouble (*1)
O  O                    -Dcc=clang++ -Duseithreads (*1)
O  O                    -Dcc=clang++ -Duseithreads -Duse64bitall (*1)
O  F                    -Dcc=clang++ -Duseithreads -Duselongdouble (*1)
|  |
|  +------------------  stdio DEBUGGING
+---------------------  stdio

Applied patches:
  SMOKE415a51686aa83096ea704976527386e7bc584fd9

Skipped tests:
      # One test name on a line

Test failures:
~~ ../cpan/ExtUtils-MakeMaker/t/basic.t ........................ FAILED 22-28 Non-zero exit status: 7
  [stdio] -Dcc=clang++ -Duse64bitall DEBUGGING
  [stdio] -Dcc=clang++ -Duse64bitall
  [stdio] -Dcc=clang++
  [stdio] -Dcc=clang++ DEBUGGING
  [stdio] -Dcc=clang++ -Duselongdouble
  [stdio] -Dcc=clang++ -Duselongdouble DEBUGGING
~~ ../t/io/open.t .............................................. FAILED 73
  [stdio] -Dcc=clang++ -Duseithreads -Duselongdouble DEBUGGING
~~ ../ext/POSIX/t/termios.t .................................... FAILED No plan found in TAP output
  [stdio] -Dcc=clang++ -Duse64bitall DEBUGGING
  [stdio] -Dcc=clang++ -Duse64bitall
  [stdio] -Dcc=clang++
  [stdio] -Dcc=clang++ DEBUGGING
  [stdio] -Dcc=clang++ -Duselongdouble
  [stdio] -Dcc=clang++ -Duselongdouble DEBUGGING
~~ ../cpan/ExtUtils-MakeMaker/t/02-xsdynamic.t ................. FAILED 5 71 Non-zero exit status: 12
  [stdio] -Dcc=clang++ -Duse64bitall DEBUGGING
  [stdio] -Dcc=clang++ -Duse64bitall
  [stdio] -Dcc=clang++
  [stdio] -Dcc=clang++ DEBUGGING
  [stdio] -Dcc=clang++ -Duselongdouble
  [stdio] -Dcc=clang++ -Duselongdouble DEBUGGING

Test todo-passed:

MANIFEST messages:
  MANIFEST did not declare '.mailmap'

Compiler messages:
  locale.c:1761:27: warning: array subscript is of type 'char' [-Wchar-subscripts]
  locale.c:1762:27: warning: array subscript is of type 'char' [-Wchar-subscripts]
  DynaLoader.c:535:1: warning: duplicate 'extern' declaration specifier [-Wduplicate-decl-specifier]
  ../../XSUB.h:134:29: note: expanded from macro 'XS_EXTERNAL'
  B.c:3518:1: warning: duplicate 'extern' declaration specifier [-Wduplicate-decl-specifier]
  Bzip2.c:1669:1: warning: duplicate 'extern' declaration specifier [-Wduplicate-decl-specifier]
  Zlib.c:3713:1: warning: duplicate 'extern' declaration specifier [-Wduplicate-decl-specifier]
  deflate.c:54:12: warning: unused variable 'deflate_copyright' [-Wunused-const-variable]
  inftrees.c:11:12: warning: unused variable 'inflate_copyright' [-Wunused-const-variable]
  Cwd.c:1079:1: warning: duplicate 'extern' declaration specifier [-Wduplicate-decl-specifier]
  DB_File.c:3067:1: warning: duplicate 'extern' declaration specifier [-Wduplicate-decl-specifier]
  Dumper.c:1930:1: warning: duplicate 'extern' declaration specifier [-Wduplicate-decl-specifier]
  RealPPPort.c:8185:1: warning: duplicate 'extern' declaration specifier [-Wduplicate-decl-specifier]
  Peek.c:840:1: warning: duplicate 'extern' declaration specifier [-Wduplicate-decl-specifier]
  MD5.c:1054:1: warning: duplicate 'extern' declaration specifier [-Wduplicate-decl-specifier]
  SHA.c:723:1: warning: duplicate 'extern' declaration specifier [-Wduplicate-decl-specifier]
  Byte.c:187:1: warning: duplicate 'extern' declaration specifier [-Wduplicate-decl-specifier]
  ../../../XSUB.h:134:29: note: expanded from macro 'XS_EXTERNAL'
  CN.c:192:1: warning: duplicate 'extern' declaration specifier [-Wduplicate-decl-specifier]
  EBCDIC.c:187:1: warning: duplicate 'extern' declaration specifier [-Wduplicate-decl-specifier]
  JP.c:193:1: warning: duplicate 'extern' declaration specifier [-Wduplicate-decl-specifier]
  KR.c:191:1: warning: duplicate 'extern' declaration specifier [-Wduplicate-decl-specifier]
  Symbol.c:187:1: warning: duplicate 'extern' declaration specifier [-Wduplicate-decl-specifier]
  TW.c:190:1: warning: duplicate 'extern' declaration specifier [-Wduplicate-decl-specifier]
  Unicode.c:704:1: warning: duplicate 'extern' declaration specifier [-Wduplicate-decl-specifier]
  Encode.c:1356:5: warning: unused variable 'ix' [-Wunused-variable]
  ../../XSUB.h:185:20: note: expanded from macro 'dXSI32'
  Encode.c:1398:5: warning: unused variable 'ix' [-Wunused-variable]
  Encode.c:1579:1: warning: duplicate 'extern' declaration specifier [-Wduplicate-decl-specifier]
  Fcntl.c:316:1: warning: duplicate 'extern' declaration specifier [-Wduplicate-decl-specifier]
  DosGlob.c:208:1: warning: duplicate 'extern' declaration specifier [-Wduplicate-decl-specifier]
  Glob.c:706:1: warning: duplicate 'extern' declaration specifier [-Wduplicate-decl-specifier]
  Call.c:464:1: warning: duplicate 'extern' declaration specifier [-Wduplicate-decl-specifier]
  Util.c:720:1: warning: duplicate 'extern' declaration specifier [-Wduplicate-decl-specifier]
  FieldHash.c:718:1: warning: duplicate 'extern' declaration specifier [-Wduplicate-decl-specifier]
  Langinfo.c:313:1: warning: duplicate 'extern' declaration specifier [-Wduplicate-decl-specifier]
  IO.c:1000:1: warning: duplicate 'extern' declaration specifier [-Wduplicate-decl-specifier]
  SysV.c:829:1: warning: duplicate 'extern' declaration specifier [-Wduplicate-decl-specifier]
  ListUtil.c:2220:1: warning: duplicate 'extern' declaration specifier [-Wduplicate-decl-specifier]
  Base64.c:728:1: warning: duplicate 'extern' declaration specifier [-Wduplicate-decl-specifier]
  FastCalc.c:628:1: warning: duplicate 'extern' declaration specifier [-Wduplicate-decl-specifier]
  NDBM_File.c:601:1: warning: duplicate 'extern' declaration specifier [-Wduplicate-decl-specifier]
  Opcode.c:867:1: warning: duplicate 'extern' declaration specifier [-Wduplicate-decl-specifier]
  POSIX.c:5583:1: warning: duplicate 'extern' declaration specifier [-Wduplicate-decl-specifier]
  encoding.c:792:1: warning: duplicate 'extern' declaration specifier [-Wduplicate-decl-specifier]
  mmap.c:449:1: warning: duplicate 'extern' declaration specifier [-Wduplicate-decl-specifier]
  scalar.c:601:1: warning: duplicate 'extern' declaration specifier [-Wduplicate-decl-specifier]
  via.c:843:1: warning: duplicate 'extern' declaration specifier [-Wduplicate-decl-specifier]
  SDBM_File.c:583:1: warning: duplicate 'extern' declaration specifier [-Wduplicate-decl-specifier]
  Socket.c:1848:1: warning: duplicate 'extern' declaration specifier [-Wduplicate-decl-specifier]
  Storable.c:8166:1: warning: duplicate 'extern' declaration specifier [-Wduplicate-decl-specifier]
  Hostname.c:243:1: warning: duplicate 'extern' declaration specifier [-Wduplicate-decl-specifier]
  Syslog.c:532:1: warning: duplicate 'extern' declaration specifier [-Wduplicate-decl-specifier]
  HiRes.c:2370:1: warning: duplicate 'extern' declaration specifier [-Wduplicate-decl-specifier]
  Piece.c:1424:1: warning: duplicate 'extern' declaration specifier [-Wduplicate-decl-specifier]
  Collate.c:1048:1: warning: duplicate 'extern' declaration specifier [-Wduplicate-decl-specifier]
  Normalize.c:1289:1: warning: duplicate 'extern' declaration specifier [-Wduplicate-decl-specifier]
  APItest.c:3281:2: warning: 'Perl_ptr_table_clear' is deprecated [-Wdeprecated-declarations]
  ../../embed.h:443:28: note: expanded from macro 'ptr_table_clear'
  ../../proto.h:2698:4: note: 'Perl_ptr_table_clear' has been explicitly marked deprecated here
  ../../perl.h:347:60: note: expanded from macro '__attribute__deprecated__'
  APItest.c:13753:1: warning: duplicate 'extern' declaration specifier [-Wduplicate-decl-specifier]
  XSUB-undef-XS_VERSION.c:194:1: warning: duplicate 'extern' declaration specifier [-Wduplicate-decl-specifier]
  XSUB-redefined-macros.c:216:1: warning: duplicate 'extern' declaration specifier [-Wduplicate-decl-specifier]
  Typemap.c:1919:1: warning: duplicate 'extern' declaration specifier [-Wduplicate-decl-specifier]
  attributes.c:465:1: warning: duplicate 'extern' declaration specifier [-Wduplicate-decl-specifier]
  mro.c:928:1: warning: duplicate 'extern' declaration specifier [-Wduplicate-decl-specifier]
  re.c:304:1: warning: duplicate 'extern' declaration specifier [-Wduplicate-decl-specifier]
  threads.c:2193:1: warning: duplicate 'extern' declaration specifier [-Wduplicate-decl-specifier]
  shared.c:2147:1: warning: duplicate 'extern' declaration specifier [-Wduplicate-decl-specifier]
  ExtTest.c:660:1: warning: duplicate 'extern' declaration specifier [-Wduplicate-decl-specifier]
  ../../../../XSUB.h:134:29: note: expanded from macro 'XS_EXTERNAL'
  ExtTest.c:356:1: warning: duplicate 'extern' declaration specifier [-Wduplicate-decl-specifier]
  ExtTest.c:442:1: warning: duplicate 'extern' declaration specifier [-Wduplicate-decl-specifier]
  ExtTest.c:376:1: warning: duplicate 'extern' declaration specifier [-Wduplicate-decl-specifier]
  ExtTest.c:460:1: warning: duplicate 'extern' declaration specifier [-Wduplicate-decl-specifier]
  ExtTest.c:441:1: warning: duplicate 'extern' declaration specifier [-Wduplicate-decl-specifier]
  ExtTest.c:417:1: warning: duplicate 'extern' declaration specifier [-Wduplicate-decl-specifier]
  # Test.c:181:1: warning: duplicate 'extern' declaration specifier [-Wduplicate-decl-specifier]
  # ../../../../XSUB.h:134:29: note: expanded from macro 'XS_EXTERNAL'
  # lib/XS/Other.c:182:1: warning: duplicate 'extern' declaration specifier [-Wduplicate-decl-specifier]
  # lib/XS/Test.c:181:1: warning: duplicate 'extern' declaration specifier [-Wduplicate-decl-specifier]
  # Other.c:181:1: warning: duplicate 'extern' declaration specifier [-Wduplicate-decl-specifier]
  # ../../../../../XSUB.h:134:29: note: expanded from macro 'XS_EXTERNAL'
  # lib/XS/Other.c:208:1: warning: duplicate 'extern' declaration specifier [-Wduplicate-decl-specifier]
  # Test.c:208:1: warning: duplicate 'extern' declaration specifier [-Wduplicate-decl-specifier]
  XSTest.c:340:1: warning: duplicate 'extern' declaration specifier [-Wduplicate-decl-specifier]
  /Users/core/smoke/perl-current/XSUB.h:134:29: note: expanded from macro 'XS_EXTERNAL'
  XSMore.c:525:1: warning: duplicate 'extern' declaration specifier [-Wduplicate-decl-specifier]
  XSUsage.c:301:1: warning: duplicate 'extern' declaration specifier [-Wduplicate-decl-specifier]

About this smoke:
    smoking-perl: 5.26.1
  smoker-version: 1.71/0.046
       timestamp: 2020-03-09 06:13:43+00
          tester: core

-- 
Report generated by Test::Smoke::Gateway v0.09_01