Show logfile
Automated smoke report for branch smoke-me/khw-Kloop 5.31.9 patch 34e0bad9eb91e6c9d0aa3e3977727fdd38f07719 v5.31.8-156-g34e0bad9eb
iTuness-MacBook-Air.local: MacBook Air (2 GHz) (Intel Core i7/1[2 cores] cpus)
    on        darwin 18.7.0)
    using     cc version 4.2.1 Compatible Apple LLVM 11.0.0 (clang-1100.0.33.17) (*1)
    smoketime 10 hours 12 minutes (average 34 minutes 2 seconds)

Summary: FAIL(F)

O = OK  F = Failure(s), extended report at the bottom
X = Failure(s) under TEST but not under harness
? = still running or test results not (yet) available
Build failures during:       - = unknown or N/A
c = Configure, m = make, M = make (after miniperl), t = make test-prep

v5.31.8-156-g34e0bad9eb
---------------------- ----------------------------------------------------
F  F                    -Uuseperlio (*1)
F  F                     (*1)
F  F                    -Duse64bitint (*1)
F  F                    -Duselongdouble (*1)
F  F                    -Dusemorebits (*1)
F  F                    -Duseithreads (*1)
F  F                    -Duseithreads -Duse64bitint (*1)
F  F                    -Duseithreads -Duselongdouble (*1)
F  F                    -Duseithreads -Dusemorebits (*1)
|  |
|  +------------------  stdio DEBUGGING
+---------------------  stdio

Applied patches:
  SMOKE34e0bad9eb91e6c9d0aa3e3977727fdd38f07719

Skipped tests:
  None

Test failures:
~~ ../t/re/regexp_noamp.t ...................................... FAILED Non-zero exit status: 255 No plan found in TAP output
  [stdio] -Duseithreads -Duse64bitint DEBUGGING
  [stdio] 
  [stdio] -Duseithreads DEBUGGING
  [stdio] -Duseithreads -Duselongdouble DEBUGGING
  [stdio] -Duseithreads -Dusemorebits
  [stdio] -Duselongdouble DEBUGGING
  [stdio] -Duse64bitint DEBUGGING
  [stdio] -Duse64bitint
  [stdio] -Uuseperlio DEBUGGING
  [stdio] -Duseithreads -Duselongdouble
  [stdio] -Uuseperlio
  [stdio] -Dusemorebits
  [stdio] -Duseithreads -Dusemorebits DEBUGGING
  [stdio]  DEBUGGING
  [stdio] -Duseithreads -Duse64bitint
  [stdio] -Duseithreads
  [stdio] -Duselongdouble
  [stdio] -Dusemorebits DEBUGGING
~~ ../t/re/regex_sets_compat.t ................................. FAILED Non-zero exit status: 255 No plan found in TAP output
  [stdio] -Duseithreads -Duse64bitint DEBUGGING
  [stdio] 
  [stdio] -Duseithreads DEBUGGING
  [stdio] -Duseithreads -Duselongdouble DEBUGGING
  [stdio] -Duseithreads -Dusemorebits
  [stdio] -Duselongdouble DEBUGGING
  [stdio] -Duse64bitint DEBUGGING
  [stdio] -Duse64bitint
  [stdio] -Uuseperlio DEBUGGING
  [stdio] -Duseithreads -Duselongdouble
  [stdio] -Uuseperlio
  [stdio] -Dusemorebits
  [stdio] -Duseithreads -Dusemorebits DEBUGGING
  [stdio]  DEBUGGING
  [stdio] -Duseithreads -Duse64bitint
  [stdio] -Duseithreads
  [stdio] -Duselongdouble
  [stdio] -Dusemorebits DEBUGGING
~~ ../t/io/open.t .............................................. FAILED 68
  [stdio] -Duseithreads -Dusemorebits
~~ ../t/re/regexp_qr_embed_thr.t ............................... FAILED Non-zero exit status: 29 No plan found in TAP output
  [stdio] -Duseithreads -Duse64bitint DEBUGGING
  [stdio] -Duseithreads DEBUGGING
  [stdio] -Duseithreads -Duselongdouble DEBUGGING
  [stdio] -Duseithreads -Dusemorebits DEBUGGING
  [stdio] -Duseithreads -Dusemorebits
  [stdio] -Duseithreads -Duse64bitint
  [stdio] -Duseithreads
  [stdio] -Duseithreads -Duselongdouble
~~ ../t/re/regexp_nonull.t ..................................... FAILED Non-zero exit status: 255 No plan found in TAP output
  [stdio] -Duseithreads -Duse64bitint DEBUGGING
  [stdio] 
  [stdio] -Duseithreads DEBUGGING
  [stdio] -Duseithreads -Duselongdouble DEBUGGING
  [stdio] -Duseithreads -Dusemorebits
  [stdio] -Duselongdouble DEBUGGING
  [stdio] -Duse64bitint DEBUGGING
  [stdio] -Duse64bitint
  [stdio] -Uuseperlio DEBUGGING
  [stdio] -Duseithreads -Duselongdouble
  [stdio] -Uuseperlio
  [stdio] -Dusemorebits
  [stdio] -Duseithreads -Dusemorebits DEBUGGING
  [stdio]  DEBUGGING
  [stdio] -Duseithreads -Duse64bitint
  [stdio] -Duseithreads
  [stdio] -Duselongdouble
  [stdio] -Dusemorebits DEBUGGING
~~ ../t/re/regexp_notrie.t ..................................... FAILED Non-zero exit status: 255 No plan found in TAP output
  [stdio] -Duseithreads -Duse64bitint DEBUGGING
  [stdio] 
  [stdio] -Duseithreads DEBUGGING
  [stdio] -Duseithreads -Duselongdouble DEBUGGING
  [stdio] -Duseithreads -Dusemorebits
  [stdio] -Duselongdouble DEBUGGING
  [stdio] -Duse64bitint DEBUGGING
  [stdio] -Duse64bitint
  [stdio] -Uuseperlio DEBUGGING
  [stdio] -Duseithreads -Duselongdouble
  [stdio] -Uuseperlio
  [stdio] -Dusemorebits
  [stdio] -Duseithreads -Dusemorebits DEBUGGING
  [stdio]  DEBUGGING
  [stdio] -Duseithreads -Duse64bitint
  [stdio] -Duseithreads
  [stdio] -Duselongdouble
  [stdio] -Dusemorebits DEBUGGING
~~ ../t/re/regexp_qr_embed.t ................................... FAILED Non-zero exit status: 255 No plan found in TAP output
  [stdio] -Duseithreads -Duse64bitint DEBUGGING
  [stdio] 
  [stdio] -Duseithreads DEBUGGING
  [stdio] -Duseithreads -Duselongdouble DEBUGGING
  [stdio] -Duseithreads -Dusemorebits
  [stdio] -Duselongdouble DEBUGGING
  [stdio] -Duse64bitint DEBUGGING
  [stdio] -Duse64bitint
  [stdio] -Uuseperlio DEBUGGING
  [stdio] -Duseithreads -Duselongdouble
  [stdio] -Uuseperlio
  [stdio] -Dusemorebits
  [stdio] -Duseithreads -Dusemorebits DEBUGGING
  [stdio]  DEBUGGING
  [stdio] -Duseithreads -Duse64bitint
  [stdio] -Duseithreads
  [stdio] -Duselongdouble
  [stdio] -Dusemorebits DEBUGGING
~~ ../t/re/regexp_qr.t ......................................... FAILED Non-zero exit status: 255 No plan found in TAP output
  [stdio] -Duseithreads -Duse64bitint DEBUGGING
  [stdio] 
  [stdio] -Duseithreads DEBUGGING
  [stdio] -Duseithreads -Duselongdouble DEBUGGING
  [stdio] -Duseithreads -Dusemorebits
  [stdio] -Duselongdouble DEBUGGING
  [stdio] -Duse64bitint DEBUGGING
  [stdio] -Duse64bitint
  [stdio] -Uuseperlio DEBUGGING
  [stdio] -Duseithreads -Duselongdouble
  [stdio] -Uuseperlio
  [stdio] -Dusemorebits
  [stdio] -Duseithreads -Dusemorebits DEBUGGING
  [stdio]  DEBUGGING
  [stdio] -Duseithreads -Duse64bitint
  [stdio] -Duseithreads
  [stdio] -Duselongdouble
  [stdio] -Dusemorebits DEBUGGING
~~ ../t/re/alpha_assertions.t .................................. FAILED Non-zero exit status: 255 No plan found in TAP output
  [stdio] -Duseithreads -Duse64bitint DEBUGGING
  [stdio] 
  [stdio] -Duseithreads DEBUGGING
  [stdio] -Duseithreads -Duselongdouble DEBUGGING
  [stdio] -Duseithreads -Dusemorebits
  [stdio] -Duselongdouble DEBUGGING
  [stdio] -Duse64bitint DEBUGGING
  [stdio] -Duse64bitint
  [stdio] -Uuseperlio DEBUGGING
  [stdio] -Duseithreads -Duselongdouble
  [stdio] -Uuseperlio
  [stdio] -Dusemorebits
  [stdio] -Duseithreads -Dusemorebits DEBUGGING
  [stdio]  DEBUGGING
  [stdio] -Duseithreads -Duse64bitint
  [stdio] -Duseithreads
  [stdio] -Duselongdouble
  [stdio] -Dusemorebits DEBUGGING
~~ ../t/re/regexp.t ............................................ FAILED Non-zero exit status: 255 No plan found in TAP output
  [stdio] -Duseithreads -Duse64bitint DEBUGGING
  [stdio] 
  [stdio] -Duseithreads DEBUGGING
  [stdio] -Duseithreads -Duselongdouble DEBUGGING
  [stdio] -Duseithreads -Dusemorebits
  [stdio] -Duselongdouble DEBUGGING
  [stdio] -Duse64bitint DEBUGGING
  [stdio] -Duse64bitint
  [stdio] -Uuseperlio DEBUGGING
  [stdio] -Duseithreads -Duselongdouble
  [stdio] -Uuseperlio
  [stdio] -Dusemorebits
  [stdio] -Duseithreads -Dusemorebits DEBUGGING
  [stdio]  DEBUGGING
  [stdio] -Duseithreads -Duse64bitint
  [stdio] -Duseithreads
  [stdio] -Duselongdouble
  [stdio] -Dusemorebits DEBUGGING
~~ ../t/re/regexp_trielist.t ................................... FAILED Non-zero exit status: 255 No plan found in TAP output
  [stdio] -Duseithreads -Duse64bitint DEBUGGING
  [stdio] 
  [stdio] -Duseithreads DEBUGGING
  [stdio] -Duseithreads -Duselongdouble DEBUGGING
  [stdio] -Duseithreads -Dusemorebits
  [stdio] -Duselongdouble DEBUGGING
  [stdio] -Duse64bitint DEBUGGING
  [stdio] -Duse64bitint
  [stdio] -Uuseperlio DEBUGGING
  [stdio] -Duseithreads -Duselongdouble
  [stdio] -Uuseperlio
  [stdio] -Dusemorebits
  [stdio] -Duseithreads -Dusemorebits DEBUGGING
  [stdio]  DEBUGGING
  [stdio] -Duseithreads -Duse64bitint
  [stdio] -Duseithreads
  [stdio] -Duselongdouble
  [stdio] -Dusemorebits DEBUGGING

Test todo-passed:

MANIFEST messages:
  MANIFEST did not declare '.mailmap'

Compiler messages:
  Encode.c:1356:5: warning: unused variable 'ix' [-Wunused-variable]
  ../../XSUB.h:185:20: note: expanded from macro 'dXSI32'
  Encode.c:1398:5: warning: unused variable 'ix' [-Wunused-variable]

About this smoke:
    smoking-perl: 5.18.4
  smoker-version: 1.72/0.046
       timestamp: 2020-02-17 01:24:00+00
          tester: perl

Enabled stack-use-after-return (Linux/Darwin) and leak-detection (Linux).  Smoke logs available at http://m-l.org/~perl/smoke/perl/darwin-thread-multi-2level/smoke-me_clang_quick_sanitize=address/Karl%20Williamson/log34e0bad9eb91e6c9d0aa3e3977727fdd38f07719.log.gz
-- 
Report generated by Test::Smoke::Gateway v0.09_01