Show logfile
Automated smoke report for branch blead 5.31.9 patch d34b46d077dcfc479c36f65b196086abd7941c76 v5.31.8-135-gd34b46d077
cjg-netbsd8: Intel 686-class (amd64/1 cpus)
    on        netbsd 8.1
    using     g++ version 5.5.0 (*1)
    smoketime 5 hours 21 minutes (average 40 minutes 14 seconds)

Summary: FAIL(F)

O = OK  F = Failure(s), extended report at the bottom
X = Failure(s) under TEST but not under harness
? = still running or test results not (yet) available
Build failures during:       - = unknown or N/A
c = Configure, m = make, M = make (after miniperl), t = make test-prep

v5.31.8-135-gd34b46d077
---------------------- ----------------------------------------------------
F  F                    -Dcc=g++ -Duseithreads -Duse64bitall (*1)
F  F                    -Dcc=g++ -Duseithreads (*1)
F  F                    -Dcc=g++ (*1)
F  F                    -Dcc=g++ -Duse64bitall (*1)
|  |
|  +------------------  stdio DEBUGGING
+---------------------  stdio

Applied patches:
  SMOKEd34b46d077dcfc479c36f65b196086abd7941c76

Skipped tests:
      # One test name on a line

Test failures:
~~ ../t/porting/authors.t ...................................... FAILED 839
  [stdio] -Dcc=g++ -Duseithreads
  [stdio] -Dcc=g++ -Duse64bitall
  [stdio] -Dcc=g++ -Duseithreads -Duse64bitall DEBUGGING
  [stdio] -Dcc=g++
  [stdio] -Dcc=g++ -Duseithreads -Duse64bitall
  [stdio] -Dcc=g++ -Duse64bitall DEBUGGING
  [stdio] -Dcc=g++ DEBUGGING
  [stdio] -Dcc=g++ -Duseithreads DEBUGGING

Test todo-passed:

MANIFEST messages:
  MANIFEST did not declare '.mailmap'

Compiler messages:
  /usr/include/sys/cdefs_elf.h:67:20: error: missing binary operator before token "("
  /usr/include/sys/cdefs_elf.h:73:20: error: missing binary operator before token "("
  /usr/include/sys/cdefs_elf.h:79:20: error: missing binary operator before token "("
  DB_File.xs: In function 'DB_File_type* ParseOpenInfo(int, char*, int, int, SV*)':
  DB_File.xs:476:44: warning: suggest braces around empty body in an 'if' statement [-Wempty-body]
  DB_File.xs:1044:13: note: in expansion of macro 'croak_and_free'
  DB_File.xs:1050:13: note: in expansion of macro 'croak_and_free'
  DB_File.xs:1056:17: note: in expansion of macro 'croak_and_free'
  DB_File.xs:1091:17: note: in expansion of macro 'croak_and_free'
  DB_File.xs:1140:17: note: in expansion of macro 'croak_and_free'
  DB_File.xs:1229:13: note: in expansion of macro 'croak_and_free'
  Encode.c: In function 'void XS_Encode_decode(CV*)':
  ../../XSUB.h:185:20: warning: unused variable 'ix' [-Wunused-variable]
  Encode.c:1356:5: note: in expansion of macro 'dXSI32'
  Encode.c: In function 'void XS_Encode_encode(CV*)':
  Encode.c:1398:5: note: in expansion of macro 'dXSI32'
  Socket.c: In function 'void XS_Socket_pack_ip_mreq_source(CV*)':
  Socket.c:1673:7: warning: variable 'interface' set but not used [-Wunused-but-set-variable]
  const-c.inc:351:42: warning: unused parameter 'iv_return' [-Wunused-parameter]
  re_exec.c: In function 'bool S_regtry(regmatch_info*, char**)':
  re_exec.c:6539:38: warning: 'fold_array' may be used uninitialized in this function [-Wmaybe-uninitialized]
  re_exec.c:6443:17: note: 'fold_array' was declared here
  re_exec.c:6545:28: warning: 'folder' may be used uninitialized in this function [-Wmaybe-uninitialized]
  re_exec.c:6442:16: note: 'folder' was declared here
  regexec.c: In function 'bool S_regtry(regmatch_info*, char**)':
  regexec.c:6539:38: warning: 'fold_array' may be used uninitialized in this function [-Wmaybe-uninitialized]
  regexec.c:6443:17: note: 'fold_array' was declared here
  regexec.c:6545:28: warning: 'folder' may be used uninitialized in this function [-Wmaybe-uninitialized]
  regexec.c:6442:16: note: 'folder' was declared here
  DB_File.xs: In function 'DB_File_type* ParseOpenInfo(PerlInterpreter*, int, char*, int, int, SV*)':
  Encode.c: In function 'void XS_Encode_decode(PerlInterpreter*, CV*)':
  Encode.c: In function 'void XS_Encode_encode(PerlInterpreter*, CV*)':
  Socket.c: In function 'void XS_Socket_pack_ip_mreq_source(PerlInterpreter*, CV*)':
  re_exec.c: In function 'bool S_regtry(PerlInterpreter*, regmatch_info*, char**)':
  regexec.c: In function 'bool S_regtry(PerlInterpreter*, regmatch_info*, char**)':

About this smoke:
    smoking-perl: 5.26.1
  smoker-version: 1.71/0.046
       timestamp: 2020-02-11 13:07:26+00
          tester: core

-- 
Report generated by Test::Smoke::Gateway v0.09_01