Show logfile
Automated smoke report for branch blead 5.31.9 patch a491ffd38258cab175d7540104c46bb9cdc3f6c0 v5.31.8-16-ga491ffd
r9: 9000/800 (PA-RISC2.0/1 cpus)
    on        HP-UX B.11.11/64
    using     gcc version 4.6.1 (*1)
    smoketime 1 day 19 hours 26 minutes (average 5 hours 25 minutes)

Summary: FAIL(F)

O = OK  F = Failure(s), extended report at the bottom
X = Failure(s) under TEST but not under harness
? = still running or test results not (yet) available
Build failures during:       - = unknown or N/A
c = Configure, m = make, M = make (after miniperl), t = make test-prep

v5.31.8-16-ga491ffd
---------------------- ----------------------------------------------------
F  F  F  F  F  F        -Dcc=gcc (*1)
F  F  F  F  F  F        -Dcc=gcc -Duse64bitall (*1)
F  F  F  F  F  F        -Dcc=gcc -Duseithreads (*1)
F  F  F  F  F  F        -Dcc=gcc -Duseithreads -Duse64bitall (*1)
|  |  |  |  |  |
|  |  |  |  |  +------  locale:univ.utf8 DEBUGGING
|  |  |  |  +---------  perlio DEBUGGING
|  |  |  +------------  stdio DEBUGGING
|  |  +---------------  locale:univ.utf8
|  +------------------  perlio
+---------------------  stdio

Applied patches:
  SMOKEa491ffd38258cab175d7540104c46bb9cdc3f6c0

Skipped tests:
  None

Test failures:
~~ ../t/io/socket.t ............................................ FAILED 30
  [stdio] -Dcc=gcc
  [stdio] -Dcc=gcc -Duse64bitall
  [stdio] -Dcc=gcc -Duseithreads -Duse64bitall DEBUGGING
  [stdio] -Dcc=gcc -Duseithreads DEBUGGING
  [stdio] -Dcc=gcc -Duseithreads
  [stdio] -Dcc=gcc DEBUGGING
  [stdio] -Dcc=gcc -Duse64bitall DEBUGGING
  [stdio] -Dcc=gcc -Duseithreads -Duse64bitall
~~ ../dist/Time-HiRes/t/alarm.t ................................ FAILED 8-9 Non-zero exit status: 2
  [perlio] -Dcc=gcc -Duseithreads -Duse64bitall DEBUGGING
~~ ../lib/warnings.t ........................................... FAILED 366
  [stdio/perlio/locale:univ.utf8] -Dcc=gcc
  [stdio/perlio/locale:univ.utf8] -Dcc=gcc -Duse64bitall
  [stdio/perlio/locale:univ.utf8] -Dcc=gcc -Duseithreads -Duse64bitall DEBUGGING
  [stdio/perlio/locale:univ.utf8] -Dcc=gcc -Duseithreads DEBUGGING
  [stdio/perlio/locale:univ.utf8] -Dcc=gcc -Duseithreads
  [stdio/perlio/locale:univ.utf8] -Dcc=gcc DEBUGGING
  [stdio/perlio/locale:univ.utf8] -Dcc=gcc -Duse64bitall DEBUGGING
  [stdio/perlio/locale:univ.utf8] -Dcc=gcc -Duseithreads -Duse64bitall
~~ ../t/io/nargv.t ............................................. FAILED Bad plan.  You planned 7 tests but ran 0.
  [locale:univ.utf8] -Dcc=gcc -Duseithreads DEBUGGING
~~ ../lib/locale.t ............................................. FAILED 431-432 498
  [stdio/perlio/locale:univ.utf8] -Dcc=gcc
  [stdio/perlio/locale:univ.utf8] -Dcc=gcc -Duse64bitall
  [stdio/perlio/locale:univ.utf8] -Dcc=gcc -Duseithreads -Duse64bitall DEBUGGING
  [stdio/perlio/locale:univ.utf8] -Dcc=gcc -Duseithreads DEBUGGING
  [stdio/perlio/locale:univ.utf8] -Dcc=gcc -Duseithreads
  [stdio/perlio/locale:univ.utf8] -Dcc=gcc DEBUGGING
  [stdio/perlio/locale:univ.utf8] -Dcc=gcc -Duse64bitall DEBUGGING
  [stdio/perlio/locale:univ.utf8] -Dcc=gcc -Duseithreads -Duse64bitall
~~ ../t/io/nargv.t ............................................. FAILED Bad plan.  You planned 7 tests but ran 6.
  [stdio] -Dcc=gcc -Duseithreads -Duse64bitall DEBUGGING
~~ ../cpan/Socket/t/Socket.t ................................... FAILED Non-zero exit status: 255 Bad plan.  You planned 6 tests but ran 2.
  [locale:univ.utf8] -Dcc=gcc
  [locale:univ.utf8] -Dcc=gcc -Duse64bitall
  [locale:univ.utf8] -Dcc=gcc -Duseithreads -Duse64bitall DEBUGGING
  [locale:univ.utf8] -Dcc=gcc -Duseithreads DEBUGGING
  [locale:univ.utf8] -Dcc=gcc -Duseithreads
  [locale:univ.utf8] -Dcc=gcc DEBUGGING
  [locale:univ.utf8] -Dcc=gcc -Duse64bitall DEBUGGING
  [locale:univ.utf8] -Dcc=gcc -Duseithreads -Duse64bitall

Test todo-passed:
~~ ../dist/Net-Ping/t/450_service.t ............................ PASSED 9 18
  [stdio/perlio/locale:univ.utf8] -Dcc=gcc
  [stdio/perlio/locale:univ.utf8] -Dcc=gcc -Duse64bitall
  [stdio/perlio/locale:univ.utf8] -Dcc=gcc -Duseithreads -Duse64bitall DEBUGGING
  [stdio/perlio/locale:univ.utf8] -Dcc=gcc -Duseithreads DEBUGGING
  [stdio/perlio/locale:univ.utf8] -Dcc=gcc -Duseithreads
  [stdio/perlio/locale:univ.utf8] -Dcc=gcc DEBUGGING
  [stdio/perlio/locale:univ.utf8] -Dcc=gcc -Duse64bitall DEBUGGING
  [stdio/perlio/locale:univ.utf8] -Dcc=gcc -Duseithreads -Duse64bitall

MANIFEST messages:

Compiler messages:
  op.c: In function 'Perl_ck_eval':
  op.c:12605:9: warning: value computed is not used [-Wunused-value]
  op.c: In function 'Perl_pmruntime':
  op.c:7277:15: warning: 't_cp' may be used uninitialized in this function [-Wuninitialized]
  op.c:6868:14: note: 't_cp' was declared here
  op.c:7314:28: warning: 'r_cp' may be used uninitialized in this function [-Wuninitialized]
  op.c:6868:8: note: 'r_cp' was declared here
  toke.c: In function 'Perl_scan_num':
  toke.c:11510:54: warning: 'b' may be used uninitialized in this function [-Wuninitialized]
  regcomp.c: In function 'S_regpiece':
  regcomp.c:12613:46: warning: comparison between signed and unsigned integer expressions [-Wsign-compare]
  pp.c: In function 'Perl_pp_argelem':
  pp.c:7055:13: warning: value computed is not used [-Wunused-value]
  /usr/include/rpc/rpcb_prot.h:163:25: note: originally defined here
  regexec.c: In function 'S_regmatch':
  regexec.c:8249:37: warning: comparison between signed and unsigned integer expressions [-Wsign-compare]
  regexec.c:8272:34: warning: comparison between signed and unsigned integer expressions [-Wsign-compare]
  RealPPPort.xs: In function 'XS_Devel__PPPort_check_HeUTF8':
  RealPPPort.xs:1983:17: warning: value computed is not used [-Wunused-value]
  RealPPPort.c: In function 'XS_Devel__PPPort_isASCII_utf8_safe':
  RealPPPort.c:4932:6: warning: unused variable 'offset' [-Wunused-variable]
  RealPPPort.c: In function 'XS_Devel__PPPort_isASCII_LC_utf8_safe':
  RealPPPort.c:5638:6: warning: unused variable 'offset' [-Wunused-variable]
  Encode.c: In function 'XS_Encode_decode':
  Encode.c:1356:5: warning: unused variable 'ix' [-Wunused-variable]
  Encode.c: In function 'XS_Encode_encode':
  Encode.c:1398:5: warning: unused variable 'ix' [-Wunused-variable]
  Socket.c: In function 'XS_Socket_pack_ip_mreq_source':
  Socket.c:1673:7: warning: variable 'interface' set but not used [-Wunused-but-set-variable]
  ./const-xs.inc: In function 'boot_Socket':
  ./const-xs.inc:986:20: warning: missing braces around initializer [-Wmissing-braces]
  ./const-xs.inc:986:20: warning: (near initialization for 'ip6_address._s6_un') [-Wmissing-braces]
  ./const-xs.inc:995:20: warning: missing braces around initializer [-Wmissing-braces]
  ./const-xs.inc:995:20: warning: (near initialization for 'ip6_address._s6_un') [-Wmissing-braces]
  const-c.inc: In function 'constant_19':
  const-c.inc:351:42: warning: unused parameter 'iv_return' [-Wunused-parameter]
  re_exec.c: In function 'S_regmatch':
  re_exec.c:8249:37: warning: comparison between signed and unsigned integer expressions [-Wsign-compare]
  re_exec.c:8272:34: warning: comparison between signed and unsigned integer expressions [-Wsign-compare]
  re_exec.c: In function 'S_regtry':
  re_exec.c:6539:30: warning: 'fold_array' may be used uninitialized in this function [-Wuninitialized]
  re_exec.c:6443:17: note: 'fold_array' was declared here
  re_exec.c:6545:28: warning: 'folder' may be used uninitialized in this function [-Wuninitialized]
  re_exec.c:6442:16: note: 'folder' was declared here
  re_comp.c: In function 'S_regpiece':
  re_comp.c:12613:46: warning: comparison between signed and unsigned integer expressions [-Wsign-compare]
  op.c: In function 'S_pmtrans':
  regexec.c: In function 'S_regtry':
  regexec.c:6539:30: warning: 'fold_array' may be used uninitialized in this function [-Wuninitialized]
  regexec.c:6443:17: note: 'fold_array' was declared here
  regexec.c:6545:28: warning: 'folder' may be used uninitialized in this function [-Wuninitialized]
  regexec.c:6442:16: note: 'folder' was declared here
  pp_sys.c: In function 'Perl_pp_gpwent':
  pp_sys.c:5515:19: warning: implicit declaration of function 'getspnam_r' [-Wimplicit-function-declaration]
  shared.xs: In function 'sharedsv_scalar_store':
  shared.xs:830:13: warning: value computed is not used [-Wunused-value]

About this smoke:
    smoking-perl: 5.14.2
  smoker-version: 1.72_06/0.046
       timestamp: 2020-01-21 22:29:09+00
          tester: merijn

Status overview available here: https://tux.nl/perl5/smoke/
-- 
Report generated by Test::Smoke::Gateway v0.09_01