Show logfile
Automated smoke report for branch blead 5.31.6 patch 34924db0919c191e271602c82cb2de7784fc63a4 v5.31.5-373-g34924db
x1: Intel(R) Itanium 2 processor/1600 MHz (ia64/2 cpus)
    on        HP-UX B.11.23/64
    using     gcc version 4.6.1 (*1)
    smoketime 19 hours 3 minutes (average 2 hours 22 minutes)

Summary: FAIL(F)

O = OK  F = Failure(s), extended report at the bottom
X = Failure(s) under TEST but not under harness
? = still running or test results not (yet) available
Build failures during:       - = unknown or N/A
c = Configure, m = make, M = make (after miniperl), t = make test-prep

v5.31.5-373-g34924db
---------------------- ----------------------------------------------------
F  F  F  F  F  F        -Dcc=gcc (*1)
F  F  F  F  F  F        -Dcc=gcc -Duse64bitall (*1)
F  F  F  F  F  F        -Dcc=gcc -Duseithreads (*1)
F  F  F  F  F  F        -Dcc=gcc -Duseithreads -Duse64bitall (*1)
|  |  |  |  |  |
|  |  |  |  |  +------  locale:en_US.utf8 DEBUGGING
|  |  |  |  +---------  perlio DEBUGGING
|  |  |  +------------  stdio DEBUGGING
|  |  +---------------  locale:en_US.utf8
|  +------------------  perlio
+---------------------  stdio

Applied patches:
  SMOKE34924db0919c191e271602c82cb2de7784fc63a4

Skipped tests:
      lib/Test/Simple/t/utf8.t

Test failures:
~~ ../ext/XS-APItest/t/exception.t ............................. FAILED Bad plan.  You planned 12 tests but ran 5.
  [stdio/perlio/locale:en_US.utf8] -Dcc=gcc -Duseithreads -Duse64bitall DEBUGGING
  [stdio/perlio/locale:en_US.utf8] -Dcc=gcc -Duseithreads DEBUGGING
~~ ../t/re/pat.t ............................................... FAILED 964
  [locale:en_US.utf8] -Dcc=gcc
  [locale:en_US.utf8] -Dcc=gcc -Duse64bitall
  [locale:en_US.utf8] -Dcc=gcc -Duseithreads -Duse64bitall DEBUGGING
  [locale:en_US.utf8] -Dcc=gcc -Duseithreads DEBUGGING
  [locale:en_US.utf8] -Dcc=gcc -Duseithreads
  [locale:en_US.utf8] -Dcc=gcc DEBUGGING
  [locale:en_US.utf8] -Dcc=gcc -Duse64bitall DEBUGGING
  [locale:en_US.utf8] -Dcc=gcc -Duseithreads -Duse64bitall
~~ ../dist/Devel-PPPort/t/exception.t .......................... FAILED Bad plan.  You planned 7 tests but ran 4.
  [stdio/perlio/locale:en_US.utf8] -Dcc=gcc -Duseithreads -Duse64bitall DEBUGGING
  [stdio/perlio/locale:en_US.utf8] -Dcc=gcc -Duseithreads DEBUGGING
~~ ../ext/XS-APItest/t/subsignature.t .......................... FAILED 2 Non-zero exit status: 1
  [stdio/perlio/locale:en_US.utf8] -Dcc=gcc
  [stdio/perlio/locale:en_US.utf8] -Dcc=gcc -Duse64bitall
  [stdio/perlio/locale:en_US.utf8] -Dcc=gcc -Duseithreads -Duse64bitall DEBUGGING
  [stdio/perlio/locale:en_US.utf8] -Dcc=gcc -Duseithreads DEBUGGING
  [stdio/perlio/locale:en_US.utf8] -Dcc=gcc -Duseithreads
  [stdio/perlio/locale:en_US.utf8] -Dcc=gcc DEBUGGING
  [stdio/perlio/locale:en_US.utf8] -Dcc=gcc -Duse64bitall DEBUGGING
  [stdio/perlio/locale:en_US.utf8] -Dcc=gcc -Duseithreads -Duse64bitall
~~ ../t/re/pat_thr.t ........................................... FAILED 964
  [locale:en_US.utf8] -Dcc=gcc -Duseithreads
  [locale:en_US.utf8] -Dcc=gcc -Duseithreads -Duse64bitall DEBUGGING
  [locale:en_US.utf8] -Dcc=gcc -Duseithreads DEBUGGING
  [locale:en_US.utf8] -Dcc=gcc -Duseithreads -Duse64bitall
~~ ../cpan/Socket/t/Socket.t ................................... FAILED Non-zero exit status: 255 Bad plan.  You planned 6 tests but ran 2.
  [locale:en_US.utf8] -Dcc=gcc
  [locale:en_US.utf8] -Dcc=gcc -Duse64bitall
  [locale:en_US.utf8] -Dcc=gcc -Duseithreads -Duse64bitall DEBUGGING
  [locale:en_US.utf8] -Dcc=gcc -Duseithreads DEBUGGING
  [locale:en_US.utf8] -Dcc=gcc -Duseithreads
  [locale:en_US.utf8] -Dcc=gcc DEBUGGING
  [locale:en_US.utf8] -Dcc=gcc -Duse64bitall DEBUGGING
  [locale:en_US.utf8] -Dcc=gcc -Duseithreads -Duse64bitall

Test todo-passed:
~~ ../dist/Net-Ping/t/450_service.t ............................ PASSED 9 18
  [stdio/perlio/locale:en_US.utf8] -Dcc=gcc
  [stdio/perlio/locale:en_US.utf8] -Dcc=gcc -Duse64bitall
  [stdio/perlio/locale:en_US.utf8] -Dcc=gcc -Duseithreads -Duse64bitall DEBUGGING
  [stdio/perlio/locale:en_US.utf8] -Dcc=gcc -Duseithreads DEBUGGING
  [stdio/perlio/locale:en_US.utf8] -Dcc=gcc -Duseithreads
  [stdio/perlio/locale:en_US.utf8] -Dcc=gcc DEBUGGING
  [stdio/perlio/locale:en_US.utf8] -Dcc=gcc -Duse64bitall DEBUGGING
  [stdio/perlio/locale:en_US.utf8] -Dcc=gcc -Duseithreads -Duse64bitall

MANIFEST messages:

Compiler messages:
  op.c: In function 'Perl_ck_eval':
  op.c:12577:9: warning: value computed is not used [-Wunused-value]
  op.c: In function 'Perl_pmruntime':
  op.c:7275:15: warning: 't_cp' may be used uninitialized in this function [-Wuninitialized]
  op.c:6866:14: note: 't_cp' was declared here
  op.c:7312:28: warning: 'r_cp' may be used uninitialized in this function [-Wuninitialized]
  op.c:6866:8: note: 'r_cp' was declared here
  toke.c: In function 'Perl_scan_num':
  toke.c:11501:54: warning: 'b' may be used uninitialized in this function [-Wuninitialized]
  regcomp.c:16779:1: warning: 'static' is not at beginning of declaration [-Wold-style-declaration]
  regcomp.c:16779:1: warning: '__inline__' is not at beginning of declaration [-Wold-style-declaration]
  pp.c: In function 'Perl_pp_argelem':
  pp.c:7050:13: warning: value computed is not used [-Wunused-value]
  /usr/include/rpc/rpcb_prot.h:163:25: note: originally defined here
  bzlib.c: In function 'default_bzalloc':
  bzlib.c:102:31: warning: unused parameter 'opaque' [-Wunused-parameter]
  bzlib.c: In function 'default_bzfree':
  bzlib.c:109:29: warning: unused parameter 'opaque' [-Wunused-parameter]
  compress.c: In function 'sendMTFValues':
  compress.c:243:19: warning: variable 'nBytes' set but not used [-Wunused-but-set-variable]
  RealPPPort.xs: In function 'XS_Devel__PPPort_check_HeUTF8':
  RealPPPort.xs:1983:17: warning: value computed is not used [-Wunused-value]
  RealPPPort.c: In function 'XS_Devel__PPPort_isASCII_utf8_safe':
  RealPPPort.c:4932:6: warning: unused variable 'offset' [-Wunused-variable]
  RealPPPort.c: In function 'XS_Devel__PPPort_isASCII_LC_utf8_safe':
  RealPPPort.c:5638:6: warning: unused variable 'offset' [-Wunused-variable]
  Encode.c: In function 'XS_Encode_decode':
  Encode.c:1356:5: warning: unused variable 'ix' [-Wunused-variable]
  Encode.c: In function 'XS_Encode_encode':
  Encode.c:1398:5: warning: unused variable 'ix' [-Wunused-variable]
  Socket.c: In function 'XS_Socket_pack_ip_mreq_source':
  Socket.c:1673:7: warning: variable 'interface' set but not used [-Wunused-but-set-variable]
  ./const-xs.inc: In function 'boot_Socket':
  ./const-xs.inc:986:20: warning: missing braces around initializer [-Wmissing-braces]
  ./const-xs.inc:986:20: warning: (near initialization for 'ip6_address._s6_un') [-Wmissing-braces]
  ./const-xs.inc:995:20: warning: missing braces around initializer [-Wmissing-braces]
  ./const-xs.inc:995:20: warning: (near initialization for 'ip6_address._s6_un') [-Wmissing-braces]
  Storable.xs: In function 'get_regexp':
  Storable.xs:3440:7: warning: format '%d' expects argument of type 'int', but argument 2 has type 'I32' [-Wformat]
  Storable.xs: In function 'retrieve_regexp':
  Storable.xs:6854:9: warning: format '%d' expects argument of type 'int', but argument 2 has type 'I32' [-Wformat]
  const-c.inc: In function 'constant_19':
  const-c.inc:351:42: warning: unused parameter 'iv_return' [-Wunused-parameter]
  APItest.xs: In function 'THX_parse_keyword_subsignature':
  APItest.xs:1085:3: warning: format '%d' expects argument of type 'int', but argument 2 has type 'line_t' [-Wformat]
  re_exec.c: In function 'S_regtry':
  re_exec.c:6539:30: warning: 'fold_array' may be used uninitialized in this function [-Wuninitialized]
  re_exec.c:6443:17: note: 'fold_array' was declared here
  re_exec.c:6545:28: warning: 'folder' may be used uninitialized in this function [-Wuninitialized]
  re_exec.c:6442:16: note: 'folder' was declared here
  re_comp.c:16779:1: warning: 'static' is not at beginning of declaration [-Wold-style-declaration]
  re_comp.c:16779:1: warning: '__inline__' is not at beginning of declaration [-Wold-style-declaration]
  op.c: In function 'S_pmtrans':
  regexec.c: In function 'S_regtry':
  regexec.c:6539:30: warning: 'fold_array' may be used uninitialized in this function [-Wuninitialized]
  regexec.c:6443:17: note: 'fold_array' was declared here
  regexec.c:6545:28: warning: 'folder' may be used uninitialized in this function [-Wuninitialized]
  regexec.c:6442:16: note: 'folder' was declared here
  Storable.xs: In function 'store_hook':
  Storable.xs:4081:17: warning: format '%d' expects argument of type 'int', but argument 3 has type 'I32' [-Wformat]
  Storable.xs: In function 'store':
  Storable.xs:4456:6: warning: format '%d' expects argument of type 'int', but argument 3 has type 'I32' [-Wformat]
  shared.xs: In function 'sharedsv_scalar_store':
  shared.xs:830:13: warning: value computed is not used [-Wunused-value]

About this smoke:
    smoking-perl: 5.14.2
  smoker-version: 1.72_06/0.046
       timestamp: 2019-11-27 13:55:31+00
          tester: merijn

Status overview available here: https://tux.nl/perl5/smoke/
-- 
Report generated by Test::Smoke::Gateway v0.09_01