Show report
Skipping synctree
[2019-04-20 22:00:07METDST] Reading build configurations from /pro/3gl/CPAN/smoke/p59.cfg
[2019-04-20 22:00:07METDST] Reading 'Policy.sh' from ../Policy.sh (v=1)
[2019-04-20 22:00:07METDST] Running test suite only with 'harness'.
[2019-04-20 22:00:07METDST] make distclean ...
[2019-04-20 22:00:07METDST] Smoking patch 261e14b0fc345af01a05bb5c9d2093042f05018b v5.29.10-3-g261e14b0fc
[2019-04-20 22:00:07METDST] Smoking branch blead
[2019-04-20 22:00:08METDST] 
[2019-04-20 22:00:08METDST] Configuration: -Dusedevel
[2019-04-20 22:00:08METDST] ------------------------------------------------------------------------------
[2019-04-20 22:00:08METDST] make distclean ...
[2019-04-20 22:00:08METDST] 
[2019-04-20 22:00:08METDST] Copy Policy.sh ...
[2019-04-20 22:00:08METDST] 
[2019-04-20 22:00:08METDST] Configure ...
5.29.10 <=> 5.014002
===== PROCURA Policy for hpux/cc ========================
===== PROCURA Policy results ============================
cc:         cc
ccversion:  -
gccversion: -
ccflags:     +Z -z
optimize:   
ld:         
ldflags:    -L/pro/local/lib
libswanted: cl pthread cl pthread socket bind inet nsl ndbm gdbm dbm db malloc dl ld sun m crypt sec util c cposix posix ucb bsd BSD
libsdirs:    /lib /pro/local/lib
locincpth:  /pro/local/include
loclibpth:  /pro/local/lib
useshrplib: 
===== PROCURA Policy done ===============================
[2019-04-20 22:01:59METDST] 
[2019-04-20 22:01:59METDST] make ...
mysterious name [ENTER_with_name(name)] in parts/apidoc.fnc, line 161
mysterious name [LEAVE_with_name(name)] in parts/apidoc.fnc, line 164
parts/inc/misc provides av_tindex, which is still marked todo for 5.17.9
parts/inc/misc provides av_top_index, which is still marked todo for 5.17.9
parts/inc/misc provides isALPHANUMERIC, which is still marked todo for 5.17.8
parts/inc/misc provides isIDCONT, which is still marked todo for 5.17.8
parts/inc/misc provides isOCTAL, which is still marked todo for 5.13.5
parts/inc/misc provides isWORDCHAR, which is still marked todo for 5.13.6
parts/inc/uv provides utf8_to_uvchr_buf, which is still marked todo for 5.15.9
parts/inc/mess provides vmess, which is still marked todo for 5.6.0
mysterious name [ENTER_with_name(name)] in parts/apidoc.fnc, line 161
mysterious name [LEAVE_with_name(name)] in parts/apidoc.fnc, line 164
parts/inc/misc provides av_tindex, which is still marked todo for 5.17.9
parts/inc/misc provides av_top_index, which is still marked todo for 5.17.9
parts/inc/misc provides isALPHANUMERIC, which is still marked todo for 5.17.8
parts/inc/misc provides isIDCONT, which is still marked todo for 5.17.8
parts/inc/misc provides isOCTAL, which is still marked todo for 5.13.5
parts/inc/misc provides isWORDCHAR, which is still marked todo for 5.13.6
parts/inc/uv provides utf8_to_uvchr_buf, which is still marked todo for 5.15.9
parts/inc/mess provides vmess, which is still marked todo for 5.6.0
Warning (mostly harmless): No library found for -lposix
Warning (mostly harmless): No library found for -lcposix
cc: warning 457: The Onolimit option is not valid at this optimization level.
Making header files for XS...
[2019-04-20 22:18:10METDST] Skip tests from '/pro/3gl/CPAN/smoke/p59.skip'
[2019-04-20 22:18:10METDST] 
[2019-04-20 22:18:10METDST]  Tests start here:
[2019-04-20 22:18:10METDST] TSTENV = stdio	
No saved state, selection will be empty
Cannot figure out an encoding to use at t/use-Encode-Alias.t line 5.
# parser guessed wrong encoding expected 'CP1252' got 'UTF-8'
# Connected to 127.0.0.1
# Connected to 127.0.0.1
Integer overflow in hexadecimal number at t/broken_univ_can.t line 7.
Redefining sub xChild::foo at xChild--27651 line 2.
Redefining sub Data::ok at -e line 1.
c++: error: +Z: No such file or directory
c++: error: +O2: No such file or directory
c++: error: +Onolimit: No such file or directory
# Will use Digest::MD5
PROG: 
use warnings 'syntax';
@foo::bar = 1..3;
() = "$foo'bar";
() = "@foo'bar";
() = "$#foo'bar";
no warnings 'syntax' ;
() = "$foo'bar";
() = "@foo'bar";
() = "$#foo'bar";
EXPECTED:
Old package separator used in string at - line 3.
	(Did you mean "$foo\'bar" instead?)
Old package separator used in string at - line 4.
	(Did you mean "@foo\'bar" instead?)
Old package separator used in string at - line 5.
	(Did you mean "$#foo\'bar" instead?)
GOT:

# Failed test 771 - at lib/warnings/toke line 418
PROG: 
use warnings 'syntax'; use utf8;
@fooл::barл = 1..3;
() = "$fooл'barл";
() = "@fooл'barл";
() = "$#fooл'barл";
no warnings 'syntax' ;
() = "$fooл'barл";
() = "@fooл'barл";
() = "$#fooл'barл";
EXPECTED:
Old package separator used in string at - line 3.
	(Did you mean "$fooл\'barл" instead?)
Old package separator used in string at - line 4.
	(Did you mean "@fooл\'barл" instead?)
Old package separator used in string at - line 5.
	(Did you mean "$#fooл\'barл" instead?)
GOT:

# Failed test 772 - at lib/warnings/toke line 435
make: *** [test_harness] Error 5

error while running harness target 'test_harness': 2 at /pro/3gl/CPAN/smoke/lib/Test/Smoke.pm line 194.
[2019-04-20 23:46:00METDST] 
[2019-04-20 23:46:00METDST] ../dist/Net-Ping/t/450_service.t............................PASSED
[2019-04-20 23:46:00METDST]     9, 18
[2019-04-20 23:46:00METDST] ../lib/locale.t.............................................FAILED
[2019-04-20 23:46:00METDST]     431-432, 498
[2019-04-20 23:46:00METDST] ../lib/warnings.t...........................................FAILED
[2019-04-20 23:46:00METDST]     771-772
[2019-04-20 23:46:00METDST] Archived results...
[2019-04-20 23:46:00METDST] TSTENV = perlio	
# Failed test 2 -    right time (waited 5 secs for 3-sec alarm) at op/alarm.t line 34
PROG: 
use warnings 'syntax';
@foo::bar = 1..3;
() = "$foo'bar";
() = "@foo'bar";
() = "$#foo'bar";
no warnings 'syntax' ;
() = "$foo'bar";
() = "@foo'bar";
() = "$#foo'bar";
EXPECTED:
Old package separator used in string at - line 3.
	(Did you mean "$foo\'bar" instead?)
Old package separator used in string at - line 4.
	(Did you mean "@foo\'bar" instead?)
Old package separator used in string at - line 5.
	(Did you mean "$#foo\'bar" instead?)
GOT:

# Failed test 771 - at lib/warnings/toke line 418
PROG: 
use warnings 'syntax'; use utf8;
@fooл::barл = 1..3;
() = "$fooл'barл";
() = "@fooл'barл";
() = "$#fooл'barл";
no warnings 'syntax' ;
() = "$fooл'barл";
() = "@fooл'barл";
() = "$#fooл'barл";
EXPECTED:
Old package separator used in string at - line 3.
	(Did you mean "$fooл\'barл" instead?)
Old package separator used in string at - line 4.
	(Did you mean "@fooл\'barл" instead?)
Old package separator used in string at - line 5.
	(Did you mean "$#fooл\'barл" instead?)
GOT:

# Failed test 772 - at lib/warnings/toke line 435
# parser guessed wrong encoding expected 'CP1252' got 'UTF-8'
c++: error: +Z: No such file or directory
c++: error: +O2: No such file or directory
c++: error: +Onolimit: No such file or directory
# Will use Digest::MD5
# Connected to 127.0.0.1
# Connected to 127.0.0.1
Cannot figure out an encoding to use at t/use-Encode-Alias.t line 5.
Integer overflow in hexadecimal number at t/broken_univ_can.t line 7.
make: *** [test_harness] Error 6

error while running harness target 'test_harness': 2 at /pro/3gl/CPAN/smoke/lib/Test/Smoke.pm line 194.
[2019-04-21 00:59:14METDST] 
[2019-04-21 00:59:14METDST] ../t/op/alarm.t.............................................FAILED
[2019-04-21 00:59:14METDST]     2
[2019-04-21 00:59:14METDST] ../lib/warnings.t...........................................FAILED
[2019-04-21 00:59:14METDST]     771-772
[2019-04-21 00:59:14METDST] ../lib/locale.t.............................................FAILED
[2019-04-21 00:59:14METDST]     431-432, 498
[2019-04-21 00:59:14METDST] ../dist/Net-Ping/t/450_service.t............................PASSED
[2019-04-21 00:59:14METDST]     9, 18
[2019-04-21 00:59:14METDST] Archived results...
[2019-04-21 00:59:14METDST] TSTENV = locale:univ.utf8	
PROG: 
use warnings 'syntax';
@foo::bar = 1..3;
() = "$foo'bar";
() = "@foo'bar";
() = "$#foo'bar";
no warnings 'syntax' ;
() = "$foo'bar";
() = "@foo'bar";
() = "$#foo'bar";
EXPECTED:
Old package separator used in string at - line 3.
	(Did you mean "$foo\'bar" instead?)
Old package separator used in string at - line 4.
	(Did you mean "@foo\'bar" instead?)
Old package separator used in string at - line 5.
	(Did you mean "$#foo\'bar" instead?)
GOT:

# Failed test 771 - at lib/warnings/toke line 418
PROG: 
use warnings 'syntax'; use utf8;
@fooл::barл = 1..3;
() = "$fooл'barл";
() = "@fooл'barл";
() = "$#fooл'barл";
no warnings 'syntax' ;
() = "$fooл'barл";
() = "@fooл'barл";
() = "$#fooл'barл";
EXPECTED:
Old package separator used in string at - line 3.
	(Did you mean "$fooл\'barл" instead?)
Old package separator used in string at - line 4.
	(Did you mean "@fooл\'barл" instead?)
Old package separator used in string at - line 5.
	(Did you mean "$#fooл\'barл" instead?)
GOT:

# Failed test 772 - at lib/warnings/toke line 435
# parser guessed wrong encoding expected 'CP1252' got 'UTF-8'
c++: error: +Z: No such file or directory
c++: error: +O2: No such file or directory
c++: error: +Onolimit: No such file or directory
Locale 'univ.utf8' contains (at least) the following characters which have
unexpected meanings: $ + < = > ^ ` | ~
The Perl program will use the expected meanings; codeset=utf8
Locale 'univ.utf8' contains (at least) the following characters which have
unexpected meanings: $ + < = > ^ ` | ~
The Perl program will use the expected meanings; codeset=utf8
Locale 'univ.utf8' contains (at least) the following characters which have
unexpected meanings: $ + < = > ^ ` | ~
The Perl program will use the expected meanings; codeset=utf8
Locale 'univ.utf8' contains (at least) the following characters which have
unexpected meanings: $ + < = > ^ ` | ~
The Perl program will use the expected meanings; codeset=utf8
Locale 'univ.utf8' contains (at least) the following characters which have
unexpected meanings: $ + < = > ^ ` | ~
The Perl program will use the expected meanings; codeset=utf8
Locale 'univ.utf8' contains (at least) the following characters which have
unexpected meanings: $ + < = > ^ ` | ~
The Perl program will use the expected meanings; codeset=utf8
Locale 'univ.utf8' contains (at least) the following characters which have
unexpected meanings: $ + < = > ^ ` | ~
The Perl program will use the expected meanings; codeset=utf8
Locale 'univ.utf8' contains (at least) the following characters which have
unexpected meanings: $ + < = > ^ ` | ~
The Perl program will use the expected meanings; codeset=utf8
Locale 'univ.utf8' contains (at least) the following characters which have
unexpected meanings: $ + < = > ^ ` | ~
The Perl program will use the expected meanings; codeset=utf8
Locale 'univ.utf8' contains (at least) the following characters which have
unexpected meanings: $ + < = > ^ ` | ~
The Perl program will use the expected meanings; codeset=utf8
Locale 'univ.utf8' contains (at least) the following characters which have
unexpected meanings: $ + < = > ^ ` | ~
The Perl program will use the expected meanings; codeset=utf8
Locale 'univ.utf8' contains (at least) the following characters which have
unexpected meanings: $ + < = > ^ ` | ~
The Perl program will use the expected meanings; codeset=utf8
Locale 'univ.utf8' contains (at least) the following characters which have
unexpected meanings: $ + < = > ^ ` | ~
The Perl program will use the expected meanings; codeset=utf8
Locale 'univ.utf8' contains (at least) the following characters which have
unexpected meanings: $ + < = > ^ ` | ~
The Perl program will use the expected meanings; codeset=utf8
Locale 'univ.utf8' contains (at least) the following characters which have
unexpected meanings: $ + < = > ^ ` | ~
The Perl program will use the expected meanings; codeset=utf8
Integer overflow in hexadecimal number at t/broken_univ_can.t line 7.
# Will use Digest::MD5
# Connected to 127.0.0.1
syswrite() isn't allowed on :utf8 handles at t/Socket.t line 47.
# Looks like your test exited with 255 just after 2.
make: *** [test_harness] Error 5

error while running harness target 'test_harness': 2 at /pro/3gl/CPAN/smoke/lib/Test/Smoke.pm line 194.
[2019-04-21 02:13:57METDST] 
[2019-04-21 02:13:57METDST] ../lib/warnings.t...........................................FAILED
[2019-04-21 02:13:57METDST]     771-772
[2019-04-21 02:13:57METDST] ../lib/locale.t.............................................FAILED
[2019-04-21 02:13:57METDST]     431-432, 498
[2019-04-21 02:13:57METDST] ../lib/B/Deparse.t..........................................PASSED
[2019-04-21 02:13:57METDST]     2
[2019-04-21 02:13:57METDST] ../dist/Net-Ping/t/450_service.t............................PASSED
[2019-04-21 02:13:57METDST]     9, 18
[2019-04-21 02:13:57METDST] ../cpan/Socket/t/Socket.t...................................FAILED
[2019-04-21 02:13:57METDST]     Non-zero exit status: 255
[2019-04-21 02:13:57METDST] ../cpan/Socket/t/Socket.t...................................FAILED
[2019-04-21 02:13:57METDST]     Bad plan.  You planned 6 tests but ran 2.
[2019-04-21 02:13:57METDST] Archived results...
[2019-04-21 02:13:57METDST] Unskip tests from '/pro/3gl/CPAN/smoke/p59.skip'
[2019-04-21 02:13:57METDST] 
[2019-04-21 02:13:57METDST] Configuration: -Dusedevel -DDEBUGGING
[2019-04-21 02:13:57METDST] ------------------------------------------------------------------------------
[2019-04-21 02:13:57METDST] make distclean ...
[2019-04-21 02:15:23METDST] 
[2019-04-21 02:15:23METDST] Copy Policy.sh ...
[2019-04-21 02:15:23METDST] 
[2019-04-21 02:15:23METDST] Configure ...
5.29.10 <=> 5.014002
===== PROCURA Policy for hpux/cc ========================
===== PROCURA Policy results ============================
cc:         cc
ccversion:  -
gccversion: -
ccflags:    -DDEBUGGING +Z -z
optimize:   
ld:         
ldflags:    -L/pro/local/lib
libswanted: cl pthread cl pthread socket bind inet nsl ndbm gdbm dbm db malloc dl ld sun m crypt sec util c cposix posix ucb bsd BSD
libsdirs:    /lib /pro/local/lib
locincpth:  /pro/local/include
loclibpth:  /pro/local/lib
useshrplib: 
===== PROCURA Policy done ===============================
[2019-04-21 02:17:22METDST] 
[2019-04-21 02:17:22METDST] make ...
mysterious name [ENTER_with_name(name)] in parts/apidoc.fnc, line 161
mysterious name [LEAVE_with_name(name)] in parts/apidoc.fnc, line 164
parts/inc/misc provides av_tindex, which is still marked todo for 5.17.9
parts/inc/misc provides av_top_index, which is still marked todo for 5.17.9
parts/inc/misc provides isALPHANUMERIC, which is still marked todo for 5.17.8
parts/inc/misc provides isIDCONT, which is still marked todo for 5.17.8
parts/inc/misc provides isOCTAL, which is still marked todo for 5.13.5
parts/inc/misc provides isWORDCHAR, which is still marked todo for 5.13.6
parts/inc/uv provides utf8_to_uvchr_buf, which is still marked todo for 5.15.9
parts/inc/mess provides vmess, which is still marked todo for 5.6.0
mysterious name [ENTER_with_name(name)] in parts/apidoc.fnc, line 161
mysterious name [LEAVE_with_name(name)] in parts/apidoc.fnc, line 164
parts/inc/misc provides av_tindex, which is still marked todo for 5.17.9
parts/inc/misc provides av_top_index, which is still marked todo for 5.17.9
parts/inc/misc provides isALPHANUMERIC, which is still marked todo for 5.17.8
parts/inc/misc provides isIDCONT, which is still marked todo for 5.17.8
parts/inc/misc provides isOCTAL, which is still marked todo for 5.13.5
parts/inc/misc provides isWORDCHAR, which is still marked todo for 5.13.6
parts/inc/uv provides utf8_to_uvchr_buf, which is still marked todo for 5.15.9
parts/inc/mess provides vmess, which is still marked todo for 5.6.0
Warning (mostly harmless): No library found for -lposix
Warning (mostly harmless): No library found for -lcposix
Making header files for XS...
[2019-04-21 02:44:34METDST] Skip tests from '/pro/3gl/CPAN/smoke/p59.skip'
[2019-04-21 02:44:34METDST] 
[2019-04-21 02:44:34METDST]  Tests start here:
[2019-04-21 02:44:34METDST] TSTENV = stdio	
No saved state, selection will be empty
Cannot figure out an encoding to use at t/use-Encode-Alias.t line 5.
# parser guessed wrong encoding expected 'CP1252' got 'UTF-8'
# Connected to 127.0.0.1
# Connected to 127.0.0.1
Integer overflow in hexadecimal number at t/broken_univ_can.t line 7.
Redefining sub xChild::foo at xChild--12294 line 2.
Redefining sub Data::ok at -e line 1.
c++: error: +Z: No such file or directory
# Will use Digest::MD5
PROG: 
use warnings 'syntax';
@foo::bar = 1..3;
() = "$foo'bar";
() = "@foo'bar";
() = "$#foo'bar";
no warnings 'syntax' ;
() = "$foo'bar";
() = "@foo'bar";
() = "$#foo'bar";
EXPECTED:
Old package separator used in string at - line 3.
	(Did you mean "$foo\'bar" instead?)
Old package separator used in string at - line 4.
	(Did you mean "@foo\'bar" instead?)
Old package separator used in string at - line 5.
	(Did you mean "$#foo\'bar" instead?)
GOT:

# Failed test 771 - at lib/warnings/toke line 418
PROG: 
use warnings 'syntax'; use utf8;
@fooл::barл = 1..3;
() = "$fooл'barл";
() = "@fooл'barл";
() = "$#fooл'barл";
no warnings 'syntax' ;
() = "$fooл'barл";
() = "@fooл'barл";
() = "$#fooл'barл";
EXPECTED:
Old package separator used in string at - line 3.
	(Did you mean "$fooл\'barл" instead?)
Old package separator used in string at - line 4.
	(Did you mean "@fooл\'barл" instead?)
Old package separator used in string at - line 5.
	(Did you mean "$#fooл\'barл" instead?)
GOT:

# Failed test 772 - at lib/warnings/toke line 435
make: *** [test_harness] Error 5

error while running harness target 'test_harness': 2 at /pro/3gl/CPAN/smoke/lib/Test/Smoke.pm line 194.
[2019-04-21 05:25:21METDST] 
[2019-04-21 05:25:21METDST] ../dist/Net-Ping/t/450_service.t............................PASSED
[2019-04-21 05:25:21METDST]     9, 18
[2019-04-21 05:25:21METDST] ../lib/locale.t.............................................FAILED
[2019-04-21 05:25:21METDST]     431-432, 498
[2019-04-21 05:25:21METDST] ../lib/warnings.t...........................................FAILED
[2019-04-21 05:25:21METDST]     771-772
[2019-04-21 05:25:21METDST] Archived results...
[2019-04-21 05:25:21METDST] TSTENV = perlio	
# Test process timed out - terminating
# parser guessed wrong encoding expected 'CP1252' got 'UTF-8'
PROG: 
use warnings 'syntax';
@foo::bar = 1..3;
() = "$foo'bar";
() = "@foo'bar";
() = "$#foo'bar";
no warnings 'syntax' ;
() = "$foo'bar";
() = "@foo'bar";
() = "$#foo'bar";
EXPECTED:
Old package separator used in string at - line 3.
	(Did you mean "$foo\'bar" instead?)
Old package separator used in string at - line 4.
	(Did you mean "@foo\'bar" instead?)
Old package separator used in string at - line 5.
	(Did you mean "$#foo\'bar" instead?)
GOT:

# Failed test 771 - at lib/warnings/toke line 418
PROG: 
use warnings 'syntax'; use utf8;
@fooл::barл = 1..3;
() = "$fooл'barл";
() = "@fooл'barл";
() = "$#fooл'barл";
no warnings 'syntax' ;
() = "$fooл'barл";
() = "@fooл'barл";
() = "$#fooл'barл";
EXPECTED:
Old package separator used in string at - line 3.
	(Did you mean "$fooл\'barл" instead?)
Old package separator used in string at - line 4.
	(Did you mean "@fooл\'barл" instead?)
Old package separator used in string at - line 5.
	(Did you mean "$#fooл\'barл" instead?)
GOT:

# Failed test 772 - at lib/warnings/toke line 435
c++: error: +Z: No such file or directory
# Will use Digest::MD5
# Connected to 127.0.0.1
# Connected to 127.0.0.1
Cannot figure out an encoding to use at t/use-Encode-Alias.t line 5.
Integer overflow in hexadecimal number at t/broken_univ_can.t line 7.
make: *** [test_harness] Error 5

error while running harness target 'test_harness': 2 at /pro/3gl/CPAN/smoke/lib/Test/Smoke.pm line 194.
[2019-04-21 07:46:40METDST] 
[2019-04-21 07:46:40METDST] ../t/re/fold_grind_8.t......................................FAILED
[2019-04-21 07:46:40METDST]     No plan found in TAP output
[2019-04-21 07:46:40METDST] ../lib/warnings.t...........................................FAILED
[2019-04-21 07:46:40METDST]     771-772
[2019-04-21 07:46:40METDST] ../lib/locale.t.............................................FAILED
[2019-04-21 07:46:40METDST]     431-432, 498
[2019-04-21 07:46:40METDST] ../dist/Net-Ping/t/450_service.t............................PASSED
[2019-04-21 07:46:40METDST]     9, 18
[2019-04-21 07:46:40METDST] Archived results...
[2019-04-21 07:46:40METDST] TSTENV = locale:univ.utf8	
PROG: 
use warnings 'syntax';
@foo::bar = 1..3;
() = "$foo'bar";
() = "@foo'bar";
() = "$#foo'bar";
no warnings 'syntax' ;
() = "$foo'bar";
() = "@foo'bar";
() = "$#foo'bar";
EXPECTED:
Old package separator used in string at - line 3.
	(Did you mean "$foo\'bar" instead?)
Old package separator used in string at - line 4.
	(Did you mean "@foo\'bar" instead?)
Old package separator used in string at - line 5.
	(Did you mean "$#foo\'bar" instead?)
GOT:

# Failed test 771 - at lib/warnings/toke line 418
PROG: 
use warnings 'syntax'; use utf8;
@fooл::barл = 1..3;
() = "$fooл'barл";
() = "@fooл'barл";
() = "$#fooл'barл";
no warnings 'syntax' ;
() = "$fooл'barл";
() = "@fooл'barл";
() = "$#fooл'barл";
EXPECTED:
Old package separator used in string at - line 3.
	(Did you mean "$fooл\'barл" instead?)
Old package separator used in string at - line 4.
	(Did you mean "@fooл\'barл" instead?)
Old package separator used in string at - line 5.
	(Did you mean "$#fooл\'barл" instead?)
GOT:

# Failed test 772 - at lib/warnings/toke line 435
# parser guessed wrong encoding expected 'CP1252' got 'UTF-8'
c++: error: +Z: No such file or directory
Locale 'univ.utf8' contains (at least) the following characters which have
unexpected meanings: $ + < = > ^ ` | ~
The Perl program will use the expected meanings; codeset=utf8
Locale 'univ.utf8' contains (at least) the following characters which have
unexpected meanings: $ + < = > ^ ` | ~
The Perl program will use the expected meanings; codeset=utf8
Locale 'univ.utf8' contains (at least) the following characters which have
unexpected meanings: $ + < = > ^ ` | ~
The Perl program will use the expected meanings; codeset=utf8
Locale 'univ.utf8' contains (at least) the following characters which have
unexpected meanings: $ + < = > ^ ` | ~
The Perl program will use the expected meanings; codeset=utf8
Locale 'univ.utf8' contains (at least) the following characters which have
unexpected meanings: $ + < = > ^ ` | ~
The Perl program will use the expected meanings; codeset=utf8
Locale 'univ.utf8' contains (at least) the following characters which have
unexpected meanings: $ + < = > ^ ` | ~
The Perl program will use the expected meanings; codeset=utf8
Locale 'univ.utf8' contains (at least) the following characters which have
unexpected meanings: $ + < = > ^ ` | ~
The Perl program will use the expected meanings; codeset=utf8
Locale 'univ.utf8' contains (at least) the following characters which have
unexpected meanings: $ + < = > ^ ` | ~
The Perl program will use the expected meanings; codeset=utf8
Locale 'univ.utf8' contains (at least) the following characters which have
unexpected meanings: $ + < = > ^ ` | ~
The Perl program will use the expected meanings; codeset=utf8
Locale 'univ.utf8' contains (at least) the following characters which have
unexpected meanings: $ + < = > ^ ` | ~
The Perl program will use the expected meanings; codeset=utf8
Locale 'univ.utf8' contains (at least) the following characters which have
unexpected meanings: $ + < = > ^ ` | ~
The Perl program will use the expected meanings; codeset=utf8
Locale 'univ.utf8' contains (at least) the following characters which have
unexpected meanings: $ + < = > ^ ` | ~
The Perl program will use the expected meanings; codeset=utf8
Locale 'univ.utf8' contains (at least) the following characters which have
unexpected meanings: $ + < = > ^ ` | ~
The Perl program will use the expected meanings; codeset=utf8
Locale 'univ.utf8' contains (at least) the following characters which have
unexpected meanings: $ + < = > ^ ` | ~
The Perl program will use the expected meanings; codeset=utf8
Locale 'univ.utf8' contains (at least) the following characters which have
unexpected meanings: $ + < = > ^ ` | ~
The Perl program will use the expected meanings; codeset=utf8
# Connected to 127.0.0.1
syswrite() isn't allowed on :utf8 handles at t/Socket.t line 47.
# Looks like your test exited with 255 just after 2.
# Will use Digest::MD5
Integer overflow in hexadecimal number at t/broken_univ_can.t line 7.
make: *** [test_harness] Error 5

error while running harness target 'test_harness': 2 at /pro/3gl/CPAN/smoke/lib/Test/Smoke.pm line 194.
[2019-04-21 10:10:32METDST] 
[2019-04-21 10:10:32METDST] ../lib/locale.t.............................................FAILED
[2019-04-21 10:10:32METDST]     431-432, 498
[2019-04-21 10:10:32METDST] ../lib/warnings.t...........................................FAILED
[2019-04-21 10:10:32METDST]     771-772
[2019-04-21 10:10:32METDST] ../lib/B/Deparse.t..........................................PASSED
[2019-04-21 10:10:32METDST]     2
[2019-04-21 10:10:32METDST] ../dist/Net-Ping/t/450_service.t............................PASSED
[2019-04-21 10:10:32METDST]     9, 18
[2019-04-21 10:10:32METDST] ../cpan/Socket/t/Socket.t...................................FAILED
[2019-04-21 10:10:32METDST]     Non-zero exit status: 255
[2019-04-21 10:10:32METDST] ../cpan/Socket/t/Socket.t...................................FAILED
[2019-04-21 10:10:32METDST]     Bad plan.  You planned 6 tests but ran 2.
[2019-04-21 10:10:32METDST] Archived results...
[2019-04-21 10:10:32METDST] Unskip tests from '/pro/3gl/CPAN/smoke/p59.skip'
[2019-04-21 10:10:32METDST] 
[2019-04-21 10:10:32METDST] Configuration: -Dusedevel -Duse64bitall
[2019-04-21 10:10:32METDST] ------------------------------------------------------------------------------
[2019-04-21 10:10:32METDST] make distclean ...
[2019-04-21 10:12:48METDST] 
[2019-04-21 10:12:48METDST] Copy Policy.sh ...
[2019-04-21 10:12:48METDST] 
[2019-04-21 10:12:48METDST] Configure ...
5.29.10 <=> 5.014002
===== PROCURA Policy for hpux/cc ========================
===== PROCURA Policy results ============================
cc:         cc
ccversion:  -
gccversion: -
ccflags:     +Z -z
optimize:   
ld:         
ldflags:    -L/pro/local/lib
libswanted: cl pthread cl pthread socket bind inet nsl ndbm gdbm dbm db malloc dl ld sun m crypt sec util c cposix posix ucb bsd BSD
libsdirs:    /lib /pro/local/lib
locincpth:  /pro/local/include
loclibpth:  /pro/local/lib
useshrplib: 
===== PROCURA Policy done ===============================
[2019-04-21 10:14:49METDST] 
[2019-04-21 10:14:49METDST] make ...
mysterious name [ENTER_with_name(name)] in parts/apidoc.fnc, line 161
mysterious name [LEAVE_with_name(name)] in parts/apidoc.fnc, line 164
parts/inc/misc provides av_tindex, which is still marked todo for 5.17.9
parts/inc/misc provides av_top_index, which is still marked todo for 5.17.9
parts/inc/misc provides isALPHANUMERIC, which is still marked todo for 5.17.8
parts/inc/misc provides isIDCONT, which is still marked todo for 5.17.8
parts/inc/misc provides isOCTAL, which is still marked todo for 5.13.5
parts/inc/misc provides isWORDCHAR, which is still marked todo for 5.13.6
parts/inc/uv provides utf8_to_uvchr_buf, which is still marked todo for 5.15.9
parts/inc/mess provides vmess, which is still marked todo for 5.6.0
mysterious name [ENTER_with_name(name)] in parts/apidoc.fnc, line 161
mysterious name [LEAVE_with_name(name)] in parts/apidoc.fnc, line 164
parts/inc/misc provides av_tindex, which is still marked todo for 5.17.9
parts/inc/misc provides av_top_index, which is still marked todo for 5.17.9
parts/inc/misc provides isALPHANUMERIC, which is still marked todo for 5.17.8
parts/inc/misc provides isIDCONT, which is still marked todo for 5.17.8
parts/inc/misc provides isOCTAL, which is still marked todo for 5.13.5
parts/inc/misc provides isWORDCHAR, which is still marked todo for 5.13.6
parts/inc/uv provides utf8_to_uvchr_buf, which is still marked todo for 5.15.9
parts/inc/mess provides vmess, which is still marked todo for 5.6.0
Warning (mostly harmless): No library found for -lposix
Warning (mostly harmless): No library found for -lcposix
cc: warning 457: The Onolimit option is not valid at this optimization level.
Making header files for XS...
[2019-04-21 10:32:21METDST] Skip tests from '/pro/3gl/CPAN/smoke/p59.skip'
[2019-04-21 10:32:21METDST] 
[2019-04-21 10:32:21METDST]  Tests start here:
[2019-04-21 10:32:21METDST] TSTENV = stdio	
No saved state, selection will be empty
Cannot figure out an encoding to use at t/use-Encode-Alias.t line 5.
# parser guessed wrong encoding expected 'CP1252' got 'UTF-8'
# Connected to 127.0.0.1
# Connected to 127.0.0.1
Redefining sub xChild::foo at xChild--711 line 2.
Redefining sub Data::ok at -e line 1.
c++: error: +Z: No such file or directory
c++: error: +O2: No such file or directory
c++: error: +Onolimit: No such file or directory
# Will use Digest::MD5
PROG: 
use warnings 'uninitialized';

# aelem + const
use constant foo => \0;
$SIG{__WARN__} = sub {
 print STDERR
   $_[0] =~ /\$a\[([^]]+)]/ && $1 == foo
       ? "ok\n"
       : ("$1 != ",0+foo,"\n")
};
() = "$a[foo]";
undef $SIG{__WARN__};

# Multideref
() = "$a[140688675223280]";
EXPECTED:
ok
Use of uninitialized value $a[140688675223280] in string at - line 15.
GOT:
-9223372032559500856 != 9223372041150050760
Use of uninitialized value $a[140688675223280] in string at - line 15.
# Failed test 366 - 64-bit array subscripts at lib/warnings/9uninit line 2175
PROG: 
use warnings 'syntax';
@foo::bar = 1..3;
() = "$foo'bar";
() = "@foo'bar";
() = "$#foo'bar";
no warnings 'syntax' ;
() = "$foo'bar";
() = "@foo'bar";
() = "$#foo'bar";
EXPECTED:
Old package separator used in string at - line 3.
	(Did you mean "$foo\'bar" instead?)
Old package separator used in string at - line 4.
	(Did you mean "@foo\'bar" instead?)
Old package separator used in string at - line 5.
	(Did you mean "$#foo\'bar" instead?)
GOT:

# Failed test 771 - at lib/warnings/toke line 418
PROG: 
use warnings 'syntax'; use utf8;
@fooл::barл = 1..3;
() = "$fooл'barл";
() = "@fooл'barл";
() = "$#fooл'barл";
no warnings 'syntax' ;
() = "$fooл'barл";
() = "@fooл'barл";
() = "$#fooл'barл";
EXPECTED:
Old package separator used in string at - line 3.
	(Did you mean "$fooл\'barл" instead?)
Old package separator used in string at - line 4.
	(Did you mean "@fooл\'barл" instead?)
Old package separator used in string at - line 5.
	(Did you mean "$#fooл\'barл" instead?)
GOT:

# Failed test 772 - at lib/warnings/toke line 435
make: *** [test_harness] Error 6

error while running harness target 'test_harness': 2 at /pro/3gl/CPAN/smoke/lib/Test/Smoke.pm line 194.
[2019-04-21 12:04:55METDST] 
[2019-04-21 12:04:55METDST] ../dist/Net-Ping/t/450_service.t............................PASSED
[2019-04-21 12:04:55METDST]     9, 18
[2019-04-21 12:04:55METDST] ../lib/locale.t.............................................FAILED
[2019-04-21 12:04:55METDST]     431-432, 498
[2019-04-21 12:04:55METDST] ../lib/warnings.t...........................................FAILED
[2019-04-21 12:04:55METDST]     366, 771-772
[2019-04-21 12:04:55METDST] Archived results...
[2019-04-21 12:04:55METDST] TSTENV = perlio	
PROG: 
use warnings 'uninitialized';

# aelem + const
use constant foo => \0;
$SIG{__WARN__} = sub {
 print STDERR
   $_[0] =~ /\$a\[([^]]+)]/ && $1 == foo
       ? "ok\n"
       : ("$1 != ",0+foo,"\n")
};
() = "$a[foo]";
undef $SIG{__WARN__};

# Multideref
() = "$a[140688675223280]";
EXPECTED:
ok
Use of uninitialized value $a[140688675223280] in string at - line 15.
GOT:
-9223372032559500408 != 9223372041150051208
Use of uninitialized value $a[140688675223280] in string at - line 15.
# Failed test 366 - 64-bit array subscripts at lib/warnings/9uninit line 2175
PROG: 
use warnings 'syntax';
@foo::bar = 1..3;
() = "$foo'bar";
() = "@foo'bar";
() = "$#foo'bar";
no warnings 'syntax' ;
() = "$foo'bar";
() = "@foo'bar";
() = "$#foo'bar";
EXPECTED:
Old package separator used in string at - line 3.
	(Did you mean "$foo\'bar" instead?)
Old package separator used in string at - line 4.
	(Did you mean "@foo\'bar" instead?)
Old package separator used in string at - line 5.
	(Did you mean "$#foo\'bar" instead?)
GOT:

# Failed test 771 - at lib/warnings/toke line 418
PROG: 
use warnings 'syntax'; use utf8;
@fooл::barл = 1..3;
() = "$fooл'barл";
() = "@fooл'barл";
() = "$#fooл'barл";
no warnings 'syntax' ;
() = "$fooл'barл";
() = "@fooл'barл";
() = "$#fooл'barл";
EXPECTED:
Old package separator used in string at - line 3.
	(Did you mean "$fooл\'barл" instead?)
Old package separator used in string at - line 4.
	(Did you mean "@fooл\'barл" instead?)
Old package separator used in string at - line 5.
	(Did you mean "$#fooл\'barл" instead?)
GOT:

# Failed test 772 - at lib/warnings/toke line 435
# parser guessed wrong encoding expected 'CP1252' got 'UTF-8'
c++: error: +Z: No such file or directory
c++: error: +O2: No such file or directory
c++: error: +Onolimit: No such file or directory
# Will use Digest::MD5
# Connected to 127.0.0.1
# Connected to 127.0.0.1
Cannot figure out an encoding to use at t/use-Encode-Alias.t line 5.
make: *** [test_harness] Error 6

error while running harness target 'test_harness': 2 at /pro/3gl/CPAN/smoke/lib/Test/Smoke.pm line 194.
[2019-04-21 13:26:02METDST] 
[2019-04-21 13:26:02METDST] ../lib/warnings.t...........................................FAILED
[2019-04-21 13:26:02METDST]     366, 771-772
[2019-04-21 13:26:02METDST] ../lib/locale.t.............................................FAILED
[2019-04-21 13:26:02METDST]     431-432, 498
[2019-04-21 13:26:02METDST] ../dist/Net-Ping/t/450_service.t............................PASSED
[2019-04-21 13:26:02METDST]     9, 18
[2019-04-21 13:26:02METDST] Archived results...
[2019-04-21 13:26:02METDST] TSTENV = locale:univ.utf8	
PROG: 
use warnings 'uninitialized';

# aelem + const
use constant foo => \0;
$SIG{__WARN__} = sub {
 print STDERR
   $_[0] =~ /\$a\[([^]]+)]/ && $1 == foo
       ? "ok\n"
       : ("$1 != ",0+foo,"\n")
};
() = "$a[foo]";
undef $SIG{__WARN__};

# Multideref
() = "$a[140688675223280]";
EXPECTED:
ok
Use of uninitialized value $a[140688675223280] in string at - line 15.
GOT:
-9223372032559499840 != 9223372041150051776
Use of uninitialized value $a[140688675223280] in string at - line 15.
# Failed test 366 - 64-bit array subscripts at lib/warnings/9uninit line 2175
PROG: 
use warnings 'syntax';
@foo::bar = 1..3;
() = "$foo'bar";
() = "@foo'bar";
() = "$#foo'bar";
no warnings 'syntax' ;
() = "$foo'bar";
() = "@foo'bar";
() = "$#foo'bar";
EXPECTED:
Old package separator used in string at - line 3.
	(Did you mean "$foo\'bar" instead?)
Old package separator used in string at - line 4.
	(Did you mean "@foo\'bar" instead?)
Old package separator used in string at - line 5.
	(Did you mean "$#foo\'bar" instead?)
GOT:

# Failed test 771 - at lib/warnings/toke line 418
PROG: 
use warnings 'syntax'; use utf8;
@fooл::barл = 1..3;
() = "$fooл'barл";
() = "@fooл'barл";
() = "$#fooл'barл";
no warnings 'syntax' ;
() = "$fooл'barл";
() = "@fooл'barл";
() = "$#fooл'barл";
EXPECTED:
Old package separator used in string at - line 3.
	(Did you mean "$fooл\'barл" instead?)
Old package separator used in string at - line 4.
	(Did you mean "@fooл\'barл" instead?)
Old package separator used in string at - line 5.
	(Did you mean "$#fooл\'barл" instead?)
GOT:

# Failed test 772 - at lib/warnings/toke line 435
# parser guessed wrong encoding expected 'CP1252' got 'UTF-8'
Locale 'univ.utf8' contains (at least) the following characters which have
unexpected meanings: $ + < = > ^ ` | ~
The Perl program will use the expected meanings; codeset=utf8
Locale 'univ.utf8' contains (at least) the following characters which have
unexpected meanings: $ + < = > ^ ` | ~
The Perl program will use the expected meanings; codeset=utf8
Locale 'univ.utf8' contains (at least) the following characters which have
unexpected meanings: $ + < = > ^ ` | ~
The Perl program will use the expected meanings; codeset=utf8
Locale 'univ.utf8' contains (at least) the following characters which have
unexpected meanings: $ + < = > ^ ` | ~
The Perl program will use the expected meanings; codeset=utf8
Locale 'univ.utf8' contains (at least) the following characters which have
unexpected meanings: $ + < = > ^ ` | ~
The Perl program will use the expected meanings; codeset=utf8
Locale 'univ.utf8' contains (at least) the following characters which have
unexpected meanings: $ + < = > ^ ` | ~
The Perl program will use the expected meanings; codeset=utf8
Locale 'univ.utf8' contains (at least) the following characters which have
unexpected meanings: $ + < = > ^ ` | ~
The Perl program will use the expected meanings; codeset=utf8
Locale 'univ.utf8' contains (at least) the following characters which have
unexpected meanings: $ + < = > ^ ` | ~
The Perl program will use the expected meanings; codeset=utf8
Locale 'univ.utf8' contains (at least) the following characters which have
unexpected meanings: $ + < = > ^ ` | ~
The Perl program will use the expected meanings; codeset=utf8
Locale 'univ.utf8' contains (at least) the following characters which have
unexpected meanings: $ + < = > ^ ` | ~
The Perl program will use the expected meanings; codeset=utf8
Locale 'univ.utf8' contains (at least) the following characters which have
unexpected meanings: $ + < = > ^ ` | ~
The Perl program will use the expected meanings; codeset=utf8
Locale 'univ.utf8' contains (at least) the following characters which have
unexpected meanings: $ + < = > ^ ` | ~
The Perl program will use the expected meanings; codeset=utf8
Locale 'univ.utf8' contains (at least) the following characters which have
unexpected meanings: $ + < = > ^ ` | ~
The Perl program will use the expected meanings; codeset=utf8
Locale 'univ.utf8' contains (at least) the following characters which have
unexpected meanings: $ + < = > ^ ` | ~
The Perl program will use the expected meanings; codeset=utf8
Locale 'univ.utf8' contains (at least) the following characters which have
unexpected meanings: $ + < = > ^ ` | ~
The Perl program will use the expected meanings; codeset=utf8
c++: error: +Z: No such file or directory
c++: error: +O2: No such file or directory
c++: error: +Onolimit: No such file or directory
# Will use Digest::MD5
# Connected to 127.0.0.1
syswrite() isn't allowed on :utf8 handles at t/Socket.t line 47.
# Looks like your test exited with 255 just after 2.
make: *** [test_harness] Error 6

error while running harness target 'test_harness': 2 at /pro/3gl/CPAN/smoke/lib/Test/Smoke.pm line 194.
[2019-04-21 14:48:56METDST] 
[2019-04-21 14:48:56METDST] ../lib/locale.t.............................................FAILED
[2019-04-21 14:48:56METDST]     431-432, 498
[2019-04-21 14:48:56METDST] ../lib/warnings.t...........................................FAILED
[2019-04-21 14:48:56METDST]     366, 771-772
[2019-04-21 14:48:56METDST] ../lib/B/Deparse.t..........................................PASSED
[2019-04-21 14:48:56METDST]     2
[2019-04-21 14:48:56METDST] ../dist/Net-Ping/t/450_service.t............................PASSED
[2019-04-21 14:48:56METDST]     9, 18
[2019-04-21 14:48:56METDST] ../cpan/Socket/t/Socket.t...................................FAILED
[2019-04-21 14:48:56METDST]     Non-zero exit status: 255
[2019-04-21 14:48:56METDST] ../cpan/Socket/t/Socket.t...................................FAILED
[2019-04-21 14:48:56METDST]     Bad plan.  You planned 6 tests but ran 2.
[2019-04-21 14:48:56METDST] Archived results...
[2019-04-21 14:48:56METDST] Unskip tests from '/pro/3gl/CPAN/smoke/p59.skip'
[2019-04-21 14:48:56METDST] 
[2019-04-21 14:48:56METDST] Configuration: -Dusedevel -Duse64bitall -DDEBUGGING
[2019-04-21 14:48:56METDST] ------------------------------------------------------------------------------
[2019-04-21 14:48:56METDST] make distclean ...
[2019-04-21 14:50:27METDST] 
[2019-04-21 14:50:27METDST] Copy Policy.sh ...
[2019-04-21 14:50:27METDST] 
[2019-04-21 14:50:27METDST] Configure ...
5.29.10 <=> 5.014002
===== PROCURA Policy for hpux/cc ========================
===== PROCURA Policy results ============================
cc:         cc
ccversion:  -
gccversion: -
ccflags:    -DDEBUGGING +Z -z
optimize:   
ld:         
ldflags:    -L/pro/local/lib
libswanted: cl pthread cl pthread socket bind inet nsl ndbm gdbm dbm db malloc dl ld sun m crypt sec util c cposix posix ucb bsd BSD
libsdirs:    /lib /pro/local/lib
locincpth:  /pro/local/include
loclibpth:  /pro/local/lib
useshrplib: 
===== PROCURA Policy done ===============================
[2019-04-21 14:52:39METDST] 
[2019-04-21 14:52:39METDST] make ...
mysterious name [ENTER_with_name(name)] in parts/apidoc.fnc, line 161
mysterious name [LEAVE_with_name(name)] in parts/apidoc.fnc, line 164
parts/inc/misc provides av_tindex, which is still marked todo for 5.17.9
parts/inc/misc provides av_top_index, which is still marked todo for 5.17.9
parts/inc/misc provides isALPHANUMERIC, which is still marked todo for 5.17.8
parts/inc/misc provides isIDCONT, which is still marked todo for 5.17.8
parts/inc/misc provides isOCTAL, which is still marked todo for 5.13.5
parts/inc/misc provides isWORDCHAR, which is still marked todo for 5.13.6
parts/inc/uv provides utf8_to_uvchr_buf, which is still marked todo for 5.15.9
parts/inc/mess provides vmess, which is still marked todo for 5.6.0
mysterious name [ENTER_with_name(name)] in parts/apidoc.fnc, line 161
mysterious name [LEAVE_with_name(name)] in parts/apidoc.fnc, line 164
parts/inc/misc provides av_tindex, which is still marked todo for 5.17.9
parts/inc/misc provides av_top_index, which is still marked todo for 5.17.9
parts/inc/misc provides isALPHANUMERIC, which is still marked todo for 5.17.8
parts/inc/misc provides isIDCONT, which is still marked todo for 5.17.8
parts/inc/misc provides isOCTAL, which is still marked todo for 5.13.5
parts/inc/misc provides isWORDCHAR, which is still marked todo for 5.13.6
parts/inc/uv provides utf8_to_uvchr_buf, which is still marked todo for 5.15.9
parts/inc/mess provides vmess, which is still marked todo for 5.6.0
Warning (mostly harmless): No library found for -lposix
Warning (mostly harmless): No library found for -lcposix
cc: warning 457: The Onolimit option is not valid at this optimization level.
Making header files for XS...
[2019-04-21 15:22:11METDST] Skip tests from '/pro/3gl/CPAN/smoke/p59.skip'
[2019-04-21 15:22:11METDST] 
[2019-04-21 15:22:11METDST]  Tests start here:
[2019-04-21 15:22:11METDST] TSTENV = stdio	
No saved state, selection will be empty
Cannot figure out an encoding to use at t/use-Encode-Alias.t line 5.
# parser guessed wrong encoding expected 'CP1252' got 'UTF-8'
# Connected to 127.0.0.1
# Connected to 127.0.0.1
Redefining sub xChild::foo at xChild--14791 line 2.
Redefining sub Data::ok at -e line 1.
c++: error: +Z: No such file or directory
c++: error: +O2: No such file or directory
c++: error: +Onolimit: No such file or directory
# Will use Digest::MD5
PROG: 
use warnings 'uninitialized';

# aelem + const
use constant foo => \0;
$SIG{__WARN__} = sub {
 print STDERR
   $_[0] =~ /\$a\[([^]]+)]/ && $1 == foo
       ? "ok\n"
       : ("$1 != ",0+foo,"\n")
};
() = "$a[foo]";
undef $SIG{__WARN__};

# Multideref
() = "$a[140688675223280]";
EXPECTED:
ok
Use of uninitialized value $a[140688675223280] in string at - line 15.
GOT:
-9223372032558236896 != 9223372041151314720
Use of uninitialized value $a[140688675223280] in string at - line 15.
# Failed test 366 - 64-bit array subscripts at lib/warnings/9uninit line 2175
PROG: 
use warnings 'syntax';
@foo::bar = 1..3;
() = "$foo'bar";
() = "@foo'bar";
() = "$#foo'bar";
no warnings 'syntax' ;
() = "$foo'bar";
() = "@foo'bar";
() = "$#foo'bar";
EXPECTED:
Old package separator used in string at - line 3.
	(Did you mean "$foo\'bar" instead?)
Old package separator used in string at - line 4.
	(Did you mean "@foo\'bar" instead?)
Old package separator used in string at - line 5.
	(Did you mean "$#foo\'bar" instead?)
GOT:

# Failed test 771 - at lib/warnings/toke line 418
PROG: 
use warnings 'syntax'; use utf8;
@fooл::barл = 1..3;
() = "$fooл'barл";
() = "@fooл'barл";
() = "$#fooл'barл";
no warnings 'syntax' ;
() = "$fooл'barл";
() = "@fooл'barл";
() = "$#fooл'barл";
EXPECTED:
Old package separator used in string at - line 3.
	(Did you mean "$fooл\'barл" instead?)
Old package separator used in string at - line 4.
	(Did you mean "@fooл\'barл" instead?)
Old package separator used in string at - line 5.
	(Did you mean "$#fooл\'barл" instead?)
GOT:

# Failed test 772 - at lib/warnings/toke line 435
make: *** [test_harness] Error 6

error while running harness target 'test_harness': 2 at /pro/3gl/CPAN/smoke/lib/Test/Smoke.pm line 194.
[2019-04-21 17:08:55METDST] 
[2019-04-21 17:08:55METDST] ../dist/Net-Ping/t/450_service.t............................PASSED
[2019-04-21 17:08:55METDST]     9, 18
[2019-04-21 17:08:55METDST] ../lib/locale.t.............................................FAILED
[2019-04-21 17:08:55METDST]     431-432, 498
[2019-04-21 17:08:55METDST] ../lib/warnings.t...........................................FAILED
[2019-04-21 17:08:55METDST]     366, 771-772
[2019-04-21 17:08:55METDST] Archived results...
[2019-04-21 17:08:55METDST] TSTENV = perlio	
PROG: 
use warnings 'uninitialized';

# aelem + const
use constant foo => \0;
$SIG{__WARN__} = sub {
 print STDERR
   $_[0] =~ /\$a\[([^]]+)]/ && $1 == foo
       ? "ok\n"
       : ("$1 != ",0+foo,"\n")
};
() = "$a[foo]";
undef $SIG{__WARN__};

# Multideref
() = "$a[140688675223280]";
EXPECTED:
ok
Use of uninitialized value $a[140688675223280] in string at - line 15.
GOT:
-9223372032558236576 != 9223372041151315040
Use of uninitialized value $a[140688675223280] in string at - line 15.
# Failed test 366 - 64-bit array subscripts at lib/warnings/9uninit line 2175
PROG: 
use warnings 'syntax';
@foo::bar = 1..3;
() = "$foo'bar";
() = "@foo'bar";
() = "$#foo'bar";
no warnings 'syntax' ;
() = "$foo'bar";
() = "@foo'bar";
() = "$#foo'bar";
EXPECTED:
Old package separator used in string at - line 3.
	(Did you mean "$foo\'bar" instead?)
Old package separator used in string at - line 4.
	(Did you mean "@foo\'bar" instead?)
Old package separator used in string at - line 5.
	(Did you mean "$#foo\'bar" instead?)
GOT:

# Failed test 771 - at lib/warnings/toke line 418
PROG: 
use warnings 'syntax'; use utf8;
@fooл::barл = 1..3;
() = "$fooл'barл";
() = "@fooл'barл";
() = "$#fooл'barл";
no warnings 'syntax' ;
() = "$fooл'barл";
() = "@fooл'barл";
() = "$#fooл'barл";
EXPECTED:
Old package separator used in string at - line 3.
	(Did you mean "$fooл\'barл" instead?)
Old package separator used in string at - line 4.
	(Did you mean "@fooл\'barл" instead?)
Old package separator used in string at - line 5.
	(Did you mean "$#fooл\'barл" instead?)
GOT:

# Failed test 772 - at lib/warnings/toke line 435
# parser guessed wrong encoding expected 'CP1252' got 'UTF-8'
c++: error: +Z: No such file or directory
c++: error: +O2: No such file or directory
c++: error: +Onolimit: No such file or directory
# Will use Digest::MD5
# Connected to 127.0.0.1
# Connected to 127.0.0.1
Cannot figure out an encoding to use at t/use-Encode-Alias.t line 5.
make: *** [test_harness] Error 6

error while running harness target 'test_harness': 2 at /pro/3gl/CPAN/smoke/lib/Test/Smoke.pm line 194.
[2019-04-21 18:45:02METDST] 
[2019-04-21 18:45:02METDST] ../lib/warnings.t...........................................FAILED
[2019-04-21 18:45:02METDST]     366, 771-772
[2019-04-21 18:45:02METDST] ../lib/locale.t.............................................FAILED
[2019-04-21 18:45:02METDST]     431-432, 498
[2019-04-21 18:45:02METDST] ../dist/Net-Ping/t/450_service.t............................PASSED
[2019-04-21 18:45:02METDST]     9, 18
[2019-04-21 18:45:02METDST] Archived results...
[2019-04-21 18:45:02METDST] TSTENV = locale:univ.utf8	
PROG: 
use warnings 'uninitialized';

# aelem + const
use constant foo => \0;
$SIG{__WARN__} = sub {
 print STDERR
   $_[0] =~ /\$a\[([^]]+)]/ && $1 == foo
       ? "ok\n"
       : ("$1 != ",0+foo,"\n")
};
() = "$a[foo]";
undef $SIG{__WARN__};

# Multideref
() = "$a[140688675223280]";
EXPECTED:
ok
Use of uninitialized value $a[140688675223280] in string at - line 15.
GOT:
-9223372032558235888 != 9223372041151315728
Use of uninitialized value $a[140688675223280] in string at - line 15.
# Failed test 366 - 64-bit array subscripts at lib/warnings/9uninit line 2175
PROG: 
use warnings 'syntax';
@foo::bar = 1..3;
() = "$foo'bar";
() = "@foo'bar";
() = "$#foo'bar";
no warnings 'syntax' ;
() = "$foo'bar";
() = "@foo'bar";
() = "$#foo'bar";
EXPECTED:
Old package separator used in string at - line 3.
	(Did you mean "$foo\'bar" instead?)
Old package separator used in string at - line 4.
	(Did you mean "@foo\'bar" instead?)
Old package separator used in string at - line 5.
	(Did you mean "$#foo\'bar" instead?)
GOT:

# Failed test 771 - at lib/warnings/toke line 418
PROG: 
use warnings 'syntax'; use utf8;
@fooл::barл = 1..3;
() = "$fooл'barл";
() = "@fooл'barл";
() = "$#fooл'barл";
no warnings 'syntax' ;
() = "$fooл'barл";
() = "@fooл'barл";
() = "$#fooл'barл";
EXPECTED:
Old package separator used in string at - line 3.
	(Did you mean "$fooл\'barл" instead?)
Old package separator used in string at - line 4.
	(Did you mean "@fooл\'barл" instead?)
Old package separator used in string at - line 5.
	(Did you mean "$#fooл\'barл" instead?)
GOT:

# Failed test 772 - at lib/warnings/toke line 435
# parser guessed wrong encoding expected 'CP1252' got 'UTF-8'
c++: error: +Z: No such file or directory
c++: error: +O2: No such file or directory
c++: error: +Onolimit: No such file or directory
Locale 'univ.utf8' contains (at least) the following characters which have
unexpected meanings: $ + < = > ^ ` | ~
The Perl program will use the expected meanings; codeset=utf8
Locale 'univ.utf8' contains (at least) the following characters which have
unexpected meanings: $ + < = > ^ ` | ~
The Perl program will use the expected meanings; codeset=utf8
Locale 'univ.utf8' contains (at least) the following characters which have
unexpected meanings: $ + < = > ^ ` | ~
The Perl program will use the expected meanings; codeset=utf8
Locale 'univ.utf8' contains (at least) the following characters which have
unexpected meanings: $ + < = > ^ ` | ~
The Perl program will use the expected meanings; codeset=utf8
Locale 'univ.utf8' contains (at least) the following characters which have
unexpected meanings: $ + < = > ^ ` | ~
The Perl program will use the expected meanings; codeset=utf8
Locale 'univ.utf8' contains (at least) the following characters which have
unexpected meanings: $ + < = > ^ ` | ~
The Perl program will use the expected meanings; codeset=utf8
Locale 'univ.utf8' contains (at least) the following characters which have
unexpected meanings: $ + < = > ^ ` | ~
The Perl program will use the expected meanings; codeset=utf8
Locale 'univ.utf8' contains (at least) the following characters which have
unexpected meanings: $ + < = > ^ ` | ~
The Perl program will use the expected meanings; codeset=utf8
Locale 'univ.utf8' contains (at least) the following characters which have
unexpected meanings: $ + < = > ^ ` | ~
The Perl program will use the expected meanings; codeset=utf8
Locale 'univ.utf8' contains (at least) the following characters which have
unexpected meanings: $ + < = > ^ ` | ~
The Perl program will use the expected meanings; codeset=utf8
Locale 'univ.utf8' contains (at least) the following characters which have
unexpected meanings: $ + < = > ^ ` | ~
The Perl program will use the expected meanings; codeset=utf8
Locale 'univ.utf8' contains (at least) the following characters which have
unexpected meanings: $ + < = > ^ ` | ~
The Perl program will use the expected meanings; codeset=utf8
Locale 'univ.utf8' contains (at least) the following characters which have
unexpected meanings: $ + < = > ^ ` | ~
The Perl program will use the expected meanings; codeset=utf8
Locale 'univ.utf8' contains (at least) the following characters which have
unexpected meanings: $ + < = > ^ ` | ~
The Perl program will use the expected meanings; codeset=utf8
Locale 'univ.utf8' contains (at least) the following characters which have
unexpected meanings: $ + < = > ^ ` | ~
The Perl program will use the expected meanings; codeset=utf8
# Will use Digest::MD5
# Connected to 127.0.0.1
syswrite() isn't allowed on :utf8 handles at t/Socket.t line 47.
# Looks like your test exited with 255 just after 2.
make: *** [test_harness] Error 6

error while running harness target 'test_harness': 2 at /pro/3gl/CPAN/smoke/lib/Test/Smoke.pm line 194.
[2019-04-21 20:23:08METDST] 
[2019-04-21 20:23:08METDST] ../lib/locale.t.............................................FAILED
[2019-04-21 20:23:08METDST]     431-432, 498
[2019-04-21 20:23:08METDST] ../lib/warnings.t...........................................FAILED
[2019-04-21 20:23:08METDST]     366, 771-772
[2019-04-21 20:23:08METDST] ../lib/B/Deparse.t..........................................PASSED
[2019-04-21 20:23:08METDST]     2
[2019-04-21 20:23:08METDST] ../dist/Net-Ping/t/450_service.t............................PASSED
[2019-04-21 20:23:08METDST]     9, 18
[2019-04-21 20:23:08METDST] ../cpan/Socket/t/Socket.t...................................FAILED
[2019-04-21 20:23:08METDST]     Non-zero exit status: 255
[2019-04-21 20:23:08METDST] ../cpan/Socket/t/Socket.t...................................FAILED
[2019-04-21 20:23:08METDST]     Bad plan.  You planned 6 tests but ran 2.
[2019-04-21 20:23:08METDST] Archived results...
[2019-04-21 20:23:08METDST] Unskip tests from '/pro/3gl/CPAN/smoke/p59.skip'
[2019-04-21 20:23:08METDST] 
[2019-04-21 20:23:08METDST] Configuration: -Dusedevel -Duseithreads
[2019-04-21 20:23:08METDST] ------------------------------------------------------------------------------
[2019-04-21 20:23:08METDST] make distclean ...
[2019-04-21 20:24:50METDST] 
[2019-04-21 20:24:50METDST] Copy Policy.sh ...
[2019-04-21 20:24:50METDST] 
[2019-04-21 20:24:50METDST] Configure ...
5.29.10 <=> 5.014002
===== PROCURA Policy for hpux/cc ========================
===== PROCURA Policy results ============================
cc:         cc
ccversion:  -
gccversion: -
ccflags:     +Z -z
optimize:   
ld:         
ldflags:    -L/pro/local/lib
libswanted: cl pthread cl pthread socket bind inet nsl ndbm gdbm dbm db malloc dl ld sun m crypt sec util c cposix posix ucb bsd BSD
libsdirs:    /lib /pro/local/lib
locincpth:  /pro/local/include
loclibpth:  /pro/local/lib
useshrplib: 
===== PROCURA Policy done ===============================
[2019-04-21 20:26:48METDST] 
[2019-04-21 20:26:48METDST] make ...
mysterious name [ENTER_with_name(name)] in parts/apidoc.fnc, line 161
mysterious name [LEAVE_with_name(name)] in parts/apidoc.fnc, line 164
parts/inc/misc provides av_tindex, which is still marked todo for 5.17.9
parts/inc/misc provides av_top_index, which is still marked todo for 5.17.9
parts/inc/misc provides isALPHANUMERIC, which is still marked todo for 5.17.8
parts/inc/misc provides isIDCONT, which is still marked todo for 5.17.8
parts/inc/misc provides isOCTAL, which is still marked todo for 5.13.5
parts/inc/misc provides isWORDCHAR, which is still marked todo for 5.13.6
parts/inc/uv provides utf8_to_uvchr_buf, which is still marked todo for 5.15.9
parts/inc/mess provides vmess, which is still marked todo for 5.6.0
mysterious name [ENTER_with_name(name)] in parts/apidoc.fnc, line 161
mysterious name [LEAVE_with_name(name)] in parts/apidoc.fnc, line 164
parts/inc/misc provides av_tindex, which is still marked todo for 5.17.9
parts/inc/misc provides av_top_index, which is still marked todo for 5.17.9
parts/inc/misc provides isALPHANUMERIC, which is still marked todo for 5.17.8
parts/inc/misc provides isIDCONT, which is still marked todo for 5.17.8
parts/inc/misc provides isOCTAL, which is still marked todo for 5.13.5
parts/inc/misc provides isWORDCHAR, which is still marked todo for 5.13.6
parts/inc/uv provides utf8_to_uvchr_buf, which is still marked todo for 5.15.9
parts/inc/mess provides vmess, which is still marked todo for 5.6.0
Warning (mostly harmless): No library found for -lposix
Warning (mostly harmless): No library found for -lcposix
cc: warning 457: The Onolimit option is not valid at this optimization level.
Making header files for XS...
[2019-04-21 20:43:42METDST] Skip tests from '/pro/3gl/CPAN/smoke/p59.skip'
[2019-04-21 20:43:42METDST] 
[2019-04-21 20:43:42METDST]  Tests start here:
[2019-04-21 20:43:42METDST] TSTENV = stdio	
No saved state, selection will be empty
Cannot figure out an encoding to use at t/use-Encode-Alias.t line 5.
# parser guessed wrong encoding expected 'CP1252' got 'UTF-8'
# Connected to 127.0.0.1
# Connected to 127.0.0.1
Integer overflow in hexadecimal number at t/broken_univ_can.t line 7.
Redefining sub xChild::foo at xChild--29837 line 2.
Redefining sub Data::ok at -e line 1.
c++: error: +Z: No such file or directory
c++: error: +O2: No such file or directory
c++: error: +Onolimit: No such file or directory
# Will use Digest::MD5
panic: numeric.c: 40: Trying to change LC_NUMERIC incompatibly at ../lib/locale.t line 2008.
PROG: 
use warnings 'syntax';
@foo::bar = 1..3;
() = "$foo'bar";
() = "@foo'bar";
() = "$#foo'bar";
no warnings 'syntax' ;
() = "$foo'bar";
() = "@foo'bar";
() = "$#foo'bar";
EXPECTED:
Old package separator used in string at - line 3.
	(Did you mean "$foo\'bar" instead?)
Old package separator used in string at - line 4.
	(Did you mean "@foo\'bar" instead?)
Old package separator used in string at - line 5.
	(Did you mean "$#foo\'bar" instead?)
GOT:

# Failed test 771 - at lib/warnings/toke line 418
PROG: 
use warnings 'syntax'; use utf8;
@fooл::barл = 1..3;
() = "$fooл'barл";
() = "@fooл'barл";
() = "$#fooл'barл";
no warnings 'syntax' ;
() = "$fooл'barл";
() = "@fooл'barл";
() = "$#fooл'barл";
EXPECTED:
Old package separator used in string at - line 3.
	(Did you mean "$fooл\'barл" instead?)
Old package separator used in string at - line 4.
	(Did you mean "@fooл\'barл" instead?)
Old package separator used in string at - line 5.
	(Did you mean "$#fooл\'barл" instead?)
GOT:

# Failed test 772 - at lib/warnings/toke line 435
make: *** [test_harness] Error 2

error while running harness target 'test_harness': 2 at /pro/3gl/CPAN/smoke/lib/Test/Smoke.pm line 194.
[2019-04-21 22:22:45METDST] 
[2019-04-21 22:22:45METDST] ../dist/Net-Ping/t/450_service.t............................PASSED
[2019-04-21 22:22:45METDST]     9, 18
[2019-04-21 22:22:45METDST] ../lib/locale.t.............................................FAILED
[2019-04-21 22:22:45METDST]     No plan found in TAP output
[2019-04-21 22:22:45METDST] ../lib/warnings.t...........................................FAILED
[2019-04-21 22:22:45METDST]     771-772
[2019-04-21 22:22:45METDST] Archived results...
[2019-04-21 22:22:45METDST] TSTENV = perlio	
# Failed test 2 -    right time (waited 5 secs for 3-sec alarm) at op/alarm.t line 34
PROG: 
use warnings 'syntax';
@foo::bar = 1..3;
() = "$foo'bar";
() = "@foo'bar";
() = "$#foo'bar";
no warnings 'syntax' ;
() = "$foo'bar";
() = "@foo'bar";
() = "$#foo'bar";
EXPECTED:
Old package separator used in string at - line 3.
	(Did you mean "$foo\'bar" instead?)
Old package separator used in string at - line 4.
	(Did you mean "@foo\'bar" instead?)
Old package separator used in string at - line 5.
	(Did you mean "$#foo\'bar" instead?)
GOT:

# Failed test 771 - at lib/warnings/toke line 418
PROG: 
use warnings 'syntax'; use utf8;
@fooл::barл = 1..3;
() = "$fooл'barл";
() = "@fooл'barл";
() = "$#fooл'barл";
no warnings 'syntax' ;
() = "$fooл'barл";
() = "@fooл'barл";
() = "$#fooл'barл";
EXPECTED:
Old package separator used in string at - line 3.
	(Did you mean "$fooл\'barл" instead?)
Old package separator used in string at - line 4.
	(Did you mean "@fooл\'barл" instead?)
Old package separator used in string at - line 5.
	(Did you mean "$#fooл\'barл" instead?)
GOT:

# Failed test 772 - at lib/warnings/toke line 435
# parser guessed wrong encoding expected 'CP1252' got 'UTF-8'
c++: error: +Z: No such file or directory
c++: error: +O2: No such file or directory
c++: error: +Onolimit: No such file or directory
panic: numeric.c: 40: Trying to change LC_NUMERIC incompatibly at ../lib/locale.t line 2008.
# Will use Digest::MD5
# Connected to 127.0.0.1
# Connected to 127.0.0.1
Cannot figure out an encoding to use at t/use-Encode-Alias.t line 5.
Integer overflow in hexadecimal number at t/broken_univ_can.t line 7.
make: *** [test_harness] Error 3

error while running harness target 'test_harness': 2 at /pro/3gl/CPAN/smoke/lib/Test/Smoke.pm line 194.
[2019-04-21 23:43:17METDST] 
[2019-04-21 23:43:17METDST] ../t/op/alarm.t.............................................FAILED
[2019-04-21 23:43:17METDST]     2
[2019-04-21 23:43:17METDST] ../lib/warnings.t...........................................FAILED
[2019-04-21 23:43:17METDST]     771-772
[2019-04-21 23:43:17METDST] ../lib/locale.t.............................................FAILED
[2019-04-21 23:43:17METDST]     No plan found in TAP output
[2019-04-21 23:43:17METDST] ../dist/Net-Ping/t/450_service.t............................PASSED
[2019-04-21 23:43:17METDST]     9, 18
[2019-04-21 23:43:17METDST] Archived results...
[2019-04-21 23:43:17METDST] TSTENV = locale:univ.utf8	
PROG: 
use warnings 'syntax';
@foo::bar = 1..3;
() = "$foo'bar";
() = "@foo'bar";
() = "$#foo'bar";
no warnings 'syntax' ;
() = "$foo'bar";
() = "@foo'bar";
() = "$#foo'bar";
EXPECTED:
Old package separator used in string at - line 3.
	(Did you mean "$foo\'bar" instead?)
Old package separator used in string at - line 4.
	(Did you mean "@foo\'bar" instead?)
Old package separator used in string at - line 5.
	(Did you mean "$#foo\'bar" instead?)
GOT:

# Failed test 771 - at lib/warnings/toke line 418
PROG: 
use warnings 'syntax'; use utf8;
@fooл::barл = 1..3;
() = "$fooл'barл";
() = "@fooл'barл";
() = "$#fooл'barл";
no warnings 'syntax' ;
() = "$fooл'barл";
() = "@fooл'barл";
() = "$#fooл'barл";
EXPECTED:
Old package separator used in string at - line 3.
	(Did you mean "$fooл\'barл" instead?)
Old package separator used in string at - line 4.
	(Did you mean "@fooл\'barл" instead?)
Old package separator used in string at - line 5.
	(Did you mean "$#fooл\'barл" instead?)
GOT:

# Failed test 772 - at lib/warnings/toke line 435
# parser guessed wrong encoding expected 'CP1252' got 'UTF-8'
panic: numeric.c: 40: Trying to change LC_NUMERIC incompatibly at ../lib/locale.t line 2008.
c++: error: +Z: No such file or directory
c++: error: +O2: No such file or directory
c++: error: +Onolimit: No such file or directory
Locale 'univ.utf8' contains (at least) the following characters which have
unexpected meanings: $ + < = > ^ ` | ~
The Perl program will use the expected meanings; codeset=utf8
Locale 'univ.utf8' contains (at least) the following characters which have
unexpected meanings: $ + < = > ^ ` | ~
The Perl program will use the expected meanings; codeset=utf8
Locale 'univ.utf8' contains (at least) the following characters which have
unexpected meanings: $ + < = > ^ ` | ~
The Perl program will use the expected meanings; codeset=utf8
Locale 'univ.utf8' contains (at least) the following characters which have
unexpected meanings: $ + < = > ^ ` | ~
The Perl program will use the expected meanings; codeset=utf8
Locale 'univ.utf8' contains (at least) the following characters which have
unexpected meanings: $ + < = > ^ ` | ~
The Perl program will use the expected meanings; codeset=utf8
Locale 'univ.utf8' contains (at least) the following characters which have
unexpected meanings: $ + < = > ^ ` | ~
The Perl program will use the expected meanings; codeset=utf8
Locale 'univ.utf8' contains (at least) the following characters which have
unexpected meanings: $ + < = > ^ ` | ~
The Perl program will use the expected meanings; codeset=utf8
Locale 'univ.utf8' contains (at least) the following characters which have
unexpected meanings: $ + < = > ^ ` | ~
The Perl program will use the expected meanings; codeset=utf8
Locale 'univ.utf8' contains (at least) the following characters which have
unexpected meanings: $ + < = > ^ ` | ~
The Perl program will use the expected meanings; codeset=utf8
Locale 'univ.utf8' contains (at least) the following characters which have
unexpected meanings: $ + < = > ^ ` | ~
The Perl program will use the expected meanings; codeset=utf8
Locale 'univ.utf8' contains (at least) the following characters which have
unexpected meanings: $ + < = > ^ ` | ~
The Perl program will use the expected meanings; codeset=utf8
Locale 'univ.utf8' contains (at least) the following characters which have
unexpected meanings: $ + < = > ^ ` | ~
The Perl program will use the expected meanings; codeset=utf8
Locale 'univ.utf8' contains (at least) the following characters which have
unexpected meanings: $ + < = > ^ ` | ~
The Perl program will use the expected meanings; codeset=utf8
Locale 'univ.utf8' contains (at least) the following characters which have
unexpected meanings: $ + < = > ^ ` | ~
The Perl program will use the expected meanings; codeset=utf8
Locale 'univ.utf8' contains (at least) the following characters which have
unexpected meanings: $ + < = > ^ ` | ~
The Perl program will use the expected meanings; codeset=utf8
Integer overflow in hexadecimal number at t/broken_univ_can.t line 7.
# Will use Digest::MD5
# Connected to 127.0.0.1
syswrite() isn't allowed on :utf8 handles at t/Socket.t line 47.
# Looks like your test exited with 255 just after 2.
make: *** [test_harness] Error 2

error while running harness target 'test_harness': 2 at /pro/3gl/CPAN/smoke/lib/Test/Smoke.pm line 194.
[2019-04-22 01:05:02METDST] 
[2019-04-22 01:05:02METDST] ../lib/warnings.t...........................................FAILED
[2019-04-22 01:05:02METDST]     771-772
[2019-04-22 01:05:02METDST] ../lib/B/Deparse.t..........................................PASSED
[2019-04-22 01:05:02METDST]     2
[2019-04-22 01:05:02METDST] ../lib/locale.t.............................................FAILED
[2019-04-22 01:05:02METDST]     No plan found in TAP output
[2019-04-22 01:05:02METDST] ../dist/Net-Ping/t/450_service.t............................PASSED
[2019-04-22 01:05:02METDST]     9, 18
[2019-04-22 01:05:02METDST] ../cpan/Socket/t/Socket.t...................................FAILED
[2019-04-22 01:05:02METDST]     Non-zero exit status: 255
[2019-04-22 01:05:02METDST] ../cpan/Socket/t/Socket.t...................................FAILED
[2019-04-22 01:05:02METDST]     Bad plan.  You planned 6 tests but ran 2.
[2019-04-22 01:05:02METDST] Archived results...
[2019-04-22 01:05:02METDST] Unskip tests from '/pro/3gl/CPAN/smoke/p59.skip'
[2019-04-22 01:05:02METDST] 
[2019-04-22 01:05:02METDST] Configuration: -Dusedevel -Duseithreads -DDEBUGGING
[2019-04-22 01:05:02METDST] ------------------------------------------------------------------------------
[2019-04-22 01:05:02METDST] make distclean ...
[2019-04-22 01:06:31METDST] 
[2019-04-22 01:06:31METDST] Copy Policy.sh ...
[2019-04-22 01:06:31METDST] 
[2019-04-22 01:06:31METDST] Configure ...
5.29.10 <=> 5.014002
===== PROCURA Policy for hpux/cc ========================
===== PROCURA Policy results ============================
cc:         cc
ccversion:  -
gccversion: -
ccflags:    -DDEBUGGING +Z -z
optimize:   
ld:         
ldflags:    -L/pro/local/lib
libswanted: cl pthread cl pthread socket bind inet nsl ndbm gdbm dbm db malloc dl ld sun m crypt sec util c cposix posix ucb bsd BSD
libsdirs:    /lib /pro/local/lib
locincpth:  /pro/local/include
loclibpth:  /pro/local/lib
useshrplib: 
===== PROCURA Policy done ===============================
[2019-04-22 01:08:40METDST] 
[2019-04-22 01:08:40METDST] make ...
mysterious name [ENTER_with_name(name)] in parts/apidoc.fnc, line 161
mysterious name [LEAVE_with_name(name)] in parts/apidoc.fnc, line 164
parts/inc/misc provides av_tindex, which is still marked todo for 5.17.9
parts/inc/misc provides av_top_index, which is still marked todo for 5.17.9
parts/inc/misc provides isALPHANUMERIC, which is still marked todo for 5.17.8
parts/inc/misc provides isIDCONT, which is still marked todo for 5.17.8
parts/inc/misc provides isOCTAL, which is still marked todo for 5.13.5
parts/inc/misc provides isWORDCHAR, which is still marked todo for 5.13.6
parts/inc/uv provides utf8_to_uvchr_buf, which is still marked todo for 5.15.9
parts/inc/mess provides vmess, which is still marked todo for 5.6.0
mysterious name [ENTER_with_name(name)] in parts/apidoc.fnc, line 161
mysterious name [LEAVE_with_name(name)] in parts/apidoc.fnc, line 164
parts/inc/misc provides av_tindex, which is still marked todo for 5.17.9
parts/inc/misc provides av_top_index, which is still marked todo for 5.17.9
parts/inc/misc provides isALPHANUMERIC, which is still marked todo for 5.17.8
parts/inc/misc provides isIDCONT, which is still marked todo for 5.17.8
parts/inc/misc provides isOCTAL, which is still marked todo for 5.13.5
parts/inc/misc provides isWORDCHAR, which is still marked todo for 5.13.6
parts/inc/uv provides utf8_to_uvchr_buf, which is still marked todo for 5.15.9
parts/inc/mess provides vmess, which is still marked todo for 5.6.0
Warning (mostly harmless): No library found for -lposix
Warning (mostly harmless): No library found for -lcposix
Making header files for XS...
[2019-04-22 01:38:15METDST] Skip tests from '/pro/3gl/CPAN/smoke/p59.skip'
[2019-04-22 01:38:15METDST] 
[2019-04-22 01:38:15METDST]  Tests start here:
[2019-04-22 01:38:15METDST] TSTENV = stdio	
No saved state, selection will be empty
Cannot figure out an encoding to use at t/use-Encode-Alias.t line 5.
# parser guessed wrong encoding expected 'CP1252' got 'UTF-8'
# Connected to 127.0.0.1
# Connected to 127.0.0.1
Integer overflow in hexadecimal number at t/broken_univ_can.t line 7.
Redefining sub xChild::foo at xChild--17688 line 2.
Redefining sub Data::ok at -e line 1.
c++: error: +Z: No such file or directory
# Will use Digest::MD5
panic: numeric.c: 40: Trying to change LC_NUMERIC incompatibly at ../lib/locale.t line 2008.
PROG: 
use warnings 'syntax';
@foo::bar = 1..3;
() = "$foo'bar";
() = "@foo'bar";
() = "$#foo'bar";
no warnings 'syntax' ;
() = "$foo'bar";
() = "@foo'bar";
() = "$#foo'bar";
EXPECTED:
Old package separator used in string at - line 3.
	(Did you mean "$foo\'bar" instead?)
Old package separator used in string at - line 4.
	(Did you mean "@foo\'bar" instead?)
Old package separator used in string at - line 5.
	(Did you mean "$#foo\'bar" instead?)
GOT:

# Failed test 771 - at lib/warnings/toke line 418
PROG: 
use warnings 'syntax'; use utf8;
@fooл::barл = 1..3;
() = "$fooл'barл";
() = "@fooл'barл";
() = "$#fooл'barл";
no warnings 'syntax' ;
() = "$fooл'barл";
() = "@fooл'barл";
() = "$#fooл'barл";
EXPECTED:
Old package separator used in string at - line 3.
	(Did you mean "$fooл\'barл" instead?)
Old package separator used in string at - line 4.
	(Did you mean "@fooл\'barл" instead?)
Old package separator used in string at - line 5.
	(Did you mean "$#fooл\'barл" instead?)
GOT:

# Failed test 772 - at lib/warnings/toke line 435
make: *** [test_harness] Error 2

error while running harness target 'test_harness': 2 at /pro/3gl/CPAN/smoke/lib/Test/Smoke.pm line 194.
[2019-04-22 04:49:50METDST] 
[2019-04-22 04:49:50METDST] ../dist/Net-Ping/t/450_service.t............................PASSED
[2019-04-22 04:49:50METDST]     9, 18
[2019-04-22 04:49:50METDST] ../lib/locale.t.............................................FAILED
[2019-04-22 04:49:50METDST]     No plan found in TAP output
[2019-04-22 04:49:50METDST] ../lib/warnings.t...........................................FAILED
[2019-04-22 04:49:50METDST]     771-772
[2019-04-22 04:49:50METDST] Archived results...
[2019-04-22 04:49:50METDST] TSTENV = perlio	
# Test process timed out - terminating
# parser guessed wrong encoding expected 'CP1252' got 'UTF-8'
PROG: 
use warnings 'syntax';
@foo::bar = 1..3;
() = "$foo'bar";
() = "@foo'bar";
() = "$#foo'bar";
no warnings 'syntax' ;
() = "$foo'bar";
() = "@foo'bar";
() = "$#foo'bar";
EXPECTED:
Old package separator used in string at - line 3.
	(Did you mean "$foo\'bar" instead?)
Old package separator used in string at - line 4.
	(Did you mean "@foo\'bar" instead?)
Old package separator used in string at - line 5.
	(Did you mean "$#foo\'bar" instead?)
GOT:

# Failed test 771 - at lib/warnings/toke line 418
PROG: 
use warnings 'syntax'; use utf8;
@fooл::barл = 1..3;
() = "$fooл'barл";
() = "@fooл'barл";
() = "$#fooл'barл";
no warnings 'syntax' ;
() = "$fooл'barл";
() = "@fooл'barл";
() = "$#fooл'barл";
EXPECTED:
Old package separator used in string at - line 3.
	(Did you mean "$fooл\'barл" instead?)
Old package separator used in string at - line 4.
	(Did you mean "@fooл\'barл" instead?)
Old package separator used in string at - line 5.
	(Did you mean "$#fooл\'barл" instead?)
GOT:

# Failed test 772 - at lib/warnings/toke line 435
c++: error: +Z: No such file or directory
panic: numeric.c: 40: Trying to change LC_NUMERIC incompatibly at ../lib/locale.t line 2008.
# Will use Digest::MD5
# Connected to 127.0.0.1
# Connected to 127.0.0.1
Cannot figure out an encoding to use at t/use-Encode-Alias.t line 5.
Integer overflow in hexadecimal number at t/broken_univ_can.t line 7.
make: *** [test_harness] Error 2

error while running harness target 'test_harness': 2 at /pro/3gl/CPAN/smoke/lib/Test/Smoke.pm line 194.
[2019-04-22 07:39:21METDST] 
[2019-04-22 07:39:21METDST] ../t/re/fold_grind_8.t......................................FAILED
[2019-04-22 07:39:21METDST]     No plan found in TAP output
[2019-04-22 07:39:21METDST] ../lib/warnings.t...........................................FAILED
[2019-04-22 07:39:21METDST]     771-772
[2019-04-22 07:39:21METDST] ../lib/locale.t.............................................FAILED
[2019-04-22 07:39:21METDST]     No plan found in TAP output
[2019-04-22 07:39:21METDST] ../dist/Net-Ping/t/450_service.t............................PASSED
[2019-04-22 07:39:21METDST]     9, 18
[2019-04-22 07:39:21METDST] Archived results...
[2019-04-22 07:39:21METDST] TSTENV = locale:univ.utf8	
# parser guessed wrong encoding expected 'CP1252' got 'UTF-8'
PROG: 
use warnings 'syntax';
@foo::bar = 1..3;
() = "$foo'bar";
() = "@foo'bar";
() = "$#foo'bar";
no warnings 'syntax' ;
() = "$foo'bar";
() = "@foo'bar";
() = "$#foo'bar";
EXPECTED:
Old package separator used in string at - line 3.
	(Did you mean "$foo\'bar" instead?)
Old package separator used in string at - line 4.
	(Did you mean "@foo\'bar" instead?)
Old package separator used in string at - line 5.
	(Did you mean "$#foo\'bar" instead?)
GOT:

# Failed test 771 - at lib/warnings/toke line 418
PROG: 
use warnings 'syntax'; use utf8;
@fooл::barл = 1..3;
() = "$fooл'barл";
() = "@fooл'barл";
() = "$#fooл'barл";
no warnings 'syntax' ;
() = "$fooл'barл";
() = "@fooл'barл";
() = "$#fooл'barл";
EXPECTED:
Old package separator used in string at - line 3.
	(Did you mean "$fooл\'barл" instead?)
Old package separator used in string at - line 4.
	(Did you mean "@fooл\'barл" instead?)
Old package separator used in string at - line 5.
	(Did you mean "$#fooл\'barл" instead?)
GOT:

# Failed test 772 - at lib/warnings/toke line 435
Locale 'univ.utf8' contains (at least) the following characters which have
unexpected meanings: $ + < = > ^ ` | ~
The Perl program will use the expected meanings; codeset=utf8
Locale 'univ.utf8' contains (at least) the following characters which have
unexpected meanings: $ + < = > ^ ` | ~
The Perl program will use the expected meanings; codeset=utf8
Locale 'univ.utf8' contains (at least) the following characters which have
unexpected meanings: $ + < = > ^ ` | ~
The Perl program will use the expected meanings; codeset=utf8
Locale 'univ.utf8' contains (at least) the following characters which have
unexpected meanings: $ + < = > ^ ` | ~
The Perl program will use the expected meanings; codeset=utf8
Locale 'univ.utf8' contains (at least) the following characters which have
unexpected meanings: $ + < = > ^ ` | ~
The Perl program will use the expected meanings; codeset=utf8
Locale 'univ.utf8' contains (at least) the following characters which have
unexpected meanings: $ + < = > ^ ` | ~
The Perl program will use the expected meanings; codeset=utf8
Locale 'univ.utf8' contains (at least) the following characters which have
unexpected meanings: $ + < = > ^ ` | ~
The Perl program will use the expected meanings; codeset=utf8
Locale 'univ.utf8' contains (at least) the following characters which have
unexpected meanings: $ + < = > ^ ` | ~
The Perl program will use the expected meanings; codeset=utf8
Locale 'univ.utf8' contains (at least) the following characters which have
unexpected meanings: $ + < = > ^ ` | ~
The Perl program will use the expected meanings; codeset=utf8
Locale 'univ.utf8' contains (at least) the following characters which have
unexpected meanings: $ + < = > ^ ` | ~
The Perl program will use the expected meanings; codeset=utf8
Locale 'univ.utf8' contains (at least) the following characters which have
unexpected meanings: $ + < = > ^ ` | ~
The Perl program will use the expected meanings; codeset=utf8
Locale 'univ.utf8' contains (at least) the following characters which have
unexpected meanings: $ + < = > ^ ` | ~
The Perl program will use the expected meanings; codeset=utf8
Locale 'univ.utf8' contains (at least) the following characters which have
unexpected meanings: $ + < = > ^ ` | ~
The Perl program will use the expected meanings; codeset=utf8
Locale 'univ.utf8' contains (at least) the following characters which have
unexpected meanings: $ + < = > ^ ` | ~
The Perl program will use the expected meanings; codeset=utf8
Locale 'univ.utf8' contains (at least) the following characters which have
unexpected meanings: $ + < = > ^ ` | ~
The Perl program will use the expected meanings; codeset=utf8
panic: numeric.c: 40: Trying to change LC_NUMERIC incompatibly at ../lib/locale.t line 2008.
c++: error: +Z: No such file or directory
# Will use Digest::MD5
# Connected to 127.0.0.1
syswrite() isn't allowed on :utf8 handles at t/Socket.t line 47.
# Looks like your test exited with 255 just after 2.
Integer overflow in hexadecimal number at t/broken_univ_can.t line 7.
make: *** [test_harness] Error 2

error while running harness target 'test_harness': 2 at /pro/3gl/CPAN/smoke/lib/Test/Smoke.pm line 194.
[2019-04-22 10:30:07METDST] 
[2019-04-22 10:30:07METDST] ../lib/B/Deparse.t..........................................PASSED
[2019-04-22 10:30:07METDST]     2
[2019-04-22 10:30:07METDST] ../lib/warnings.t...........................................FAILED
[2019-04-22 10:30:07METDST]     771-772
[2019-04-22 10:30:07METDST] ../lib/locale.t.............................................FAILED
[2019-04-22 10:30:07METDST]     No plan found in TAP output
[2019-04-22 10:30:07METDST] ../dist/Net-Ping/t/450_service.t............................PASSED
[2019-04-22 10:30:07METDST]     9, 18
[2019-04-22 10:30:07METDST] ../cpan/Socket/t/Socket.t...................................FAILED
[2019-04-22 10:30:07METDST]     Non-zero exit status: 255
[2019-04-22 10:30:07METDST] ../cpan/Socket/t/Socket.t...................................FAILED
[2019-04-22 10:30:07METDST]     Bad plan.  You planned 6 tests but ran 2.
[2019-04-22 10:30:07METDST] Archived results...
[2019-04-22 10:30:07METDST] Unskip tests from '/pro/3gl/CPAN/smoke/p59.skip'
[2019-04-22 10:30:07METDST] 
[2019-04-22 10:30:07METDST] Configuration: -Dusedevel -Duseithreads -Duse64bitall
[2019-04-22 10:30:07METDST] ------------------------------------------------------------------------------
[2019-04-22 10:30:07METDST] make distclean ...
[2019-04-22 10:32:38METDST] 
[2019-04-22 10:32:38METDST] Copy Policy.sh ...
[2019-04-22 10:32:38METDST] 
[2019-04-22 10:32:38METDST] Configure ...
5.29.10 <=> 5.014002
===== PROCURA Policy for hpux/cc ========================
===== PROCURA Policy results ============================
cc:         cc
ccversion:  -
gccversion: -
ccflags:     +Z -z
optimize:   
ld:         
ldflags:    -L/pro/local/lib
libswanted: cl pthread cl pthread socket bind inet nsl ndbm gdbm dbm db malloc dl ld sun m crypt sec util c cposix posix ucb bsd BSD
libsdirs:    /lib /pro/local/lib
locincpth:  /pro/local/include
loclibpth:  /pro/local/lib
useshrplib: 
===== PROCURA Policy done ===============================
[2019-04-22 10:34:44METDST] 
[2019-04-22 10:34:44METDST] make ...
mysterious name [ENTER_with_name(name)] in parts/apidoc.fnc, line 161
mysterious name [LEAVE_with_name(name)] in parts/apidoc.fnc, line 164
parts/inc/misc provides av_tindex, which is still marked todo for 5.17.9
parts/inc/misc provides av_top_index, which is still marked todo for 5.17.9
parts/inc/misc provides isALPHANUMERIC, which is still marked todo for 5.17.8
parts/inc/misc provides isIDCONT, which is still marked todo for 5.17.8
parts/inc/misc provides isOCTAL, which is still marked todo for 5.13.5
parts/inc/misc provides isWORDCHAR, which is still marked todo for 5.13.6
parts/inc/uv provides utf8_to_uvchr_buf, which is still marked todo for 5.15.9
parts/inc/mess provides vmess, which is still marked todo for 5.6.0
mysterious name [ENTER_with_name(name)] in parts/apidoc.fnc, line 161
mysterious name [LEAVE_with_name(name)] in parts/apidoc.fnc, line 164
parts/inc/misc provides av_tindex, which is still marked todo for 5.17.9
parts/inc/misc provides av_top_index, which is still marked todo for 5.17.9
parts/inc/misc provides isALPHANUMERIC, which is still marked todo for 5.17.8
parts/inc/misc provides isIDCONT, which is still marked todo for 5.17.8
parts/inc/misc provides isOCTAL, which is still marked todo for 5.13.5
parts/inc/misc provides isWORDCHAR, which is still marked todo for 5.13.6
parts/inc/uv provides utf8_to_uvchr_buf, which is still marked todo for 5.15.9
parts/inc/mess provides vmess, which is still marked todo for 5.6.0
Warning (mostly harmless): No library found for -lposix
Warning (mostly harmless): No library found for -lcposix
cc: warning 457: The Onolimit option is not valid at this optimization level.
Making header files for XS...
[2019-04-22 10:52:53METDST] Skip tests from '/pro/3gl/CPAN/smoke/p59.skip'
[2019-04-22 10:52:53METDST] 
[2019-04-22 10:52:53METDST]  Tests start here:
[2019-04-22 10:52:53METDST] TSTENV = stdio	
No saved state, selection will be empty
Cannot figure out an encoding to use at t/use-Encode-Alias.t line 5.
# parser guessed wrong encoding expected 'CP1252' got 'UTF-8'
# Connected to 127.0.0.1
# Connected to 127.0.0.1
Redefining sub xChild::foo at xChild--10489 line 2.
Redefining sub Data::ok at -e line 1.
c++: error: +Z: No such file or directory
c++: error: +O2: No such file or directory
c++: error: +Onolimit: No such file or directory
# Will use Digest::MD5
panic: numeric.c: 40: Trying to change LC_NUMERIC incompatibly at ../lib/locale.t line 2008.
PROG: 
use warnings 'uninitialized';

# aelem + const
use constant foo => \0;
$SIG{__WARN__} = sub {
 print STDERR
   $_[0] =~ /\$a\[([^]]+)]/ && $1 == foo
       ? "ok\n"
       : ("$1 != ",0+foo,"\n")
};
() = "$a[foo]";
undef $SIG{__WARN__};

# Multideref
() = "$a[140688675223280]";
EXPECTED:
ok
Use of uninitialized value $a[140688675223280] in string at - line 15.
GOT:
-9223372032559482568 != 9223372041150069048
Use of uninitialized value $a[140688675223280] in string at - line 15.
# Failed test 366 - 64-bit array subscripts at lib/warnings/9uninit line 2175
PROG: 
use warnings 'syntax';
@foo::bar = 1..3;
() = "$foo'bar";
() = "@foo'bar";
() = "$#foo'bar";
no warnings 'syntax' ;
() = "$foo'bar";
() = "@foo'bar";
() = "$#foo'bar";
EXPECTED:
Old package separator used in string at - line 3.
	(Did you mean "$foo\'bar" instead?)
Old package separator used in string at - line 4.
	(Did you mean "@foo\'bar" instead?)
Old package separator used in string at - line 5.
	(Did you mean "$#foo\'bar" instead?)
GOT:

# Failed test 771 - at lib/warnings/toke line 418
PROG: 
use warnings 'syntax'; use utf8;
@fooл::barл = 1..3;
() = "$fooл'barл";
() = "@fooл'barл";
() = "$#fooл'barл";
no warnings 'syntax' ;
() = "$fooл'barл";
() = "@fooл'barл";
() = "$#fooл'barл";
EXPECTED:
Old package separator used in string at - line 3.
	(Did you mean "$fooл\'barл" instead?)
Old package separator used in string at - line 4.
	(Did you mean "@fooл\'barл" instead?)
Old package separator used in string at - line 5.
	(Did you mean "$#fooл\'barл" instead?)
GOT:

# Failed test 772 - at lib/warnings/toke line 435
make: *** [test_harness] Error 3

error while running harness target 'test_harness': 2 at /pro/3gl/CPAN/smoke/lib/Test/Smoke.pm line 194.
[2019-04-22 12:36:11METDST] 
[2019-04-22 12:36:11METDST] ../dist/Net-Ping/t/450_service.t............................PASSED
[2019-04-22 12:36:11METDST]     9, 18
[2019-04-22 12:36:11METDST] ../lib/locale.t.............................................FAILED
[2019-04-22 12:36:11METDST]     No plan found in TAP output
[2019-04-22 12:36:11METDST] ../lib/warnings.t...........................................FAILED
[2019-04-22 12:36:11METDST]     366, 771-772
[2019-04-22 12:36:11METDST] Archived results...
[2019-04-22 12:36:11METDST] TSTENV = perlio	
PROG: 
use warnings 'uninitialized';

# aelem + const
use constant foo => \0;
$SIG{__WARN__} = sub {
 print STDERR
   $_[0] =~ /\$a\[([^]]+)]/ && $1 == foo
       ? "ok\n"
       : ("$1 != ",0+foo,"\n")
};
() = "$a[foo]";
undef $SIG{__WARN__};

# Multideref
() = "$a[140688675223280]";
EXPECTED:
ok
Use of uninitialized value $a[140688675223280] in string at - line 15.
GOT:
-9223372032559482152 != 9223372041150069464
Use of uninitialized value $a[140688675223280] in string at - line 15.
# Failed test 366 - 64-bit array subscripts at lib/warnings/9uninit line 2175
PROG: 
use warnings 'syntax';
@foo::bar = 1..3;
() = "$foo'bar";
() = "@foo'bar";
() = "$#foo'bar";
no warnings 'syntax' ;
() = "$foo'bar";
() = "@foo'bar";
() = "$#foo'bar";
EXPECTED:
Old package separator used in string at - line 3.
	(Did you mean "$foo\'bar" instead?)
Old package separator used in string at - line 4.
	(Did you mean "@foo\'bar" instead?)
Old package separator used in string at - line 5.
	(Did you mean "$#foo\'bar" instead?)
GOT:

# Failed test 771 - at lib/warnings/toke line 418
PROG: 
use warnings 'syntax'; use utf8;
@fooл::barл = 1..3;
() = "$fooл'barл";
() = "@fooл'barл";
() = "$#fooл'barл";
no warnings 'syntax' ;
() = "$fooл'barл";
() = "@fooл'barл";
() = "$#fooл'barл";
EXPECTED:
Old package separator used in string at - line 3.
	(Did you mean "$fooл\'barл" instead?)
Old package separator used in string at - line 4.
	(Did you mean "@fooл\'barл" instead?)
Old package separator used in string at - line 5.
	(Did you mean "$#fooл\'barл" instead?)
GOT:

# Failed test 772 - at lib/warnings/toke line 435
# parser guessed wrong encoding expected 'CP1252' got 'UTF-8'
c++: error: +Z: No such file or directory
c++: error: +O2: No such file or directory
c++: error: +Onolimit: No such file or directory
panic: numeric.c: 40: Trying to change LC_NUMERIC incompatibly at ../lib/locale.t line 2008.
# Will use Digest::MD5
# Connected to 127.0.0.1
# Connected to 127.0.0.1
Cannot figure out an encoding to use at t/use-Encode-Alias.t line 5.
make: *** [test_harness] Error 3

error while running harness target 'test_harness': 2 at /pro/3gl/CPAN/smoke/lib/Test/Smoke.pm line 194.
[2019-04-22 14:06:28METDST] 
[2019-04-22 14:06:28METDST] ../lib/warnings.t...........................................FAILED
[2019-04-22 14:06:28METDST]     366, 771-772
[2019-04-22 14:06:28METDST] ../lib/locale.t.............................................FAILED
[2019-04-22 14:06:28METDST]     No plan found in TAP output
[2019-04-22 14:06:28METDST] ../dist/Net-Ping/t/450_service.t............................PASSED
[2019-04-22 14:06:28METDST]     9, 18
[2019-04-22 14:06:28METDST] Archived results...
[2019-04-22 14:06:28METDST] TSTENV = locale:univ.utf8	
PROG: 
use warnings 'uninitialized';

# aelem + const
use constant foo => \0;
$SIG{__WARN__} = sub {
 print STDERR
   $_[0] =~ /\$a\[([^]]+)]/ && $1 == foo
       ? "ok\n"
       : ("$1 != ",0+foo,"\n")
};
() = "$a[foo]";
undef $SIG{__WARN__};

# Multideref
() = "$a[140688675223280]";
EXPECTED:
ok
Use of uninitialized value $a[140688675223280] in string at - line 15.
GOT:
-9223372032559481496 != 9223372041150070120
Use of uninitialized value $a[140688675223280] in string at - line 15.
# Failed test 366 - 64-bit array subscripts at lib/warnings/9uninit line 2175
PROG: 
use warnings 'syntax';
@foo::bar = 1..3;
() = "$foo'bar";
() = "@foo'bar";
() = "$#foo'bar";
no warnings 'syntax' ;
() = "$foo'bar";
() = "@foo'bar";
() = "$#foo'bar";
EXPECTED:
Old package separator used in string at - line 3.
	(Did you mean "$foo\'bar" instead?)
Old package separator used in string at - line 4.
	(Did you mean "@foo\'bar" instead?)
Old package separator used in string at - line 5.
	(Did you mean "$#foo\'bar" instead?)
GOT:

# Failed test 771 - at lib/warnings/toke line 418
PROG: 
use warnings 'syntax'; use utf8;
@fooл::barл = 1..3;
() = "$fooл'barл";
() = "@fooл'barл";
() = "$#fooл'barл";
no warnings 'syntax' ;
() = "$fooл'barл";
() = "@fooл'barл";
() = "$#fooл'barл";
EXPECTED:
Old package separator used in string at - line 3.
	(Did you mean "$fooл\'barл" instead?)
Old package separator used in string at - line 4.
	(Did you mean "@fooл\'barл" instead?)
Old package separator used in string at - line 5.
	(Did you mean "$#fooл\'barл" instead?)
GOT:

# Failed test 772 - at lib/warnings/toke line 435
panic: numeric.c: 40: Trying to change LC_NUMERIC incompatibly at ../lib/locale.t line 2008.
# parser guessed wrong encoding expected 'CP1252' got 'UTF-8'
Locale 'univ.utf8' contains (at least) the following characters which have
unexpected meanings: $ + < = > ^ ` | ~
The Perl program will use the expected meanings; codeset=utf8
Locale 'univ.utf8' contains (at least) the following characters which have
unexpected meanings: $ + < = > ^ ` | ~
The Perl program will use the expected meanings; codeset=utf8
Locale 'univ.utf8' contains (at least) the following characters which have
unexpected meanings: $ + < = > ^ ` | ~
The Perl program will use the expected meanings; codeset=utf8
Locale 'univ.utf8' contains (at least) the following characters which have
unexpected meanings: $ + < = > ^ ` | ~
The Perl program will use the expected meanings; codeset=utf8
Locale 'univ.utf8' contains (at least) the following characters which have
unexpected meanings: $ + < = > ^ ` | ~
The Perl program will use the expected meanings; codeset=utf8
Locale 'univ.utf8' contains (at least) the following characters which have
unexpected meanings: $ + < = > ^ ` | ~
The Perl program will use the expected meanings; codeset=utf8
Locale 'univ.utf8' contains (at least) the following characters which have
unexpected meanings: $ + < = > ^ ` | ~
The Perl program will use the expected meanings; codeset=utf8
Locale 'univ.utf8' contains (at least) the following characters which have
unexpected meanings: $ + < = > ^ ` | ~
The Perl program will use the expected meanings; codeset=utf8
Locale 'univ.utf8' contains (at least) the following characters which have
unexpected meanings: $ + < = > ^ ` | ~
The Perl program will use the expected meanings; codeset=utf8
Locale 'univ.utf8' contains (at least) the following characters which have
unexpected meanings: $ + < = > ^ ` | ~
The Perl program will use the expected meanings; codeset=utf8
Locale 'univ.utf8' contains (at least) the following characters which have
unexpected meanings: $ + < = > ^ ` | ~
The Perl program will use the expected meanings; codeset=utf8
Locale 'univ.utf8' contains (at least) the following characters which have
unexpected meanings: $ + < = > ^ ` | ~
The Perl program will use the expected meanings; codeset=utf8
Locale 'univ.utf8' contains (at least) the following characters which have
unexpected meanings: $ + < = > ^ ` | ~
The Perl program will use the expected meanings; codeset=utf8
Locale 'univ.utf8' contains (at least) the following characters which have
unexpected meanings: $ + < = > ^ ` | ~
The Perl program will use the expected meanings; codeset=utf8
Locale 'univ.utf8' contains (at least) the following characters which have
unexpected meanings: $ + < = > ^ ` | ~
The Perl program will use the expected meanings; codeset=utf8
c++: error: +Z: No such file or directory
c++: error: +O2: No such file or directory
c++: error: +Onolimit: No such file or directory
# Will use Digest::MD5
# Connected to 127.0.0.1
syswrite() isn't allowed on :utf8 handles at t/Socket.t line 47.
# Looks like your test exited with 255 just after 2.
make: *** [test_harness] Error 3

error while running harness target 'test_harness': 2 at /pro/3gl/CPAN/smoke/lib/Test/Smoke.pm line 194.
[2019-04-22 15:37:37METDST] 
[2019-04-22 15:37:37METDST] ../lib/warnings.t...........................................FAILED
[2019-04-22 15:37:37METDST]     366, 771-772
[2019-04-22 15:37:37METDST] ../lib/B/Deparse.t..........................................PASSED
[2019-04-22 15:37:37METDST]     2
[2019-04-22 15:37:37METDST] ../lib/locale.t.............................................FAILED
[2019-04-22 15:37:37METDST]     No plan found in TAP output
[2019-04-22 15:37:37METDST] ../dist/Net-Ping/t/450_service.t............................PASSED
[2019-04-22 15:37:37METDST]     9, 18
[2019-04-22 15:37:37METDST] ../cpan/Socket/t/Socket.t...................................FAILED
[2019-04-22 15:37:37METDST]     Non-zero exit status: 255
[2019-04-22 15:37:37METDST] ../cpan/Socket/t/Socket.t...................................FAILED
[2019-04-22 15:37:37METDST]     Bad plan.  You planned 6 tests but ran 2.
[2019-04-22 15:37:37METDST] Archived results...
[2019-04-22 15:37:37METDST] Unskip tests from '/pro/3gl/CPAN/smoke/p59.skip'
[2019-04-22 15:37:37METDST] 
[2019-04-22 15:37:37METDST] Configuration: -Dusedevel -Duseithreads -Duse64bitall -DDEBUGGING
[2019-04-22 15:37:37METDST] ------------------------------------------------------------------------------
[2019-04-22 15:37:37METDST] make distclean ...
[2019-04-22 15:39:11METDST] 
[2019-04-22 15:39:11METDST] Copy Policy.sh ...
[2019-04-22 15:39:11METDST] 
[2019-04-22 15:39:11METDST] Configure ...
5.29.10 <=> 5.014002
===== PROCURA Policy for hpux/cc ========================
===== PROCURA Policy results ============================
cc:         cc
ccversion:  -
gccversion: -
ccflags:    -DDEBUGGING +Z -z
optimize:   
ld:         
ldflags:    -L/pro/local/lib
libswanted: cl pthread cl pthread socket bind inet nsl ndbm gdbm dbm db malloc dl ld sun m crypt sec util c cposix posix ucb bsd BSD
libsdirs:    /lib /pro/local/lib
locincpth:  /pro/local/include
loclibpth:  /pro/local/lib
useshrplib: 
===== PROCURA Policy done ===============================
[2019-04-22 15:41:31METDST] 
[2019-04-22 15:41:31METDST] make ...
mysterious name [ENTER_with_name(name)] in parts/apidoc.fnc, line 161
mysterious name [LEAVE_with_name(name)] in parts/apidoc.fnc, line 164
parts/inc/misc provides av_tindex, which is still marked todo for 5.17.9
parts/inc/misc provides av_top_index, which is still marked todo for 5.17.9
parts/inc/misc provides isALPHANUMERIC, which is still marked todo for 5.17.8
parts/inc/misc provides isIDCONT, which is still marked todo for 5.17.8
parts/inc/misc provides isOCTAL, which is still marked todo for 5.13.5
parts/inc/misc provides isWORDCHAR, which is still marked todo for 5.13.6
parts/inc/uv provides utf8_to_uvchr_buf, which is still marked todo for 5.15.9
parts/inc/mess provides vmess, which is still marked todo for 5.6.0
mysterious name [ENTER_with_name(name)] in parts/apidoc.fnc, line 161
mysterious name [LEAVE_with_name(name)] in parts/apidoc.fnc, line 164
parts/inc/misc provides av_tindex, which is still marked todo for 5.17.9
parts/inc/misc provides av_top_index, which is still marked todo for 5.17.9
parts/inc/misc provides isALPHANUMERIC, which is still marked todo for 5.17.8
parts/inc/misc provides isIDCONT, which is still marked todo for 5.17.8
parts/inc/misc provides isOCTAL, which is still marked todo for 5.13.5
parts/inc/misc provides isWORDCHAR, which is still marked todo for 5.13.6
parts/inc/uv provides utf8_to_uvchr_buf, which is still marked todo for 5.15.9
parts/inc/mess provides vmess, which is still marked todo for 5.6.0
Warning (mostly harmless): No library found for -lposix
Warning (mostly harmless): No library found for -lcposix
cc: warning 457: The Onolimit option is not valid at this optimization level.
Making header files for XS...
[2019-04-22 16:12:43METDST] Skip tests from '/pro/3gl/CPAN/smoke/p59.skip'
[2019-04-22 16:12:43METDST] 
[2019-04-22 16:12:43METDST]  Tests start here:
[2019-04-22 16:12:43METDST] TSTENV = stdio	
No saved state, selection will be empty
panic: bad free, ->next->prev=800000010018d458, header=800000010018d458, ->prev->next=800000010018d461 at io/nargv.t line 62, <> line 1.
Cannot figure out an encoding to use at t/use-Encode-Alias.t line 5.
# parser guessed wrong encoding expected 'CP1252' got 'UTF-8'
# Connected to 127.0.0.1
# Connected to 127.0.0.1
Redefining sub xChild::foo at xChild--27343 line 2.
Redefining sub Data::ok at -e line 1.
c++: error: +Z: No such file or directory
c++: error: +O2: No such file or directory
c++: error: +Onolimit: No such file or directory
# Will use Digest::MD5
panic: numeric.c: 40: Trying to change LC_NUMERIC incompatibly at ../lib/locale.t line 2008.
PROG: 
use warnings 'uninitialized';

# aelem + const
use constant foo => \0;
$SIG{__WARN__} = sub {
 print STDERR
   $_[0] =~ /\$a\[([^]]+)]/ && $1 == foo
       ? "ok\n"
       : ("$1 != ",0+foo,"\n")
};
() = "$a[foo]";
undef $SIG{__WARN__};

# Multideref
() = "$a[140688675223280]";
EXPECTED:
ok
Use of uninitialized value $a[140688675223280] in string at - line 15.
GOT:
-9223372032558186664 != 9223372041151364952
Use of uninitialized value $a[140688675223280] in string at - line 15.
# Failed test 366 - 64-bit array subscripts at lib/warnings/9uninit line 2175
PROG: 
use warnings 'syntax';
@foo::bar = 1..3;
() = "$foo'bar";
() = "@foo'bar";
() = "$#foo'bar";
no warnings 'syntax' ;
() = "$foo'bar";
() = "@foo'bar";
() = "$#foo'bar";
EXPECTED:
Old package separator used in string at - line 3.
	(Did you mean "$foo\'bar" instead?)
Old package separator used in string at - line 4.
	(Did you mean "@foo\'bar" instead?)
Old package separator used in string at - line 5.
	(Did you mean "$#foo\'bar" instead?)
GOT:

# Failed test 771 - at lib/warnings/toke line 418
PROG: 
use warnings 'syntax'; use utf8;
@fooл::barл = 1..3;
() = "$fooл'barл";
() = "@fooл'barл";
() = "$#fooл'barл";
no warnings 'syntax' ;
() = "$fooл'barл";
() = "@fooл'barл";
() = "$#fooл'barл";
EXPECTED:
Old package separator used in string at - line 3.
	(Did you mean "$fooл\'barл" instead?)
Old package separator used in string at - line 4.
	(Did you mean "@fooл\'barл" instead?)
Old package separator used in string at - line 5.
	(Did you mean "$#fooл\'barл" instead?)
GOT:

# Failed test 772 - at lib/warnings/toke line 435
make: *** [test_harness] Error 3

error while running harness target 'test_harness': 2 at /pro/3gl/CPAN/smoke/lib/Test/Smoke.pm line 194.
[2019-04-22 18:17:18METDST] 
[2019-04-22 18:17:18METDST] ../t/io/nargv.t.............................................FAILED
[2019-04-22 18:17:18METDST]     Bad plan.  You planned 7 tests but ran 5.
[2019-04-22 18:17:18METDST] ../dist/Net-Ping/t/450_service.t............................PASSED
[2019-04-22 18:17:18METDST]     9, 18
[2019-04-22 18:17:18METDST] ../lib/locale.t.............................................FAILED
[2019-04-22 18:17:18METDST]     No plan found in TAP output
[2019-04-22 18:17:18METDST] ../lib/warnings.t...........................................FAILED
[2019-04-22 18:17:18METDST]     366, 771-772
[2019-04-22 18:17:18METDST] Archived results...
[2019-04-22 18:17:18METDST] TSTENV = perlio	
PROG: 
use warnings 'uninitialized';

# aelem + const
use constant foo => \0;
$SIG{__WARN__} = sub {
 print STDERR
   $_[0] =~ /\$a\[([^]]+)]/ && $1 == foo
       ? "ok\n"
       : ("$1 != ",0+foo,"\n")
};
() = "$a[foo]";
undef $SIG{__WARN__};

# Multideref
() = "$a[140688675223280]";
EXPECTED:
ok
Use of uninitialized value $a[140688675223280] in string at - line 15.
GOT:
-9223372032558186136 != 9223372041151365480
Use of uninitialized value $a[140688675223280] in string at - line 15.
# Failed test 366 - 64-bit array subscripts at lib/warnings/9uninit line 2175
PROG: 
use warnings 'syntax';
@foo::bar = 1..3;
() = "$foo'bar";
() = "@foo'bar";
() = "$#foo'bar";
no warnings 'syntax' ;
() = "$foo'bar";
() = "@foo'bar";
() = "$#foo'bar";
EXPECTED:
Old package separator used in string at - line 3.
	(Did you mean "$foo\'bar" instead?)
Old package separator used in string at - line 4.
	(Did you mean "@foo\'bar" instead?)
Old package separator used in string at - line 5.
	(Did you mean "$#foo\'bar" instead?)
GOT:

# Failed test 771 - at lib/warnings/toke line 418
PROG: 
use warnings 'syntax'; use utf8;
@fooл::barл = 1..3;
() = "$fooл'barл";
() = "@fooл'barл";
() = "$#fooл'barл";
no warnings 'syntax' ;
() = "$fooл'barл";
() = "@fooл'barл";
() = "$#fooл'barл";
EXPECTED:
Old package separator used in string at - line 3.
	(Did you mean "$fooл\'barл" instead?)
Old package separator used in string at - line 4.
	(Did you mean "@fooл\'barл" instead?)
Old package separator used in string at - line 5.
	(Did you mean "$#fooл\'barл" instead?)
GOT:

# Failed test 772 - at lib/warnings/toke line 435
# parser guessed wrong encoding expected 'CP1252' got 'UTF-8'
c++: error: +Z: No such file or directory
c++: error: +O2: No such file or directory
c++: error: +Onolimit: No such file or directory
panic: numeric.c: 40: Trying to change LC_NUMERIC incompatibly at ../lib/locale.t line 2008.
# Will use Digest::MD5
# Connected to 127.0.0.1
# Connected to 127.0.0.1
Cannot figure out an encoding to use at t/use-Encode-Alias.t line 5.
make: *** [test_harness] Error 3

error while running harness target 'test_harness': 2 at /pro/3gl/CPAN/smoke/lib/Test/Smoke.pm line 194.
[2019-04-22 20:08:25METDST] 
[2019-04-22 20:08:25METDST] ../lib/warnings.t...........................................FAILED
[2019-04-22 20:08:25METDST]     366, 771-772
[2019-04-22 20:08:25METDST] ../dist/Thread-Queue/t/03_peek.t............................FAILED
[2019-04-22 20:08:25METDST]     Bad plan.  You planned 19 tests but ran 1.
[2019-04-22 20:08:25METDST] ../lib/locale.t.............................................FAILED
[2019-04-22 20:08:25METDST]     No plan found in TAP output
[2019-04-22 20:08:25METDST] ../dist/Net-Ping/t/450_service.t............................PASSED
[2019-04-22 20:08:25METDST]     9, 18
[2019-04-22 20:08:25METDST] Archived results...
[2019-04-22 20:08:25METDST] TSTENV = locale:univ.utf8	
PROG: 
use warnings 'uninitialized';

# aelem + const
use constant foo => \0;
$SIG{__WARN__} = sub {
 print STDERR
   $_[0] =~ /\$a\[([^]]+)]/ && $1 == foo
       ? "ok\n"
       : ("$1 != ",0+foo,"\n")
};
() = "$a[foo]";
undef $SIG{__WARN__};

# Multideref
() = "$a[140688675223280]";
EXPECTED:
ok
Use of uninitialized value $a[140688675223280] in string at - line 15.
GOT:
-9223372032558185440 != 9223372041151366176
Use of uninitialized value $a[140688675223280] in string at - line 15.
# Failed test 366 - 64-bit array subscripts at lib/warnings/9uninit line 2175
PROG: 
use warnings 'syntax';
@foo::bar = 1..3;
() = "$foo'bar";
() = "@foo'bar";
() = "$#foo'bar";
no warnings 'syntax' ;
() = "$foo'bar";
() = "@foo'bar";
() = "$#foo'bar";
EXPECTED:
Old package separator used in string at - line 3.
	(Did you mean "$foo\'bar" instead?)
Old package separator used in string at - line 4.
	(Did you mean "@foo\'bar" instead?)
Old package separator used in string at - line 5.
	(Did you mean "$#foo\'bar" instead?)
GOT:

# Failed test 771 - at lib/warnings/toke line 418
PROG: 
use warnings 'syntax'; use utf8;
@fooл::barл = 1..3;
() = "$fooл'barл";
() = "@fooл'barл";
() = "$#fooл'barл";
no warnings 'syntax' ;
() = "$fooл'barл";
() = "@fooл'barл";
() = "$#fooл'barл";
EXPECTED:
Old package separator used in string at - line 3.
	(Did you mean "$fooл\'barл" instead?)
Old package separator used in string at - line 4.
	(Did you mean "@fooл\'barл" instead?)
Old package separator used in string at - line 5.
	(Did you mean "$#fooл\'barл" instead?)
GOT:

# Failed test 772 - at lib/warnings/toke line 435
# parser guessed wrong encoding expected 'CP1252' got 'UTF-8'
panic: numeric.c: 40: Trying to change LC_NUMERIC incompatibly at ../lib/locale.t line 2008.
Locale 'univ.utf8' contains (at least) the following characters which have
unexpected meanings: $ + < = > ^ ` | ~
The Perl program will use the expected meanings; codeset=utf8
Locale 'univ.utf8' contains (at least) the following characters which have
unexpected meanings: $ + < = > ^ ` | ~
The Perl program will use the expected meanings; codeset=utf8
Locale 'univ.utf8' contains (at least) the following characters which have
unexpected meanings: $ + < = > ^ ` | ~
The Perl program will use the expected meanings; codeset=utf8
Locale 'univ.utf8' contains (at least) the following characters which have
unexpected meanings: $ + < = > ^ ` | ~
The Perl program will use the expected meanings; codeset=utf8
Locale 'univ.utf8' contains (at least) the following characters which have
unexpected meanings: $ + < = > ^ ` | ~
The Perl program will use the expected meanings; codeset=utf8
Locale 'univ.utf8' contains (at least) the following characters which have
unexpected meanings: $ + < = > ^ ` | ~
The Perl program will use the expected meanings; codeset=utf8
Locale 'univ.utf8' contains (at least) the following characters which have
unexpected meanings: $ + < = > ^ ` | ~
The Perl program will use the expected meanings; codeset=utf8
Locale 'univ.utf8' contains (at least) the following characters which have
unexpected meanings: $ + < = > ^ ` | ~
The Perl program will use the expected meanings; codeset=utf8
Locale 'univ.utf8' contains (at least) the following characters which have
unexpected meanings: $ + < = > ^ ` | ~
The Perl program will use the expected meanings; codeset=utf8
Locale 'univ.utf8' contains (at least) the following characters which have
unexpected meanings: $ + < = > ^ ` | ~
The Perl program will use the expected meanings; codeset=utf8
Locale 'univ.utf8' contains (at least) the following characters which have
unexpected meanings: $ + < = > ^ ` | ~
The Perl program will use the expected meanings; codeset=utf8
Locale 'univ.utf8' contains (at least) the following characters which have
unexpected meanings: $ + < = > ^ ` | ~
The Perl program will use the expected meanings; codeset=utf8
Locale 'univ.utf8' contains (at least) the following characters which have
unexpected meanings: $ + < = > ^ ` | ~
The Perl program will use the expected meanings; codeset=utf8
Locale 'univ.utf8' contains (at least) the following characters which have
unexpected meanings: $ + < = > ^ ` | ~
The Perl program will use the expected meanings; codeset=utf8
Locale 'univ.utf8' contains (at least) the following characters which have
unexpected meanings: $ + < = > ^ ` | ~
The Perl program will use the expected meanings; codeset=utf8
c++: error: +Z: No such file or directory
c++: error: +O2: No such file or directory
c++: error: +Onolimit: No such file or directory
# Connected to 127.0.0.1
syswrite() isn't allowed on :utf8 handles at t/Socket.t line 47.
# Looks like your test exited with 255 just after 2.
# Will use Digest::MD5
make: *** [test_harness] Error 3

error while running harness target 'test_harness': 2 at /pro/3gl/CPAN/smoke/lib/Test/Smoke.pm line 194.
[2019-04-22 22:03:16METDST] 
[2019-04-22 22:03:16METDST] ../lib/warnings.t...........................................FAILED
[2019-04-22 22:03:16METDST]     366, 771-772
[2019-04-22 22:03:16METDST] ../lib/B/Deparse.t..........................................PASSED
[2019-04-22 22:03:16METDST]     2
[2019-04-22 22:03:16METDST] ../lib/locale.t.............................................FAILED
[2019-04-22 22:03:16METDST]     No plan found in TAP output
[2019-04-22 22:03:16METDST] ../dist/Net-Ping/t/450_service.t............................PASSED
[2019-04-22 22:03:16METDST]     9, 18
[2019-04-22 22:03:16METDST] ../cpan/Socket/t/Socket.t...................................FAILED
[2019-04-22 22:03:16METDST]     Non-zero exit status: 255
[2019-04-22 22:03:16METDST] ../cpan/Socket/t/Socket.t...................................FAILED
[2019-04-22 22:03:16METDST]     Bad plan.  You planned 6 tests but ran 2.
[2019-04-22 22:03:16METDST] Archived results...
[2019-04-22 22:03:16METDST] Unskip tests from '/pro/3gl/CPAN/smoke/p59.skip'
[2019-04-22 22:03:16METDST] Finished smoking 261e14b0fc345af01a05bb5c9d2093042f05018b v5.29.10-3-g261e14b0fc blead
[2019-04-22 22:03:16METDST] Reading smokeresult from /pro/3gl/CPAN/perl-current/mktest.out
[2019-04-22 22:03:16METDST] Processing []
[2019-04-22 22:03:16METDST] Processing [-DDEBUGGING]
[2019-04-22 22:03:16METDST] Processing [-Duse64bitall]
[2019-04-22 22:03:16METDST] Processing [-DDEBUGGING -Duse64bitall]
[2019-04-22 22:03:16METDST] Processing [-Duseithreads]
[2019-04-22 22:03:16METDST] Processing [-DDEBUGGING -Duseithreads]
[2019-04-22 22:03:16METDST] Processing [-Duseithreads -Duse64bitall]
[2019-04-22 22:03:16METDST] Processing [-DDEBUGGING -Duseithreads -Duse64bitall]
[2019-04-22 22:03:16METDST] Writing report to '/pro/3gl/CPAN/perl-current/mktest.rpt'
[2019-04-22 22:03:17METDST] Locally applied patches from '/pro/3gl/CPAN/perl-current/patchlevel.h'
[2019-04-22 22:03:17METDST] Patches: 'uncommitted-changes;SMOKE261e14b0fc345af01a05bb5c9d2093042f05018b'
[2019-04-22 22:03:17METDST] Looking for cc messages: 'hpux'
-- 
Report generated by Test::Smoke::Gateway v0.09_01