Show report
Skipping synctree
[2019-03-21 22:00:09MET] Reading build configurations from /pro/3gl/CPAN/smoke/p59.cfg
[2019-03-21 22:00:09MET] Reading 'Policy.sh' from ../Policy.sh (v=1)
[2019-03-21 22:00:09MET] Running test suite only with 'harness'.
[2019-03-21 22:00:09MET] make distclean ...
[2019-03-21 22:00:09MET] Smoking patch b877c1ff7374e89bad1d494c2a847af552d40782 v5.29.9-12-gb877c1ff73
[2019-03-21 22:00:09MET] Smoking branch blead
[2019-03-21 22:00:10MET] 
[2019-03-21 22:00:10MET] Configuration: -Dusedevel
[2019-03-21 22:00:10MET] ------------------------------------------------------------------------------
[2019-03-21 22:00:10MET] make distclean ...
[2019-03-21 22:00:10MET] 
[2019-03-21 22:00:10MET] Copy Policy.sh ...
[2019-03-21 22:00:10MET] 
[2019-03-21 22:00:10MET] Configure ...
5.29.10 <=> 5.014002
===== PROCURA Policy for hpux/cc ========================
===== PROCURA Policy results ============================
cc:         cc
ccversion:  -
gccversion: -
ccflags:     +Z -z
optimize:   
ld:         
ldflags:    -L/pro/local/lib
libswanted: cl pthread cl pthread socket bind inet nsl ndbm gdbm dbm db malloc dl ld sun m crypt sec util c cposix posix ucb bsd BSD
libsdirs:    /lib /pro/local/lib
locincpth:  /pro/local/include
loclibpth:  /pro/local/lib
useshrplib: 
===== PROCURA Policy done ===============================
[2019-03-21 22:02:00MET] 
[2019-03-21 22:02:00MET] make ...
parts/inc/mess provides vmess, which is still marked todo for 5.6.0
parts/inc/mess provides vmess, which is still marked todo for 5.6.0
Warning (mostly harmless): No library found for -lposix
Warning (mostly harmless): No library found for -lcposix
cc: warning 457: The Onolimit option is not valid at this optimization level.
Making header files for XS...
[2019-03-21 22:17:52MET] Skip tests from '/pro/3gl/CPAN/smoke/p59.skip'
[2019-03-21 22:17:52MET] 
[2019-03-21 22:17:52MET]  Tests start here:
[2019-03-21 22:17:52MET] TSTENV = stdio	
No saved state, selection will be empty
Cannot figure out an encoding to use at t/use-Encode-Alias.t line 5.
# parser guessed wrong encoding expected 'CP1252' got 'UTF-8'
# Connected to 127.0.0.1
# Connected to 127.0.0.1
Integer overflow in hexadecimal number at t/broken_univ_can.t line 7.
Redefining sub xChild::foo at xChild--17017 line 2.
Redefining sub Data::ok at -e line 1.
c++: error: +Z: No such file or directory
c++: error: +O2: No such file or directory
c++: error: +Onolimit: No such file or directory
# Will use Digest::MD5
PROG: 
use warnings 'syntax';
@foo::bar = 1..3;
() = "$foo'bar";
() = "@foo'bar";
() = "$#foo'bar";
no warnings 'syntax' ;
() = "$foo'bar";
() = "@foo'bar";
() = "$#foo'bar";
EXPECTED:
Old package separator used in string at - line 3.
	(Did you mean "$foo\'bar" instead?)
Old package separator used in string at - line 4.
	(Did you mean "@foo\'bar" instead?)
Old package separator used in string at - line 5.
	(Did you mean "$#foo\'bar" instead?)
GOT:

# Failed test 771 - at lib/warnings/toke line 418
PROG: 
use warnings 'syntax'; use utf8;
@fooл::barл = 1..3;
() = "$fooл'barл";
() = "@fooл'barл";
() = "$#fooл'barл";
no warnings 'syntax' ;
() = "$fooл'barл";
() = "@fooл'barл";
() = "$#fooл'barл";
EXPECTED:
Old package separator used in string at - line 3.
	(Did you mean "$fooл\'barл" instead?)
Old package separator used in string at - line 4.
	(Did you mean "@fooл\'barл" instead?)
Old package separator used in string at - line 5.
	(Did you mean "$#fooл\'barл" instead?)
GOT:

# Failed test 772 - at lib/warnings/toke line 435
make: *** [test_harness] Error 5

error while running harness target 'test_harness': 2 at /pro/3gl/CPAN/smoke/lib/Test/Smoke.pm line 194.
[2019-03-21 23:44:48MET] 
[2019-03-21 23:44:48MET] ../cpan/Module-Metadata/t/extract-version.t.................PASSED
[2019-03-21 23:44:48MET]     7, 11, 15, 19, 23, 27, 31, 35, 39, 43, 47
[2019-03-21 23:44:48MET]     51, 55, 59, 63, 67, 71, 75, 79, 83, 87
[2019-03-21 23:44:48MET]     91, 95, 99, 106, 110, 114, 118, 122, 126
[2019-03-21 23:44:48MET]     130, 134, 138, 142, 149, 153, 157, 161
[2019-03-21 23:44:48MET]     165, 169, 173, 177, 181, 185, 195, 199
[2019-03-21 23:44:48MET]     203
[2019-03-21 23:44:48MET] ../dist/Net-Ping/t/450_service.t............................PASSED
[2019-03-21 23:44:48MET]     9, 18
[2019-03-21 23:44:48MET] ../lib/locale.t.............................................FAILED
[2019-03-21 23:44:48MET]     431-432, 498
[2019-03-21 23:44:48MET] ../lib/warnings.t...........................................FAILED
[2019-03-21 23:44:48MET]     771-772
[2019-03-21 23:44:48MET] Archived results...
[2019-03-21 23:44:48MET] TSTENV = perlio	
PROG: 
use warnings 'syntax';
@foo::bar = 1..3;
() = "$foo'bar";
() = "@foo'bar";
() = "$#foo'bar";
no warnings 'syntax' ;
() = "$foo'bar";
() = "@foo'bar";
() = "$#foo'bar";
EXPECTED:
Old package separator used in string at - line 3.
	(Did you mean "$foo\'bar" instead?)
Old package separator used in string at - line 4.
	(Did you mean "@foo\'bar" instead?)
Old package separator used in string at - line 5.
	(Did you mean "$#foo\'bar" instead?)
GOT:

# Failed test 771 - at lib/warnings/toke line 418
PROG: 
use warnings 'syntax'; use utf8;
@fooл::barл = 1..3;
() = "$fooл'barл";
() = "@fooл'barл";
() = "$#fooл'barл";
no warnings 'syntax' ;
() = "$fooл'barл";
() = "@fooл'barл";
() = "$#fooл'barл";
EXPECTED:
Old package separator used in string at - line 3.
	(Did you mean "$fooл\'barл" instead?)
Old package separator used in string at - line 4.
	(Did you mean "@fooл\'barл" instead?)
Old package separator used in string at - line 5.
	(Did you mean "$#fooл\'barл" instead?)
GOT:

# Failed test 772 - at lib/warnings/toke line 435
# parser guessed wrong encoding expected 'CP1252' got 'UTF-8'
c++: error: +Z: No such file or directory
c++: error: +O2: No such file or directory
c++: error: +Onolimit: No such file or directory
# Will use Digest::MD5
# Connected to 127.0.0.1
# Connected to 127.0.0.1
Cannot figure out an encoding to use at t/use-Encode-Alias.t line 5.
Integer overflow in hexadecimal number at t/broken_univ_can.t line 7.
make: *** [test_harness] Error 5

error while running harness target 'test_harness': 2 at /pro/3gl/CPAN/smoke/lib/Test/Smoke.pm line 194.
[2019-03-22 00:57:47MET] 
[2019-03-22 00:57:47MET] ../lib/warnings.t...........................................FAILED
[2019-03-22 00:57:47MET]     771-772
[2019-03-22 00:57:47MET] ../lib/locale.t.............................................FAILED
[2019-03-22 00:57:47MET]     431-432, 498
[2019-03-22 00:57:47MET] ../dist/Net-Ping/t/450_service.t............................PASSED
[2019-03-22 00:57:47MET]     9, 18
[2019-03-22 00:57:47MET] ../cpan/Module-Metadata/t/extract-version.t.................PASSED
[2019-03-22 00:57:47MET]     7, 11, 15, 19, 23, 27, 31, 35, 39, 43, 47
[2019-03-22 00:57:47MET]     51, 55, 59, 63, 67, 71, 75, 79, 83, 87
[2019-03-22 00:57:47MET]     91, 95, 99, 106, 110, 114, 118, 122, 126
[2019-03-22 00:57:47MET]     130, 134, 138, 142, 149, 153, 157, 161
[2019-03-22 00:57:47MET]     165, 169, 173, 177, 181, 185, 195, 199
[2019-03-22 00:57:47MET]     203
[2019-03-22 00:57:47MET] Archived results...
[2019-03-22 00:57:47MET] TSTENV = locale:univ.utf8	
PROG: 
use warnings 'syntax';
@foo::bar = 1..3;
() = "$foo'bar";
() = "@foo'bar";
() = "$#foo'bar";
no warnings 'syntax' ;
() = "$foo'bar";
() = "@foo'bar";
() = "$#foo'bar";
EXPECTED:
Old package separator used in string at - line 3.
	(Did you mean "$foo\'bar" instead?)
Old package separator used in string at - line 4.
	(Did you mean "@foo\'bar" instead?)
Old package separator used in string at - line 5.
	(Did you mean "$#foo\'bar" instead?)
GOT:

# Failed test 771 - at lib/warnings/toke line 418
PROG: 
use warnings 'syntax'; use utf8;
@fooл::barл = 1..3;
() = "$fooл'barл";
() = "@fooл'barл";
() = "$#fooл'barл";
no warnings 'syntax' ;
() = "$fooл'barл";
() = "@fooл'barл";
() = "$#fooл'barл";
EXPECTED:
Old package separator used in string at - line 3.
	(Did you mean "$fooл\'barл" instead?)
Old package separator used in string at - line 4.
	(Did you mean "@fooл\'barл" instead?)
Old package separator used in string at - line 5.
	(Did you mean "$#fooл\'barл" instead?)
GOT:

# Failed test 772 - at lib/warnings/toke line 435
# parser guessed wrong encoding expected 'CP1252' got 'UTF-8'
c++: error: +Z: No such file or directory
c++: error: +O2: No such file or directory
c++: error: +Onolimit: No such file or directory
Locale 'univ.utf8' contains (at least) the following characters which have
unexpected meanings: $ + < = > ^ ` | ~
The Perl program will use the expected meanings; codeset=utf8
Locale 'univ.utf8' contains (at least) the following characters which have
unexpected meanings: $ + < = > ^ ` | ~
The Perl program will use the expected meanings; codeset=utf8
Locale 'univ.utf8' contains (at least) the following characters which have
unexpected meanings: $ + < = > ^ ` | ~
The Perl program will use the expected meanings; codeset=utf8
Locale 'univ.utf8' contains (at least) the following characters which have
unexpected meanings: $ + < = > ^ ` | ~
The Perl program will use the expected meanings; codeset=utf8
Locale 'univ.utf8' contains (at least) the following characters which have
unexpected meanings: $ + < = > ^ ` | ~
The Perl program will use the expected meanings; codeset=utf8
Locale 'univ.utf8' contains (at least) the following characters which have
unexpected meanings: $ + < = > ^ ` | ~
The Perl program will use the expected meanings; codeset=utf8
Locale 'univ.utf8' contains (at least) the following characters which have
unexpected meanings: $ + < = > ^ ` | ~
The Perl program will use the expected meanings; codeset=utf8
Locale 'univ.utf8' contains (at least) the following characters which have
unexpected meanings: $ + < = > ^ ` | ~
The Perl program will use the expected meanings; codeset=utf8
Locale 'univ.utf8' contains (at least) the following characters which have
unexpected meanings: $ + < = > ^ ` | ~
The Perl program will use the expected meanings; codeset=utf8
Locale 'univ.utf8' contains (at least) the following characters which have
unexpected meanings: $ + < = > ^ ` | ~
The Perl program will use the expected meanings; codeset=utf8
Locale 'univ.utf8' contains (at least) the following characters which have
unexpected meanings: $ + < = > ^ ` | ~
The Perl program will use the expected meanings; codeset=utf8
Locale 'univ.utf8' contains (at least) the following characters which have
unexpected meanings: $ + < = > ^ ` | ~
The Perl program will use the expected meanings; codeset=utf8
Locale 'univ.utf8' contains (at least) the following characters which have
unexpected meanings: $ + < = > ^ ` | ~
The Perl program will use the expected meanings; codeset=utf8
Locale 'univ.utf8' contains (at least) the following characters which have
unexpected meanings: $ + < = > ^ ` | ~
The Perl program will use the expected meanings; codeset=utf8
Locale 'univ.utf8' contains (at least) the following characters which have
unexpected meanings: $ + < = > ^ ` | ~
The Perl program will use the expected meanings; codeset=utf8
# Connected to 127.0.0.1
syswrite() isn't allowed on :utf8 handles at t/Socket.t line 47.
# Looks like your test exited with 255 just after 2.
Integer overflow in hexadecimal number at t/broken_univ_can.t line 7.
# Will use Digest::MD5
make: *** [test_harness] Error 5

error while running harness target 'test_harness': 2 at /pro/3gl/CPAN/smoke/lib/Test/Smoke.pm line 194.
[2019-03-22 02:11:24MET] 
[2019-03-22 02:11:24MET] ../lib/warnings.t...........................................FAILED
[2019-03-22 02:11:24MET]     771-772
[2019-03-22 02:11:24MET] ../lib/locale.t.............................................FAILED
[2019-03-22 02:11:24MET]     431-432, 498
[2019-03-22 02:11:24MET] ../lib/B/Deparse.t..........................................PASSED
[2019-03-22 02:11:24MET]     2
[2019-03-22 02:11:24MET] ../cpan/Module-Metadata/t/extract-version.t.................PASSED
[2019-03-22 02:11:24MET]     7, 11, 15, 19, 23, 27, 31, 35, 39, 43, 47
[2019-03-22 02:11:24MET]     51, 55, 59, 63, 67, 71, 75, 79, 83, 87
[2019-03-22 02:11:24MET]     91, 95, 99, 106, 110, 114, 118, 122, 126
[2019-03-22 02:11:24MET]     130, 134, 138, 142, 149, 153, 157, 161
[2019-03-22 02:11:24MET]     165, 169, 173, 177, 181, 185, 195, 199
[2019-03-22 02:11:24MET]     203
[2019-03-22 02:11:24MET] ../cpan/Socket/t/Socket.t...................................FAILED
[2019-03-22 02:11:24MET]     Non-zero exit status: 255
[2019-03-22 02:11:24MET] ../cpan/Socket/t/Socket.t...................................FAILED
[2019-03-22 02:11:24MET]     Bad plan.  You planned 6 tests but ran 2.
[2019-03-22 02:11:24MET] ../dist/Net-Ping/t/450_service.t............................PASSED
[2019-03-22 02:11:24MET]     9, 18
[2019-03-22 02:11:24MET] Archived results...
[2019-03-22 02:11:24MET] Unskip tests from '/pro/3gl/CPAN/smoke/p59.skip'
[2019-03-22 02:11:24MET] 
[2019-03-22 02:11:24MET] Configuration: -Dusedevel -DDEBUGGING
[2019-03-22 02:11:24MET] ------------------------------------------------------------------------------
[2019-03-22 02:11:24MET] make distclean ...
[2019-03-22 02:12:51MET] 
[2019-03-22 02:12:51MET] Copy Policy.sh ...
[2019-03-22 02:12:51MET] 
[2019-03-22 02:12:51MET] Configure ...
5.29.10 <=> 5.014002
===== PROCURA Policy for hpux/cc ========================
===== PROCURA Policy results ============================
cc:         cc
ccversion:  -
gccversion: -
ccflags:    -DDEBUGGING +Z -z
optimize:   
ld:         
ldflags:    -L/pro/local/lib
libswanted: cl pthread cl pthread socket bind inet nsl ndbm gdbm dbm db malloc dl ld sun m crypt sec util c cposix posix ucb bsd BSD
libsdirs:    /lib /pro/local/lib
locincpth:  /pro/local/include
loclibpth:  /pro/local/lib
useshrplib: 
===== PROCURA Policy done ===============================
[2019-03-22 02:14:52MET] 
[2019-03-22 02:14:52MET] make ...
parts/inc/mess provides vmess, which is still marked todo for 5.6.0
parts/inc/mess provides vmess, which is still marked todo for 5.6.0
Warning (mostly harmless): No library found for -lposix
Warning (mostly harmless): No library found for -lcposix
Making header files for XS...
[2019-03-22 02:42:04MET] Skip tests from '/pro/3gl/CPAN/smoke/p59.skip'
[2019-03-22 02:42:04MET] 
[2019-03-22 02:42:04MET]  Tests start here:
[2019-03-22 02:42:04MET] TSTENV = stdio	
No saved state, selection will be empty
Cannot figure out an encoding to use at t/use-Encode-Alias.t line 5.
# parser guessed wrong encoding expected 'CP1252' got 'UTF-8'
# Connected to 127.0.0.1
# Connected to 127.0.0.1
Integer overflow in hexadecimal number at t/broken_univ_can.t line 7.
Redefining sub xChild::foo at xChild--649 line 2.
Redefining sub Data::ok at -e line 1.
c++: error: +Z: No such file or directory
# Will use Digest::MD5
PROG: 
use warnings 'syntax';
@foo::bar = 1..3;
() = "$foo'bar";
() = "@foo'bar";
() = "$#foo'bar";
no warnings 'syntax' ;
() = "$foo'bar";
() = "@foo'bar";
() = "$#foo'bar";
EXPECTED:
Old package separator used in string at - line 3.
	(Did you mean "$foo\'bar" instead?)
Old package separator used in string at - line 4.
	(Did you mean "@foo\'bar" instead?)
Old package separator used in string at - line 5.
	(Did you mean "$#foo\'bar" instead?)
GOT:

# Failed test 771 - at lib/warnings/toke line 418
PROG: 
use warnings 'syntax'; use utf8;
@fooл::barл = 1..3;
() = "$fooл'barл";
() = "@fooл'barл";
() = "$#fooл'barл";
no warnings 'syntax' ;
() = "$fooл'barл";
() = "@fooл'barл";
() = "$#fooл'barл";
EXPECTED:
Old package separator used in string at - line 3.
	(Did you mean "$fooл\'barл" instead?)
Old package separator used in string at - line 4.
	(Did you mean "@fooл\'barл" instead?)
Old package separator used in string at - line 5.
	(Did you mean "$#fooл\'barл" instead?)
GOT:

# Failed test 772 - at lib/warnings/toke line 435
make: *** [test_harness] Error 5

error while running harness target 'test_harness': 2 at /pro/3gl/CPAN/smoke/lib/Test/Smoke.pm line 194.
[2019-03-22 05:22:45MET] 
[2019-03-22 05:22:45MET] ../cpan/Module-Metadata/t/extract-version.t.................PASSED
[2019-03-22 05:22:45MET]     7, 11, 15, 19, 23, 27, 31, 35, 39, 43, 47
[2019-03-22 05:22:45MET]     51, 55, 59, 63, 67, 71, 75, 79, 83, 87
[2019-03-22 05:22:45MET]     91, 95, 99, 106, 110, 114, 118, 122, 126
[2019-03-22 05:22:45MET]     130, 134, 138, 142, 149, 153, 157, 161
[2019-03-22 05:22:45MET]     165, 169, 173, 177, 181, 185, 195, 199
[2019-03-22 05:22:45MET]     203
[2019-03-22 05:22:45MET] ../dist/Net-Ping/t/450_service.t............................PASSED
[2019-03-22 05:22:45MET]     9, 18
[2019-03-22 05:22:45MET] ../lib/locale.t.............................................FAILED
[2019-03-22 05:22:45MET]     431-432, 498
[2019-03-22 05:22:45MET] ../lib/warnings.t...........................................FAILED
[2019-03-22 05:22:45MET]     771-772
[2019-03-22 05:22:45MET] Archived results...
[2019-03-22 05:22:45MET] TSTENV = perlio	
# Test process timed out - terminating
# parser guessed wrong encoding expected 'CP1252' got 'UTF-8'
PROG: 
use warnings 'syntax';
@foo::bar = 1..3;
() = "$foo'bar";
() = "@foo'bar";
() = "$#foo'bar";
no warnings 'syntax' ;
() = "$foo'bar";
() = "@foo'bar";
() = "$#foo'bar";
EXPECTED:
Old package separator used in string at - line 3.
	(Did you mean "$foo\'bar" instead?)
Old package separator used in string at - line 4.
	(Did you mean "@foo\'bar" instead?)
Old package separator used in string at - line 5.
	(Did you mean "$#foo\'bar" instead?)
GOT:

# Failed test 771 - at lib/warnings/toke line 418
PROG: 
use warnings 'syntax'; use utf8;
@fooл::barл = 1..3;
() = "$fooл'barл";
() = "@fooл'barл";
() = "$#fooл'barл";
no warnings 'syntax' ;
() = "$fooл'barл";
() = "@fooл'barл";
() = "$#fooл'barл";
EXPECTED:
Old package separator used in string at - line 3.
	(Did you mean "$fooл\'barл" instead?)
Old package separator used in string at - line 4.
	(Did you mean "@fooл\'barл" instead?)
Old package separator used in string at - line 5.
	(Did you mean "$#fooл\'barл" instead?)
GOT:

# Failed test 772 - at lib/warnings/toke line 435
c++: error: +Z: No such file or directory
# Will use Digest::MD5
# Connected to 127.0.0.1
# Connected to 127.0.0.1
Cannot figure out an encoding to use at t/use-Encode-Alias.t line 5.
Integer overflow in hexadecimal number at t/broken_univ_can.t line 7.
make: *** [test_harness] Error 5

error while running harness target 'test_harness': 2 at /pro/3gl/CPAN/smoke/lib/Test/Smoke.pm line 194.
[2019-03-22 07:43:12MET] 
[2019-03-22 07:43:12MET] ../t/re/fold_grind_8.t......................................FAILED
[2019-03-22 07:43:12MET]     No plan found in TAP output
[2019-03-22 07:43:12MET] ../lib/warnings.t...........................................FAILED
[2019-03-22 07:43:12MET]     771-772
[2019-03-22 07:43:12MET] ../lib/locale.t.............................................FAILED
[2019-03-22 07:43:12MET]     431-432, 498
[2019-03-22 07:43:12MET] ../dist/Net-Ping/t/450_service.t............................PASSED
[2019-03-22 07:43:12MET]     9, 18
[2019-03-22 07:43:12MET] ../cpan/Module-Metadata/t/extract-version.t.................PASSED
[2019-03-22 07:43:12MET]     7, 11, 15, 19, 23, 27, 31, 35, 39, 43, 47
[2019-03-22 07:43:12MET]     51, 55, 59, 63, 67, 71, 75, 79, 83, 87
[2019-03-22 07:43:12MET]     91, 95, 99, 106, 110, 114, 118, 122, 126
[2019-03-22 07:43:12MET]     130, 134, 138, 142, 149, 153, 157, 161
[2019-03-22 07:43:12MET]     165, 169, 173, 177, 181, 185, 195, 199
[2019-03-22 07:43:12MET]     203
[2019-03-22 07:43:12MET] Archived results...
[2019-03-22 07:43:12MET] TSTENV = locale:univ.utf8	
PROG: 
use warnings 'syntax';
@foo::bar = 1..3;
() = "$foo'bar";
() = "@foo'bar";
() = "$#foo'bar";
no warnings 'syntax' ;
() = "$foo'bar";
() = "@foo'bar";
() = "$#foo'bar";
EXPECTED:
Old package separator used in string at - line 3.
	(Did you mean "$foo\'bar" instead?)
Old package separator used in string at - line 4.
	(Did you mean "@foo\'bar" instead?)
Old package separator used in string at - line 5.
	(Did you mean "$#foo\'bar" instead?)
GOT:

# Failed test 771 - at lib/warnings/toke line 418
PROG: 
use warnings 'syntax'; use utf8;
@fooл::barл = 1..3;
() = "$fooл'barл";
() = "@fooл'barл";
() = "$#fooл'barл";
no warnings 'syntax' ;
() = "$fooл'barл";
() = "@fooл'barл";
() = "$#fooл'barл";
EXPECTED:
Old package separator used in string at - line 3.
	(Did you mean "$fooл\'barл" instead?)
Old package separator used in string at - line 4.
	(Did you mean "@fooл\'barл" instead?)
Old package separator used in string at - line 5.
	(Did you mean "$#fooл\'barл" instead?)
GOT:

# Failed test 772 - at lib/warnings/toke line 435
# parser guessed wrong encoding expected 'CP1252' got 'UTF-8'
c++: error: +Z: No such file or directory
Locale 'univ.utf8' contains (at least) the following characters which have
unexpected meanings: $ + < = > ^ ` | ~
The Perl program will use the expected meanings; codeset=utf8
Locale 'univ.utf8' contains (at least) the following characters which have
unexpected meanings: $ + < = > ^ ` | ~
The Perl program will use the expected meanings; codeset=utf8
Locale 'univ.utf8' contains (at least) the following characters which have
unexpected meanings: $ + < = > ^ ` | ~
The Perl program will use the expected meanings; codeset=utf8
Locale 'univ.utf8' contains (at least) the following characters which have
unexpected meanings: $ + < = > ^ ` | ~
The Perl program will use the expected meanings; codeset=utf8
Locale 'univ.utf8' contains (at least) the following characters which have
unexpected meanings: $ + < = > ^ ` | ~
The Perl program will use the expected meanings; codeset=utf8
Locale 'univ.utf8' contains (at least) the following characters which have
unexpected meanings: $ + < = > ^ ` | ~
The Perl program will use the expected meanings; codeset=utf8
Locale 'univ.utf8' contains (at least) the following characters which have
unexpected meanings: $ + < = > ^ ` | ~
The Perl program will use the expected meanings; codeset=utf8
Locale 'univ.utf8' contains (at least) the following characters which have
unexpected meanings: $ + < = > ^ ` | ~
The Perl program will use the expected meanings; codeset=utf8
Locale 'univ.utf8' contains (at least) the following characters which have
unexpected meanings: $ + < = > ^ ` | ~
The Perl program will use the expected meanings; codeset=utf8
Locale 'univ.utf8' contains (at least) the following characters which have
unexpected meanings: $ + < = > ^ ` | ~
The Perl program will use the expected meanings; codeset=utf8
Locale 'univ.utf8' contains (at least) the following characters which have
unexpected meanings: $ + < = > ^ ` | ~
The Perl program will use the expected meanings; codeset=utf8
Locale 'univ.utf8' contains (at least) the following characters which have
unexpected meanings: $ + < = > ^ ` | ~
The Perl program will use the expected meanings; codeset=utf8
Locale 'univ.utf8' contains (at least) the following characters which have
unexpected meanings: $ + < = > ^ ` | ~
The Perl program will use the expected meanings; codeset=utf8
Locale 'univ.utf8' contains (at least) the following characters which have
unexpected meanings: $ + < = > ^ ` | ~
The Perl program will use the expected meanings; codeset=utf8
Locale 'univ.utf8' contains (at least) the following characters which have
unexpected meanings: $ + < = > ^ ` | ~
The Perl program will use the expected meanings; codeset=utf8
Integer overflow in hexadecimal number at t/broken_univ_can.t line 7.
# Connected to 127.0.0.1
syswrite() isn't allowed on :utf8 handles at t/Socket.t line 47.
# Looks like your test exited with 255 just after 2.
# Will use Digest::MD5
make: *** [test_harness] Error 5

error while running harness target 'test_harness': 2 at /pro/3gl/CPAN/smoke/lib/Test/Smoke.pm line 194.
[2019-03-22 10:06:02MET] 
[2019-03-22 10:06:02MET] ../lib/warnings.t...........................................FAILED
[2019-03-22 10:06:02MET]     771-772
[2019-03-22 10:06:02MET] ../lib/locale.t.............................................FAILED
[2019-03-22 10:06:02MET]     431-432, 498
[2019-03-22 10:06:02MET] ../lib/B/Deparse.t..........................................PASSED
[2019-03-22 10:06:02MET]     2
[2019-03-22 10:06:02MET] ../cpan/Module-Metadata/t/extract-version.t.................PASSED
[2019-03-22 10:06:02MET]     7, 11, 15, 19, 23, 27, 31, 35, 39, 43, 47
[2019-03-22 10:06:02MET]     51, 55, 59, 63, 67, 71, 75, 79, 83, 87
[2019-03-22 10:06:02MET]     91, 95, 99, 106, 110, 114, 118, 122, 126
[2019-03-22 10:06:02MET]     130, 134, 138, 142, 149, 153, 157, 161
[2019-03-22 10:06:02MET]     165, 169, 173, 177, 181, 185, 195, 199
[2019-03-22 10:06:02MET]     203
[2019-03-22 10:06:02MET] ../dist/Net-Ping/t/450_service.t............................PASSED
[2019-03-22 10:06:02MET]     9, 18
[2019-03-22 10:06:02MET] ../cpan/Socket/t/Socket.t...................................FAILED
[2019-03-22 10:06:02MET]     Non-zero exit status: 255
[2019-03-22 10:06:02MET] ../cpan/Socket/t/Socket.t...................................FAILED
[2019-03-22 10:06:02MET]     Bad plan.  You planned 6 tests but ran 2.
[2019-03-22 10:06:02MET] Archived results...
[2019-03-22 10:06:02MET] Unskip tests from '/pro/3gl/CPAN/smoke/p59.skip'
[2019-03-22 10:06:02MET] 
[2019-03-22 10:06:02MET] Configuration: -Dusedevel -Duse64bitall
[2019-03-22 10:06:02MET] ------------------------------------------------------------------------------
[2019-03-22 10:06:02MET] make distclean ...
[2019-03-22 10:08:20MET] 
[2019-03-22 10:08:20MET] Copy Policy.sh ...
[2019-03-22 10:08:20MET] 
[2019-03-22 10:08:20MET] Configure ...
5.29.10 <=> 5.014002
===== PROCURA Policy for hpux/cc ========================
===== PROCURA Policy results ============================
cc:         cc
ccversion:  -
gccversion: -
ccflags:     +Z -z
optimize:   
ld:         
ldflags:    -L/pro/local/lib
libswanted: cl pthread cl pthread socket bind inet nsl ndbm gdbm dbm db malloc dl ld sun m crypt sec util c cposix posix ucb bsd BSD
libsdirs:    /lib /pro/local/lib
locincpth:  /pro/local/include
loclibpth:  /pro/local/lib
useshrplib: 
===== PROCURA Policy done ===============================
[2019-03-22 10:10:17MET] 
[2019-03-22 10:10:17MET] make ...
parts/inc/mess provides vmess, which is still marked todo for 5.6.0
parts/inc/mess provides vmess, which is still marked todo for 5.6.0
Warning (mostly harmless): No library found for -lposix
Warning (mostly harmless): No library found for -lcposix
cc: warning 457: The Onolimit option is not valid at this optimization level.
Making header files for XS...
[2019-03-22 10:27:51MET] Skip tests from '/pro/3gl/CPAN/smoke/p59.skip'
[2019-03-22 10:27:51MET] 
[2019-03-22 10:27:51MET]  Tests start here:
[2019-03-22 10:27:51MET] TSTENV = stdio	
No saved state, selection will be empty
Cannot figure out an encoding to use at t/use-Encode-Alias.t line 5.
# parser guessed wrong encoding expected 'CP1252' got 'UTF-8'
# Connected to 127.0.0.1
# Connected to 127.0.0.1
Redefining sub xChild::foo at xChild--18310 line 2.
Redefining sub Data::ok at -e line 1.
c++: error: +Z: No such file or directory
c++: error: +O2: No such file or directory
c++: error: +Onolimit: No such file or directory
# Will use Digest::MD5
PROG: 
use warnings 'uninitialized';

# aelem + const
use constant foo => \0;
$SIG{__WARN__} = sub {
 print STDERR
   $_[0] =~ /\$a\[([^]]+)]/ && $1 == foo
       ? "ok\n"
       : ("$1 != ",0+foo,"\n")
};
() = "$a[foo]";
undef $SIG{__WARN__};

# Multideref
() = "$a[140688675223280]";
EXPECTED:
ok
Use of uninitialized value $a[140688675223280] in string at - line 15.
GOT:
-9223372032559499992 != 9223372041150051624
Use of uninitialized value $a[140688675223280] in string at - line 15.
# Failed test 366 - 64-bit array subscripts at lib/warnings/9uninit line 2175
PROG: 
use warnings 'syntax';
@foo::bar = 1..3;
() = "$foo'bar";
() = "@foo'bar";
() = "$#foo'bar";
no warnings 'syntax' ;
() = "$foo'bar";
() = "@foo'bar";
() = "$#foo'bar";
EXPECTED:
Old package separator used in string at - line 3.
	(Did you mean "$foo\'bar" instead?)
Old package separator used in string at - line 4.
	(Did you mean "@foo\'bar" instead?)
Old package separator used in string at - line 5.
	(Did you mean "$#foo\'bar" instead?)
GOT:

# Failed test 771 - at lib/warnings/toke line 418
PROG: 
use warnings 'syntax'; use utf8;
@fooл::barл = 1..3;
() = "$fooл'barл";
() = "@fooл'barл";
() = "$#fooл'barл";
no warnings 'syntax' ;
() = "$fooл'barл";
() = "@fooл'barл";
() = "$#fooл'barл";
EXPECTED:
Old package separator used in string at - line 3.
	(Did you mean "$fooл\'barл" instead?)
Old package separator used in string at - line 4.
	(Did you mean "@fooл\'barл" instead?)
Old package separator used in string at - line 5.
	(Did you mean "$#fooл\'barл" instead?)
GOT:

# Failed test 772 - at lib/warnings/toke line 435
make: *** [test_harness] Error 6

error while running harness target 'test_harness': 2 at /pro/3gl/CPAN/smoke/lib/Test/Smoke.pm line 194.
[2019-03-22 12:01:15MET] 
[2019-03-22 12:01:15MET] ../cpan/Module-Metadata/t/extract-version.t.................PASSED
[2019-03-22 12:01:15MET]     7, 11, 15, 19, 23, 27, 31, 35, 39, 43, 47
[2019-03-22 12:01:15MET]     51, 55, 59, 63, 67, 71, 75, 79, 83, 87
[2019-03-22 12:01:15MET]     91, 95, 99, 106, 110, 114, 118, 122, 126
[2019-03-22 12:01:15MET]     130, 134, 138, 142, 149, 153, 157, 161
[2019-03-22 12:01:15MET]     165, 169, 173, 177, 181, 185, 195, 199
[2019-03-22 12:01:15MET]     203
[2019-03-22 12:01:15MET] ../dist/Net-Ping/t/450_service.t............................PASSED
[2019-03-22 12:01:15MET]     9, 18
[2019-03-22 12:01:15MET] ../lib/locale.t.............................................FAILED
[2019-03-22 12:01:15MET]     431-432, 498
[2019-03-22 12:01:15MET] ../lib/warnings.t...........................................FAILED
[2019-03-22 12:01:15MET]     366, 771-772
[2019-03-22 12:01:15MET] Archived results...
[2019-03-22 12:01:15MET] TSTENV = perlio	
PROG: 
use warnings 'uninitialized';

# aelem + const
use constant foo => \0;
$SIG{__WARN__} = sub {
 print STDERR
   $_[0] =~ /\$a\[([^]]+)]/ && $1 == foo
       ? "ok\n"
       : ("$1 != ",0+foo,"\n")
};
() = "$a[foo]";
undef $SIG{__WARN__};

# Multideref
() = "$a[140688675223280]";
EXPECTED:
ok
Use of uninitialized value $a[140688675223280] in string at - line 15.
GOT:
-9223372032559499640 != 9223372041150051976
Use of uninitialized value $a[140688675223280] in string at - line 15.
# Failed test 366 - 64-bit array subscripts at lib/warnings/9uninit line 2175
PROG: 
use warnings 'syntax';
@foo::bar = 1..3;
() = "$foo'bar";
() = "@foo'bar";
() = "$#foo'bar";
no warnings 'syntax' ;
() = "$foo'bar";
() = "@foo'bar";
() = "$#foo'bar";
EXPECTED:
Old package separator used in string at - line 3.
	(Did you mean "$foo\'bar" instead?)
Old package separator used in string at - line 4.
	(Did you mean "@foo\'bar" instead?)
Old package separator used in string at - line 5.
	(Did you mean "$#foo\'bar" instead?)
GOT:

# Failed test 771 - at lib/warnings/toke line 418
PROG: 
use warnings 'syntax'; use utf8;
@fooл::barл = 1..3;
() = "$fooл'barл";
() = "@fooл'barл";
() = "$#fooл'barл";
no warnings 'syntax' ;
() = "$fooл'barл";
() = "@fooл'barл";
() = "$#fooл'barл";
EXPECTED:
Old package separator used in string at - line 3.
	(Did you mean "$fooл\'barл" instead?)
Old package separator used in string at - line 4.
	(Did you mean "@fooл\'barл" instead?)
Old package separator used in string at - line 5.
	(Did you mean "$#fooл\'barл" instead?)
GOT:

# Failed test 772 - at lib/warnings/toke line 435
# parser guessed wrong encoding expected 'CP1252' got 'UTF-8'
c++: error: +Z: No such file or directory
c++: error: +O2: No such file or directory
c++: error: +Onolimit: No such file or directory
# Will use Digest::MD5
# Connected to 127.0.0.1
# Connected to 127.0.0.1
Cannot figure out an encoding to use at t/use-Encode-Alias.t line 5.
make: *** [test_harness] Error 6

error while running harness target 'test_harness': 2 at /pro/3gl/CPAN/smoke/lib/Test/Smoke.pm line 194.
[2019-03-22 13:22:22MET] 
[2019-03-22 13:22:22MET] ../lib/warnings.t...........................................FAILED
[2019-03-22 13:22:22MET]     366, 771-772
[2019-03-22 13:22:22MET] ../lib/locale.t.............................................FAILED
[2019-03-22 13:22:22MET]     431-432, 498
[2019-03-22 13:22:22MET] ../cpan/Module-Metadata/t/extract-version.t.................PASSED
[2019-03-22 13:22:22MET]     7, 11, 15, 19, 23, 27, 31, 35, 39, 43, 47
[2019-03-22 13:22:22MET]     51, 55, 59, 63, 67, 71, 75, 79, 83, 87
[2019-03-22 13:22:22MET]     91, 95, 99, 106, 110, 114, 118, 122, 126
[2019-03-22 13:22:22MET]     130, 134, 138, 142, 149, 153, 157, 161
[2019-03-22 13:22:22MET]     165, 169, 173, 177, 181, 185, 195, 199
[2019-03-22 13:22:22MET]     203
[2019-03-22 13:22:22MET] ../dist/Net-Ping/t/450_service.t............................PASSED
[2019-03-22 13:22:22MET]     9, 18
[2019-03-22 13:22:22MET] Archived results...
[2019-03-22 13:22:22MET] TSTENV = locale:univ.utf8	
PROG: 
use warnings 'uninitialized';

# aelem + const
use constant foo => \0;
$SIG{__WARN__} = sub {
 print STDERR
   $_[0] =~ /\$a\[([^]]+)]/ && $1 == foo
       ? "ok\n"
       : ("$1 != ",0+foo,"\n")
};
() = "$a[foo]";
undef $SIG{__WARN__};

# Multideref
() = "$a[140688675223280]";
EXPECTED:
ok
Use of uninitialized value $a[140688675223280] in string at - line 15.
GOT:
-9223372032559499944 != 9223372041150051672
Use of uninitialized value $a[140688675223280] in string at - line 15.
# Failed test 366 - 64-bit array subscripts at lib/warnings/9uninit line 2175
PROG: 
use warnings 'syntax';
@foo::bar = 1..3;
() = "$foo'bar";
() = "@foo'bar";
() = "$#foo'bar";
no warnings 'syntax' ;
() = "$foo'bar";
() = "@foo'bar";
() = "$#foo'bar";
EXPECTED:
Old package separator used in string at - line 3.
	(Did you mean "$foo\'bar" instead?)
Old package separator used in string at - line 4.
	(Did you mean "@foo\'bar" instead?)
Old package separator used in string at - line 5.
	(Did you mean "$#foo\'bar" instead?)
GOT:

# Failed test 771 - at lib/warnings/toke line 418
PROG: 
use warnings 'syntax'; use utf8;
@fooл::barл = 1..3;
() = "$fooл'barл";
() = "@fooл'barл";
() = "$#fooл'barл";
no warnings 'syntax' ;
() = "$fooл'barл";
() = "@fooл'barл";
() = "$#fooл'barл";
EXPECTED:
Old package separator used in string at - line 3.
	(Did you mean "$fooл\'barл" instead?)
Old package separator used in string at - line 4.
	(Did you mean "@fooл\'barл" instead?)
Old package separator used in string at - line 5.
	(Did you mean "$#fooл\'barл" instead?)
GOT:

# Failed test 772 - at lib/warnings/toke line 435
# parser guessed wrong encoding expected 'CP1252' got 'UTF-8'
c++: error: +Z: No such file or directory
c++: error: +O2: No such file or directory
c++: error: +Onolimit: No such file or directory
Locale 'univ.utf8' contains (at least) the following characters which have
unexpected meanings: $ + < = > ^ ` | ~
The Perl program will use the expected meanings; codeset=utf8
Locale 'univ.utf8' contains (at least) the following characters which have
unexpected meanings: $ + < = > ^ ` | ~
The Perl program will use the expected meanings; codeset=utf8
Locale 'univ.utf8' contains (at least) the following characters which have
unexpected meanings: $ + < = > ^ ` | ~
The Perl program will use the expected meanings; codeset=utf8
Locale 'univ.utf8' contains (at least) the following characters which have
unexpected meanings: $ + < = > ^ ` | ~
The Perl program will use the expected meanings; codeset=utf8
Locale 'univ.utf8' contains (at least) the following characters which have
unexpected meanings: $ + < = > ^ ` | ~
The Perl program will use the expected meanings; codeset=utf8
Locale 'univ.utf8' contains (at least) the following characters which have
unexpected meanings: $ + < = > ^ ` | ~
The Perl program will use the expected meanings; codeset=utf8
Locale 'univ.utf8' contains (at least) the following characters which have
unexpected meanings: $ + < = > ^ ` | ~
The Perl program will use the expected meanings; codeset=utf8
Locale 'univ.utf8' contains (at least) the following characters which have
unexpected meanings: $ + < = > ^ ` | ~
The Perl program will use the expected meanings; codeset=utf8
Locale 'univ.utf8' contains (at least) the following characters which have
unexpected meanings: $ + < = > ^ ` | ~
The Perl program will use the expected meanings; codeset=utf8
Locale 'univ.utf8' contains (at least) the following characters which have
unexpected meanings: $ + < = > ^ ` | ~
The Perl program will use the expected meanings; codeset=utf8
Locale 'univ.utf8' contains (at least) the following characters which have
unexpected meanings: $ + < = > ^ ` | ~
The Perl program will use the expected meanings; codeset=utf8
Locale 'univ.utf8' contains (at least) the following characters which have
unexpected meanings: $ + < = > ^ ` | ~
The Perl program will use the expected meanings; codeset=utf8
Locale 'univ.utf8' contains (at least) the following characters which have
unexpected meanings: $ + < = > ^ ` | ~
The Perl program will use the expected meanings; codeset=utf8
Locale 'univ.utf8' contains (at least) the following characters which have
unexpected meanings: $ + < = > ^ ` | ~
The Perl program will use the expected meanings; codeset=utf8
Locale 'univ.utf8' contains (at least) the following characters which have
unexpected meanings: $ + < = > ^ ` | ~
The Perl program will use the expected meanings; codeset=utf8
# Connected to 127.0.0.1
syswrite() isn't allowed on :utf8 handles at t/Socket.t line 47.
# Looks like your test exited with 255 just after 2.
# Will use Digest::MD5
make: *** [test_harness] Error 6

error while running harness target 'test_harness': 2 at /pro/3gl/CPAN/smoke/lib/Test/Smoke.pm line 194.
[2019-03-22 14:45:12MET] 
[2019-03-22 14:45:12MET] ../lib/locale.t.............................................FAILED
[2019-03-22 14:45:12MET]     431-432, 498
[2019-03-22 14:45:12MET] ../lib/warnings.t...........................................FAILED
[2019-03-22 14:45:12MET]     366, 771-772
[2019-03-22 14:45:12MET] ../lib/B/Deparse.t..........................................PASSED
[2019-03-22 14:45:12MET]     2
[2019-03-22 14:45:12MET] ../cpan/Module-Metadata/t/extract-version.t.................PASSED
[2019-03-22 14:45:12MET]     7, 11, 15, 19, 23, 27, 31, 35, 39, 43, 47
[2019-03-22 14:45:12MET]     51, 55, 59, 63, 67, 71, 75, 79, 83, 87
[2019-03-22 14:45:12MET]     91, 95, 99, 106, 110, 114, 118, 122, 126
[2019-03-22 14:45:12MET]     130, 134, 138, 142, 149, 153, 157, 161
[2019-03-22 14:45:12MET]     165, 169, 173, 177, 181, 185, 195, 199
[2019-03-22 14:45:12MET]     203
[2019-03-22 14:45:12MET] ../cpan/Socket/t/Socket.t...................................FAILED
[2019-03-22 14:45:12MET]     Non-zero exit status: 255
[2019-03-22 14:45:12MET] ../cpan/Socket/t/Socket.t...................................FAILED
[2019-03-22 14:45:12MET]     Bad plan.  You planned 6 tests but ran 2.
[2019-03-22 14:45:12MET] ../dist/Net-Ping/t/450_service.t............................PASSED
[2019-03-22 14:45:12MET]     9, 18
[2019-03-22 14:45:12MET] Archived results...
[2019-03-22 14:45:12MET] Unskip tests from '/pro/3gl/CPAN/smoke/p59.skip'
[2019-03-22 14:45:12MET] 
[2019-03-22 14:45:12MET] Configuration: -Dusedevel -Duse64bitall -DDEBUGGING
[2019-03-22 14:45:12MET] ------------------------------------------------------------------------------
[2019-03-22 14:45:12MET] make distclean ...
[2019-03-22 14:46:45MET] 
[2019-03-22 14:46:45MET] Copy Policy.sh ...
[2019-03-22 14:46:45MET] 
[2019-03-22 14:46:45MET] Configure ...
5.29.10 <=> 5.014002
===== PROCURA Policy for hpux/cc ========================
===== PROCURA Policy results ============================
cc:         cc
ccversion:  -
gccversion: -
ccflags:    -DDEBUGGING +Z -z
optimize:   
ld:         
ldflags:    -L/pro/local/lib
libswanted: cl pthread cl pthread socket bind inet nsl ndbm gdbm dbm db malloc dl ld sun m crypt sec util c cposix posix ucb bsd BSD
libsdirs:    /lib /pro/local/lib
locincpth:  /pro/local/include
loclibpth:  /pro/local/lib
useshrplib: 
===== PROCURA Policy done ===============================
[2019-03-22 14:48:56MET] 
[2019-03-22 14:48:56MET] make ...
parts/inc/mess provides vmess, which is still marked todo for 5.6.0
parts/inc/mess provides vmess, which is still marked todo for 5.6.0
Warning (mostly harmless): No library found for -lposix
Warning (mostly harmless): No library found for -lcposix
cc: warning 457: The Onolimit option is not valid at this optimization level.
Making header files for XS...
[2019-03-22 15:17:42MET] Skip tests from '/pro/3gl/CPAN/smoke/p59.skip'
[2019-03-22 15:17:42MET] 
[2019-03-22 15:17:42MET]  Tests start here:
[2019-03-22 15:17:42MET] TSTENV = stdio	
No saved state, selection will be empty
Cannot figure out an encoding to use at t/use-Encode-Alias.t line 5.
# parser guessed wrong encoding expected 'CP1252' got 'UTF-8'
# Connected to 127.0.0.1
# Connected to 127.0.0.1
Redefining sub xChild::foo at xChild--1045 line 2.
Redefining sub Data::ok at -e line 1.
c++: error: +Z: No such file or directory
c++: error: +O2: No such file or directory
c++: error: +Onolimit: No such file or directory
# Will use Digest::MD5
PROG: 
use warnings 'uninitialized';

# aelem + const
use constant foo => \0;
$SIG{__WARN__} = sub {
 print STDERR
   $_[0] =~ /\$a\[([^]]+)]/ && $1 == foo
       ? "ok\n"
       : ("$1 != ",0+foo,"\n")
};
() = "$a[foo]";
undef $SIG{__WARN__};

# Multideref
() = "$a[140688675223280]";
EXPECTED:
ok
Use of uninitialized value $a[140688675223280] in string at - line 15.
GOT:
-9223372032558334272 != 9223372041151217344
Use of uninitialized value $a[140688675223280] in string at - line 15.
# Failed test 366 - 64-bit array subscripts at lib/warnings/9uninit line 2175
PROG: 
use warnings 'syntax';
@foo::bar = 1..3;
() = "$foo'bar";
() = "@foo'bar";
() = "$#foo'bar";
no warnings 'syntax' ;
() = "$foo'bar";
() = "@foo'bar";
() = "$#foo'bar";
EXPECTED:
Old package separator used in string at - line 3.
	(Did you mean "$foo\'bar" instead?)
Old package separator used in string at - line 4.
	(Did you mean "@foo\'bar" instead?)
Old package separator used in string at - line 5.
	(Did you mean "$#foo\'bar" instead?)
GOT:

# Failed test 771 - at lib/warnings/toke line 418
PROG: 
use warnings 'syntax'; use utf8;
@fooл::barл = 1..3;
() = "$fooл'barл";
() = "@fooл'barл";
() = "$#fooл'barл";
no warnings 'syntax' ;
() = "$fooл'barл";
() = "@fooл'barл";
() = "$#fooл'barл";
EXPECTED:
Old package separator used in string at - line 3.
	(Did you mean "$fooл\'barл" instead?)
Old package separator used in string at - line 4.
	(Did you mean "@fooл\'barл" instead?)
Old package separator used in string at - line 5.
	(Did you mean "$#fooл\'barл" instead?)
GOT:

# Failed test 772 - at lib/warnings/toke line 435
make: *** [test_harness] Error 6

error while running harness target 'test_harness': 2 at /pro/3gl/CPAN/smoke/lib/Test/Smoke.pm line 194.
[2019-03-22 17:05:25MET] 
[2019-03-22 17:05:25MET] ../cpan/Module-Metadata/t/extract-version.t.................PASSED
[2019-03-22 17:05:25MET]     7, 11, 15, 19, 23, 27, 31, 35, 39, 43, 47
[2019-03-22 17:05:25MET]     51, 55, 59, 63, 67, 71, 75, 79, 83, 87
[2019-03-22 17:05:25MET]     91, 95, 99, 106, 110, 114, 118, 122, 126
[2019-03-22 17:05:25MET]     130, 134, 138, 142, 149, 153, 157, 161
[2019-03-22 17:05:25MET]     165, 169, 173, 177, 181, 185, 195, 199
[2019-03-22 17:05:25MET]     203
[2019-03-22 17:05:25MET] ../dist/Net-Ping/t/450_service.t............................PASSED
[2019-03-22 17:05:25MET]     9, 18
[2019-03-22 17:05:25MET] ../lib/locale.t.............................................FAILED
[2019-03-22 17:05:25MET]     431-432, 498
[2019-03-22 17:05:25MET] ../lib/warnings.t...........................................FAILED
[2019-03-22 17:05:25MET]     366, 771-772
[2019-03-22 17:05:25MET] Archived results...
[2019-03-22 17:05:25MET] TSTENV = perlio	
PROG: 
use warnings 'uninitialized';

# aelem + const
use constant foo => \0;
$SIG{__WARN__} = sub {
 print STDERR
   $_[0] =~ /\$a\[([^]]+)]/ && $1 == foo
       ? "ok\n"
       : ("$1 != ",0+foo,"\n")
};
() = "$a[foo]";
undef $SIG{__WARN__};

# Multideref
() = "$a[140688675223280]";
EXPECTED:
ok
Use of uninitialized value $a[140688675223280] in string at - line 15.
GOT:
-9223372032558333888 != 9223372041151217728
Use of uninitialized value $a[140688675223280] in string at - line 15.
# Failed test 366 - 64-bit array subscripts at lib/warnings/9uninit line 2175
PROG: 
use warnings 'syntax';
@foo::bar = 1..3;
() = "$foo'bar";
() = "@foo'bar";
() = "$#foo'bar";
no warnings 'syntax' ;
() = "$foo'bar";
() = "@foo'bar";
() = "$#foo'bar";
EXPECTED:
Old package separator used in string at - line 3.
	(Did you mean "$foo\'bar" instead?)
Old package separator used in string at - line 4.
	(Did you mean "@foo\'bar" instead?)
Old package separator used in string at - line 5.
	(Did you mean "$#foo\'bar" instead?)
GOT:

# Failed test 771 - at lib/warnings/toke line 418
PROG: 
use warnings 'syntax'; use utf8;
@fooл::barл = 1..3;
() = "$fooл'barл";
() = "@fooл'barл";
() = "$#fooл'barл";
no warnings 'syntax' ;
() = "$fooл'barл";
() = "@fooл'barл";
() = "$#fooл'barл";
EXPECTED:
Old package separator used in string at - line 3.
	(Did you mean "$fooл\'barл" instead?)
Old package separator used in string at - line 4.
	(Did you mean "@fooл\'barл" instead?)
Old package separator used in string at - line 5.
	(Did you mean "$#fooл\'barл" instead?)
GOT:

# Failed test 772 - at lib/warnings/toke line 435
# parser guessed wrong encoding expected 'CP1252' got 'UTF-8'
c++: error: +Z: No such file or directory
c++: error: +O2: No such file or directory
c++: error: +Onolimit: No such file or directory
# Will use Digest::MD5
# Connected to 127.0.0.1
# Connected to 127.0.0.1
Cannot figure out an encoding to use at t/use-Encode-Alias.t line 5.
make: *** [test_harness] Error 6

error while running harness target 'test_harness': 2 at /pro/3gl/CPAN/smoke/lib/Test/Smoke.pm line 194.
[2019-03-22 18:41:20MET] 
[2019-03-22 18:41:20MET] ../lib/warnings.t...........................................FAILED
[2019-03-22 18:41:20MET]     366, 771-772
[2019-03-22 18:41:20MET] ../lib/locale.t.............................................FAILED
[2019-03-22 18:41:20MET]     431-432, 498
[2019-03-22 18:41:20MET] ../dist/Net-Ping/t/450_service.t............................PASSED
[2019-03-22 18:41:20MET]     9, 18
[2019-03-22 18:41:20MET] ../cpan/Module-Metadata/t/extract-version.t.................PASSED
[2019-03-22 18:41:20MET]     7, 11, 15, 19, 23, 27, 31, 35, 39, 43, 47
[2019-03-22 18:41:20MET]     51, 55, 59, 63, 67, 71, 75, 79, 83, 87
[2019-03-22 18:41:20MET]     91, 95, 99, 106, 110, 114, 118, 122, 126
[2019-03-22 18:41:20MET]     130, 134, 138, 142, 149, 153, 157, 161
[2019-03-22 18:41:20MET]     165, 169, 173, 177, 181, 185, 195, 199
[2019-03-22 18:41:20MET]     203
[2019-03-22 18:41:20MET] Archived results...
[2019-03-22 18:41:20MET] TSTENV = locale:univ.utf8	
PROG: 
use warnings 'uninitialized';

# aelem + const
use constant foo => \0;
$SIG{__WARN__} = sub {
 print STDERR
   $_[0] =~ /\$a\[([^]]+)]/ && $1 == foo
       ? "ok\n"
       : ("$1 != ",0+foo,"\n")
};
() = "$a[foo]";
undef $SIG{__WARN__};

# Multideref
() = "$a[140688675223280]";
EXPECTED:
ok
Use of uninitialized value $a[140688675223280] in string at - line 15.
GOT:
-9223372032558334240 != 9223372041151217376
Use of uninitialized value $a[140688675223280] in string at - line 15.
# Failed test 366 - 64-bit array subscripts at lib/warnings/9uninit line 2175
PROG: 
use warnings 'syntax';
@foo::bar = 1..3;
() = "$foo'bar";
() = "@foo'bar";
() = "$#foo'bar";
no warnings 'syntax' ;
() = "$foo'bar";
() = "@foo'bar";
() = "$#foo'bar";
EXPECTED:
Old package separator used in string at - line 3.
	(Did you mean "$foo\'bar" instead?)
Old package separator used in string at - line 4.
	(Did you mean "@foo\'bar" instead?)
Old package separator used in string at - line 5.
	(Did you mean "$#foo\'bar" instead?)
GOT:

# Failed test 771 - at lib/warnings/toke line 418
PROG: 
use warnings 'syntax'; use utf8;
@fooл::barл = 1..3;
() = "$fooл'barл";
() = "@fooл'barл";
() = "$#fooл'barл";
no warnings 'syntax' ;
() = "$fooл'barл";
() = "@fooл'barл";
() = "$#fooл'barл";
EXPECTED:
Old package separator used in string at - line 3.
	(Did you mean "$fooл\'barл" instead?)
Old package separator used in string at - line 4.
	(Did you mean "@fooл\'barл" instead?)
Old package separator used in string at - line 5.
	(Did you mean "$#fooл\'barл" instead?)
GOT:

# Failed test 772 - at lib/warnings/toke line 435
# parser guessed wrong encoding expected 'CP1252' got 'UTF-8'
Locale 'univ.utf8' contains (at least) the following characters which have
unexpected meanings: $ + < = > ^ ` | ~
The Perl program will use the expected meanings; codeset=utf8
Locale 'univ.utf8' contains (at least) the following characters which have
unexpected meanings: $ + < = > ^ ` | ~
The Perl program will use the expected meanings; codeset=utf8
Locale 'univ.utf8' contains (at least) the following characters which have
unexpected meanings: $ + < = > ^ ` | ~
The Perl program will use the expected meanings; codeset=utf8
Locale 'univ.utf8' contains (at least) the following characters which have
unexpected meanings: $ + < = > ^ ` | ~
The Perl program will use the expected meanings; codeset=utf8
Locale 'univ.utf8' contains (at least) the following characters which have
unexpected meanings: $ + < = > ^ ` | ~
The Perl program will use the expected meanings; codeset=utf8
Locale 'univ.utf8' contains (at least) the following characters which have
unexpected meanings: $ + < = > ^ ` | ~
The Perl program will use the expected meanings; codeset=utf8
Locale 'univ.utf8' contains (at least) the following characters which have
unexpected meanings: $ + < = > ^ ` | ~
The Perl program will use the expected meanings; codeset=utf8
Locale 'univ.utf8' contains (at least) the following characters which have
unexpected meanings: $ + < = > ^ ` | ~
The Perl program will use the expected meanings; codeset=utf8
Locale 'univ.utf8' contains (at least) the following characters which have
unexpected meanings: $ + < = > ^ ` | ~
The Perl program will use the expected meanings; codeset=utf8
Locale 'univ.utf8' contains (at least) the following characters which have
unexpected meanings: $ + < = > ^ ` | ~
The Perl program will use the expected meanings; codeset=utf8
Locale 'univ.utf8' contains (at least) the following characters which have
unexpected meanings: $ + < = > ^ ` | ~
The Perl program will use the expected meanings; codeset=utf8
Locale 'univ.utf8' contains (at least) the following characters which have
unexpected meanings: $ + < = > ^ ` | ~
The Perl program will use the expected meanings; codeset=utf8
Locale 'univ.utf8' contains (at least) the following characters which have
unexpected meanings: $ + < = > ^ ` | ~
The Perl program will use the expected meanings; codeset=utf8
Locale 'univ.utf8' contains (at least) the following characters which have
unexpected meanings: $ + < = > ^ ` | ~
The Perl program will use the expected meanings; codeset=utf8
Locale 'univ.utf8' contains (at least) the following characters which have
unexpected meanings: $ + < = > ^ ` | ~
The Perl program will use the expected meanings; codeset=utf8
c++: error: +Z: No such file or directory
c++: error: +O2: No such file or directory
c++: error: +Onolimit: No such file or directory
# Connected to 127.0.0.1
syswrite() isn't allowed on :utf8 handles at t/Socket.t line 47.
# Looks like your test exited with 255 just after 2.
# Will use Digest::MD5
make: *** [test_harness] Error 6

error while running harness target 'test_harness': 2 at /pro/3gl/CPAN/smoke/lib/Test/Smoke.pm line 194.
[2019-03-22 20:18:44MET] 
[2019-03-22 20:18:44MET] ../lib/locale.t.............................................FAILED
[2019-03-22 20:18:44MET]     431-432, 498
[2019-03-22 20:18:44MET] ../lib/warnings.t...........................................FAILED
[2019-03-22 20:18:44MET]     366, 771-772
[2019-03-22 20:18:44MET] ../lib/B/Deparse.t..........................................PASSED
[2019-03-22 20:18:44MET]     2
[2019-03-22 20:18:44MET] ../cpan/Module-Metadata/t/extract-version.t.................PASSED
[2019-03-22 20:18:44MET]     7, 11, 15, 19, 23, 27, 31, 35, 39, 43, 47
[2019-03-22 20:18:44MET]     51, 55, 59, 63, 67, 71, 75, 79, 83, 87
[2019-03-22 20:18:44MET]     91, 95, 99, 106, 110, 114, 118, 122, 126
[2019-03-22 20:18:44MET]     130, 134, 138, 142, 149, 153, 157, 161
[2019-03-22 20:18:44MET]     165, 169, 173, 177, 181, 185, 195, 199
[2019-03-22 20:18:44MET]     203
[2019-03-22 20:18:44MET] ../dist/Net-Ping/t/450_service.t............................PASSED
[2019-03-22 20:18:44MET]     9, 18
[2019-03-22 20:18:44MET] ../cpan/Socket/t/Socket.t...................................FAILED
[2019-03-22 20:18:44MET]     Non-zero exit status: 255
[2019-03-22 20:18:44MET] ../cpan/Socket/t/Socket.t...................................FAILED
[2019-03-22 20:18:44MET]     Bad plan.  You planned 6 tests but ran 2.
[2019-03-22 20:18:44MET] Archived results...
[2019-03-22 20:18:44MET] Unskip tests from '/pro/3gl/CPAN/smoke/p59.skip'
[2019-03-22 20:18:44MET] 
[2019-03-22 20:18:44MET] Configuration: -Dusedevel -Duseithreads
[2019-03-22 20:18:44MET] ------------------------------------------------------------------------------
[2019-03-22 20:18:44MET] make distclean ...
[2019-03-22 20:20:27MET] 
[2019-03-22 20:20:27MET] Copy Policy.sh ...
[2019-03-22 20:20:27MET] 
[2019-03-22 20:20:27MET] Configure ...
5.29.10 <=> 5.014002
===== PROCURA Policy for hpux/cc ========================
===== PROCURA Policy results ============================
cc:         cc
ccversion:  -
gccversion: -
ccflags:     +Z -z
optimize:   
ld:         
ldflags:    -L/pro/local/lib
libswanted: cl pthread cl pthread socket bind inet nsl ndbm gdbm dbm db malloc dl ld sun m crypt sec util c cposix posix ucb bsd BSD
libsdirs:    /lib /pro/local/lib
locincpth:  /pro/local/include
loclibpth:  /pro/local/lib
useshrplib: 
===== PROCURA Policy done ===============================
[2019-03-22 20:22:26MET] 
[2019-03-22 20:22:26MET] make ...
parts/inc/mess provides vmess, which is still marked todo for 5.6.0
parts/inc/mess provides vmess, which is still marked todo for 5.6.0
Warning (mostly harmless): No library found for -lposix
Warning (mostly harmless): No library found for -lcposix
cc: warning 457: The Onolimit option is not valid at this optimization level.
Making header files for XS...
[2019-03-22 20:39:13MET] Skip tests from '/pro/3gl/CPAN/smoke/p59.skip'
[2019-03-22 20:39:13MET] 
[2019-03-22 20:39:13MET]  Tests start here:
[2019-03-22 20:39:13MET] TSTENV = stdio	
No saved state, selection will be empty
Cannot figure out an encoding to use at t/use-Encode-Alias.t line 5.
# parser guessed wrong encoding expected 'CP1252' got 'UTF-8'
# Connected to 127.0.0.1
# Connected to 127.0.0.1
Integer overflow in hexadecimal number at t/broken_univ_can.t line 7.
Redefining sub xChild::foo at xChild--15303 line 2.
Redefining sub Data::ok at -e line 1.
c++: error: +Z: No such file or directory
c++: error: +O2: No such file or directory
c++: error: +Onolimit: No such file or directory
# Will use Digest::MD5
PROG: 
use warnings 'syntax';
@foo::bar = 1..3;
() = "$foo'bar";
() = "@foo'bar";
() = "$#foo'bar";
no warnings 'syntax' ;
() = "$foo'bar";
() = "@foo'bar";
() = "$#foo'bar";
EXPECTED:
Old package separator used in string at - line 3.
	(Did you mean "$foo\'bar" instead?)
Old package separator used in string at - line 4.
	(Did you mean "@foo\'bar" instead?)
Old package separator used in string at - line 5.
	(Did you mean "$#foo\'bar" instead?)
GOT:

# Failed test 771 - at lib/warnings/toke line 418
PROG: 
use warnings 'syntax'; use utf8;
@fooл::barл = 1..3;
() = "$fooл'barл";
() = "@fooл'barл";
() = "$#fooл'barл";
no warnings 'syntax' ;
() = "$fooл'barл";
() = "@fooл'barл";
() = "$#fooл'barл";
EXPECTED:
Old package separator used in string at - line 3.
	(Did you mean "$fooл\'barл" instead?)
Old package separator used in string at - line 4.
	(Did you mean "@fooл\'barл" instead?)
Old package separator used in string at - line 5.
	(Did you mean "$#fooл\'barл" instead?)
GOT:

# Failed test 772 - at lib/warnings/toke line 435
make: *** [test_harness] Error 5

error while running harness target 'test_harness': 2 at /pro/3gl/CPAN/smoke/lib/Test/Smoke.pm line 194.
[2019-03-22 22:18:41MET] 
[2019-03-22 22:18:41MET] ../cpan/Module-Metadata/t/extract-version.t.................PASSED
[2019-03-22 22:18:41MET]     7, 11, 15, 19, 23, 27, 31, 35, 39, 43, 47
[2019-03-22 22:18:41MET]     51, 55, 59, 63, 67, 71, 75, 79, 83, 87
[2019-03-22 22:18:41MET]     91, 95, 99, 106, 110, 114, 118, 122, 126
[2019-03-22 22:18:41MET]     130, 134, 138, 142, 149, 153, 157, 161
[2019-03-22 22:18:41MET]     165, 169, 173, 177, 181, 185, 195, 199
[2019-03-22 22:18:41MET]     203
[2019-03-22 22:18:41MET] ../dist/Net-Ping/t/450_service.t............................PASSED
[2019-03-22 22:18:41MET]     9, 18
[2019-03-22 22:18:41MET] ../lib/locale.t.............................................FAILED
[2019-03-22 22:18:41MET]     431-432, 498
[2019-03-22 22:18:41MET] ../lib/warnings.t...........................................FAILED
[2019-03-22 22:18:41MET]     771-772
[2019-03-22 22:18:41MET] Archived results...
[2019-03-22 22:18:41MET] TSTENV = perlio	
PROG: 
use warnings 'syntax';
@foo::bar = 1..3;
() = "$foo'bar";
() = "@foo'bar";
() = "$#foo'bar";
no warnings 'syntax' ;
() = "$foo'bar";
() = "@foo'bar";
() = "$#foo'bar";
EXPECTED:
Old package separator used in string at - line 3.
	(Did you mean "$foo\'bar" instead?)
Old package separator used in string at - line 4.
	(Did you mean "@foo\'bar" instead?)
Old package separator used in string at - line 5.
	(Did you mean "$#foo\'bar" instead?)
GOT:

# Failed test 771 - at lib/warnings/toke line 418
PROG: 
use warnings 'syntax'; use utf8;
@fooл::barл = 1..3;
() = "$fooл'barл";
() = "@fooл'barл";
() = "$#fooл'barл";
no warnings 'syntax' ;
() = "$fooл'barл";
() = "@fooл'barл";
() = "$#fooл'barл";
EXPECTED:
Old package separator used in string at - line 3.
	(Did you mean "$fooл\'barл" instead?)
Old package separator used in string at - line 4.
	(Did you mean "@fooл\'barл" instead?)
Old package separator used in string at - line 5.
	(Did you mean "$#fooл\'barл" instead?)
GOT:

# Failed test 772 - at lib/warnings/toke line 435
# parser guessed wrong encoding expected 'CP1252' got 'UTF-8'
c++: error: +Z: No such file or directory
c++: error: +O2: No such file or directory
c++: error: +Onolimit: No such file or directory
# Will use Digest::MD5
# Connected to 127.0.0.1
# Connected to 127.0.0.1
Cannot figure out an encoding to use at t/use-Encode-Alias.t line 5.
Integer overflow in hexadecimal number at t/broken_univ_can.t line 7.
make: *** [test_harness] Error 5

error while running harness target 'test_harness': 2 at /pro/3gl/CPAN/smoke/lib/Test/Smoke.pm line 194.
[2019-03-22 23:39:07MET] 
[2019-03-22 23:39:07MET] ../lib/warnings.t...........................................FAILED
[2019-03-22 23:39:07MET]     771-772
[2019-03-22 23:39:07MET] ../lib/locale.t.............................................FAILED
[2019-03-22 23:39:07MET]     431-432, 498
[2019-03-22 23:39:07MET] ../dist/Net-Ping/t/450_service.t............................PASSED
[2019-03-22 23:39:07MET]     9, 18
[2019-03-22 23:39:07MET] ../cpan/Module-Metadata/t/extract-version.t.................PASSED
[2019-03-22 23:39:07MET]     7, 11, 15, 19, 23, 27, 31, 35, 39, 43, 47
[2019-03-22 23:39:07MET]     51, 55, 59, 63, 67, 71, 75, 79, 83, 87
[2019-03-22 23:39:07MET]     91, 95, 99, 106, 110, 114, 118, 122, 126
[2019-03-22 23:39:07MET]     130, 134, 138, 142, 149, 153, 157, 161
[2019-03-22 23:39:07MET]     165, 169, 173, 177, 181, 185, 195, 199
[2019-03-22 23:39:07MET]     203
[2019-03-22 23:39:07MET] Archived results...
[2019-03-22 23:39:07MET] TSTENV = locale:univ.utf8	
PROG: 
use warnings 'syntax';
@foo::bar = 1..3;
() = "$foo'bar";
() = "@foo'bar";
() = "$#foo'bar";
no warnings 'syntax' ;
() = "$foo'bar";
() = "@foo'bar";
() = "$#foo'bar";
EXPECTED:
Old package separator used in string at - line 3.
	(Did you mean "$foo\'bar" instead?)
Old package separator used in string at - line 4.
	(Did you mean "@foo\'bar" instead?)
Old package separator used in string at - line 5.
	(Did you mean "$#foo\'bar" instead?)
GOT:

# Failed test 771 - at lib/warnings/toke line 418
PROG: 
use warnings 'syntax'; use utf8;
@fooл::barл = 1..3;
() = "$fooл'barл";
() = "@fooл'barл";
() = "$#fooл'barл";
no warnings 'syntax' ;
() = "$fooл'barл";
() = "@fooл'barл";
() = "$#fooл'barл";
EXPECTED:
Old package separator used in string at - line 3.
	(Did you mean "$fooл\'barл" instead?)
Old package separator used in string at - line 4.
	(Did you mean "@fooл\'barл" instead?)
Old package separator used in string at - line 5.
	(Did you mean "$#fooл\'barл" instead?)
GOT:

# Failed test 772 - at lib/warnings/toke line 435
# parser guessed wrong encoding expected 'CP1252' got 'UTF-8'
Locale 'univ.utf8' contains (at least) the following characters which have
unexpected meanings: $ + < = > ^ ` | ~
The Perl program will use the expected meanings; codeset=utf8
Locale 'univ.utf8' contains (at least) the following characters which have
unexpected meanings: $ + < = > ^ ` | ~
The Perl program will use the expected meanings; codeset=utf8
Locale 'univ.utf8' contains (at least) the following characters which have
unexpected meanings: $ + < = > ^ ` | ~
The Perl program will use the expected meanings; codeset=utf8
Locale 'univ.utf8' contains (at least) the following characters which have
unexpected meanings: $ + < = > ^ ` | ~
The Perl program will use the expected meanings; codeset=utf8
Locale 'univ.utf8' contains (at least) the following characters which have
unexpected meanings: $ + < = > ^ ` | ~
The Perl program will use the expected meanings; codeset=utf8
Locale 'univ.utf8' contains (at least) the following characters which have
unexpected meanings: $ + < = > ^ ` | ~
The Perl program will use the expected meanings; codeset=utf8
Locale 'univ.utf8' contains (at least) the following characters which have
unexpected meanings: $ + < = > ^ ` | ~
The Perl program will use the expected meanings; codeset=utf8
Locale 'univ.utf8' contains (at least) the following characters which have
unexpected meanings: $ + < = > ^ ` | ~
The Perl program will use the expected meanings; codeset=utf8
Locale 'univ.utf8' contains (at least) the following characters which have
unexpected meanings: $ + < = > ^ ` | ~
The Perl program will use the expected meanings; codeset=utf8
Locale 'univ.utf8' contains (at least) the following characters which have
unexpected meanings: $ + < = > ^ ` | ~
The Perl program will use the expected meanings; codeset=utf8
Locale 'univ.utf8' contains (at least) the following characters which have
unexpected meanings: $ + < = > ^ ` | ~
The Perl program will use the expected meanings; codeset=utf8
Locale 'univ.utf8' contains (at least) the following characters which have
unexpected meanings: $ + < = > ^ ` | ~
The Perl program will use the expected meanings; codeset=utf8
Locale 'univ.utf8' contains (at least) the following characters which have
unexpected meanings: $ + < = > ^ ` | ~
The Perl program will use the expected meanings; codeset=utf8
Locale 'univ.utf8' contains (at least) the following characters which have
unexpected meanings: $ + < = > ^ ` | ~
The Perl program will use the expected meanings; codeset=utf8
Locale 'univ.utf8' contains (at least) the following characters which have
unexpected meanings: $ + < = > ^ ` | ~
The Perl program will use the expected meanings; codeset=utf8
c++: error: +Z: No such file or directory
c++: error: +O2: No such file or directory
c++: error: +Onolimit: No such file or directory
# Connected to 127.0.0.1
syswrite() isn't allowed on :utf8 handles at t/Socket.t line 47.
# Looks like your test exited with 255 just after 2.
# Will use Digest::MD5
Integer overflow in hexadecimal number at t/broken_univ_can.t line 7.
make: *** [test_harness] Error 5

error while running harness target 'test_harness': 2 at /pro/3gl/CPAN/smoke/lib/Test/Smoke.pm line 194.
[2019-03-23 01:01:29MET] 
[2019-03-23 01:01:29MET] ../lib/warnings.t...........................................FAILED
[2019-03-23 01:01:29MET]     771-772
[2019-03-23 01:01:29MET] ../lib/locale.t.............................................FAILED
[2019-03-23 01:01:29MET]     431-432, 498
[2019-03-23 01:01:29MET] ../lib/B/Deparse.t..........................................PASSED
[2019-03-23 01:01:29MET]     2
[2019-03-23 01:01:29MET] ../dist/Net-Ping/t/450_service.t............................PASSED
[2019-03-23 01:01:29MET]     9, 18
[2019-03-23 01:01:29MET] ../cpan/Module-Metadata/t/extract-version.t.................PASSED
[2019-03-23 01:01:29MET]     7, 11, 15, 19, 23, 27, 31, 35, 39, 43, 47
[2019-03-23 01:01:29MET]     51, 55, 59, 63, 67, 71, 75, 79, 83, 87
[2019-03-23 01:01:29MET]     91, 95, 99, 106, 110, 114, 118, 122, 126
[2019-03-23 01:01:29MET]     130, 134, 138, 142, 149, 153, 157, 161
[2019-03-23 01:01:29MET]     165, 169, 173, 177, 181, 185, 195, 199
[2019-03-23 01:01:29MET]     203
[2019-03-23 01:01:29MET] ../cpan/Socket/t/Socket.t...................................FAILED
[2019-03-23 01:01:29MET]     Non-zero exit status: 255
[2019-03-23 01:01:29MET] ../cpan/Socket/t/Socket.t...................................FAILED
[2019-03-23 01:01:29MET]     Bad plan.  You planned 6 tests but ran 2.
[2019-03-23 01:01:29MET] Archived results...
[2019-03-23 01:01:29MET] Unskip tests from '/pro/3gl/CPAN/smoke/p59.skip'
[2019-03-23 01:01:29MET] 
[2019-03-23 01:01:29MET] Configuration: -Dusedevel -Duseithreads -DDEBUGGING
[2019-03-23 01:01:29MET] ------------------------------------------------------------------------------
[2019-03-23 01:01:29MET] make distclean ...
[2019-03-23 01:03:00MET] 
[2019-03-23 01:03:00MET] Copy Policy.sh ...
[2019-03-23 01:03:00MET] 
[2019-03-23 01:03:00MET] Configure ...
5.29.10 <=> 5.014002
===== PROCURA Policy for hpux/cc ========================
===== PROCURA Policy results ============================
cc:         cc
ccversion:  -
gccversion: -
ccflags:    -DDEBUGGING +Z -z
optimize:   
ld:         
ldflags:    -L/pro/local/lib
libswanted: cl pthread cl pthread socket bind inet nsl ndbm gdbm dbm db malloc dl ld sun m crypt sec util c cposix posix ucb bsd BSD
libsdirs:    /lib /pro/local/lib
locincpth:  /pro/local/include
loclibpth:  /pro/local/lib
useshrplib: 
===== PROCURA Policy done ===============================
[2019-03-23 01:05:08MET] 
[2019-03-23 01:05:08MET] make ...
parts/inc/mess provides vmess, which is still marked todo for 5.6.0
parts/inc/mess provides vmess, which is still marked todo for 5.6.0
Warning (mostly harmless): No library found for -lposix
Warning (mostly harmless): No library found for -lcposix
Making header files for XS...
[2019-03-23 01:34:59MET] Skip tests from '/pro/3gl/CPAN/smoke/p59.skip'
[2019-03-23 01:34:59MET] 
[2019-03-23 01:34:59MET]  Tests start here:
[2019-03-23 01:34:59MET] TSTENV = stdio	
No saved state, selection will be empty
Cannot figure out an encoding to use at t/use-Encode-Alias.t line 5.
Can't cd to (/pro/3gl/CPAN/perl-current/cpan/ExtUtils-Install/../../lib/auto/) ExtTest: No such file or directory
 at /pro/3gl/CPAN/perl-current/cpan/ExtUtils-Install/../../lib/ExtUtils/Installed.pm line 201.
# parser guessed wrong encoding expected 'CP1252' got 'UTF-8'
# Connected to 127.0.0.1
# Connected to 127.0.0.1
Integer overflow in hexadecimal number at t/broken_univ_can.t line 7.
Redefining sub xChild::foo at xChild--1450 line 2.
Redefining sub Data::ok at -e line 1.
c++: error: +Z: No such file or directory
# Will use Digest::MD5
PROG: 
use warnings 'syntax';
@foo::bar = 1..3;
() = "$foo'bar";
() = "@foo'bar";
() = "$#foo'bar";
no warnings 'syntax' ;
() = "$foo'bar";
() = "@foo'bar";
() = "$#foo'bar";
EXPECTED:
Old package separator used in string at - line 3.
	(Did you mean "$foo\'bar" instead?)
Old package separator used in string at - line 4.
	(Did you mean "@foo\'bar" instead?)
Old package separator used in string at - line 5.
	(Did you mean "$#foo\'bar" instead?)
GOT:

# Failed test 771 - at lib/warnings/toke line 418
PROG: 
use warnings 'syntax'; use utf8;
@fooл::barл = 1..3;
() = "$fooл'barл";
() = "@fooл'barл";
() = "$#fooл'barл";
no warnings 'syntax' ;
() = "$fooл'barл";
() = "@fooл'barл";
() = "$#fooл'barл";
EXPECTED:
Old package separator used in string at - line 3.
	(Did you mean "$fooл\'barл" instead?)
Old package separator used in string at - line 4.
	(Did you mean "@fooл\'barл" instead?)
Old package separator used in string at - line 5.
	(Did you mean "$#fooл\'barл" instead?)
GOT:

# Failed test 772 - at lib/warnings/toke line 435
make: *** [test_harness] Error 5

error while running harness target 'test_harness': 2 at /pro/3gl/CPAN/smoke/lib/Test/Smoke.pm line 194.
[2019-03-23 04:46:39MET] 
[2019-03-23 04:46:39MET] ../cpan/Module-Metadata/t/extract-version.t.................PASSED
[2019-03-23 04:46:39MET]     7, 11, 15, 19, 23, 27, 31, 35, 39, 43, 47
[2019-03-23 04:46:39MET]     51, 55, 59, 63, 67, 71, 75, 79, 83, 87
[2019-03-23 04:46:39MET]     91, 95, 99, 106, 110, 114, 118, 122, 126
[2019-03-23 04:46:39MET]     130, 134, 138, 142, 149, 153, 157, 161
[2019-03-23 04:46:39MET]     165, 169, 173, 177, 181, 185, 195, 199
[2019-03-23 04:46:39MET]     203
[2019-03-23 04:46:39MET] ../dist/Net-Ping/t/450_service.t............................PASSED
[2019-03-23 04:46:39MET]     9, 18
[2019-03-23 04:46:39MET] ../lib/locale.t.............................................FAILED
[2019-03-23 04:46:39MET]     431-432, 498
[2019-03-23 04:46:39MET] ../lib/warnings.t...........................................FAILED
[2019-03-23 04:46:39MET]     771-772
[2019-03-23 04:46:39MET] Archived results...
[2019-03-23 04:46:39MET] TSTENV = perlio	
# parser guessed wrong encoding expected 'CP1252' got 'UTF-8'
PROG: 
use warnings 'syntax';
@foo::bar = 1..3;
() = "$foo'bar";
() = "@foo'bar";
() = "$#foo'bar";
no warnings 'syntax' ;
() = "$foo'bar";
() = "@foo'bar";
() = "$#foo'bar";
EXPECTED:
Old package separator used in string at - line 3.
	(Did you mean "$foo\'bar" instead?)
Old package separator used in string at - line 4.
	(Did you mean "@foo\'bar" instead?)
Old package separator used in string at - line 5.
	(Did you mean "$#foo\'bar" instead?)
GOT:

# Failed test 771 - at lib/warnings/toke line 418
PROG: 
use warnings 'syntax'; use utf8;
@fooл::barл = 1..3;
() = "$fooл'barл";
() = "@fooл'barл";
() = "$#fooл'barл";
no warnings 'syntax' ;
() = "$fooл'barл";
() = "@fooл'barл";
() = "$#fooл'barл";
EXPECTED:
Old package separator used in string at - line 3.
	(Did you mean "$fooл\'barл" instead?)
Old package separator used in string at - line 4.
	(Did you mean "@fooл\'barл" instead?)
Old package separator used in string at - line 5.
	(Did you mean "$#fooл\'barл" instead?)
GOT:

# Failed test 772 - at lib/warnings/toke line 435
c++: error: +Z: No such file or directory
# Will use Digest::MD5
# Connected to 127.0.0.1
# Connected to 127.0.0.1
Cannot figure out an encoding to use at t/use-Encode-Alias.t line 5.
Integer overflow in hexadecimal number at t/broken_univ_can.t line 7.
make: *** [test_harness] Error 5

error while running harness target 'test_harness': 2 at /pro/3gl/CPAN/smoke/lib/Test/Smoke.pm line 194.
[2019-03-23 07:36:58MET] 
[2019-03-23 07:36:58MET] ../lib/warnings.t...........................................FAILED
[2019-03-23 07:36:58MET]     771-772
[2019-03-23 07:36:58MET] ../lib/locale.t.............................................FAILED
[2019-03-23 07:36:58MET]     431-432, 498
[2019-03-23 07:36:58MET] ../dist/Net-Ping/t/450_service.t............................PASSED
[2019-03-23 07:36:58MET]     9, 18
[2019-03-23 07:36:58MET] ../cpan/Module-Metadata/t/extract-version.t.................PASSED
[2019-03-23 07:36:58MET]     7, 11, 15, 19, 23, 27, 31, 35, 39, 43, 47
[2019-03-23 07:36:58MET]     51, 55, 59, 63, 67, 71, 75, 79, 83, 87
[2019-03-23 07:36:58MET]     91, 95, 99, 106, 110, 114, 118, 122, 126
[2019-03-23 07:36:58MET]     130, 134, 138, 142, 149, 153, 157, 161
[2019-03-23 07:36:58MET]     165, 169, 173, 177, 181, 185, 195, 199
[2019-03-23 07:36:58MET]     203
[2019-03-23 07:36:58MET] Archived results...
[2019-03-23 07:36:58MET] TSTENV = locale:univ.utf8	
# parser guessed wrong encoding expected 'CP1252' got 'UTF-8'
PROG: 
use warnings 'syntax';
@foo::bar = 1..3;
() = "$foo'bar";
() = "@foo'bar";
() = "$#foo'bar";
no warnings 'syntax' ;
() = "$foo'bar";
() = "@foo'bar";
() = "$#foo'bar";
EXPECTED:
Old package separator used in string at - line 3.
	(Did you mean "$foo\'bar" instead?)
Old package separator used in string at - line 4.
	(Did you mean "@foo\'bar" instead?)
Old package separator used in string at - line 5.
	(Did you mean "$#foo\'bar" instead?)
GOT:

# Failed test 771 - at lib/warnings/toke line 418
PROG: 
use warnings 'syntax'; use utf8;
@fooл::barл = 1..3;
() = "$fooл'barл";
() = "@fooл'barл";
() = "$#fooл'barл";
no warnings 'syntax' ;
() = "$fooл'barл";
() = "@fooл'barл";
() = "$#fooл'barл";
EXPECTED:
Old package separator used in string at - line 3.
	(Did you mean "$fooл\'barл" instead?)
Old package separator used in string at - line 4.
	(Did you mean "@fooл\'barл" instead?)
Old package separator used in string at - line 5.
	(Did you mean "$#fooл\'barл" instead?)
GOT:

# Failed test 772 - at lib/warnings/toke line 435
c++: error: +Z: No such file or directory
Locale 'univ.utf8' contains (at least) the following characters which have
unexpected meanings: $ + < = > ^ ` | ~
The Perl program will use the expected meanings; codeset=utf8
Locale 'univ.utf8' contains (at least) the following characters which have
unexpected meanings: $ + < = > ^ ` | ~
The Perl program will use the expected meanings; codeset=utf8
Locale 'univ.utf8' contains (at least) the following characters which have
unexpected meanings: $ + < = > ^ ` | ~
The Perl program will use the expected meanings; codeset=utf8
Locale 'univ.utf8' contains (at least) the following characters which have
unexpected meanings: $ + < = > ^ ` | ~
The Perl program will use the expected meanings; codeset=utf8
Locale 'univ.utf8' contains (at least) the following characters which have
unexpected meanings: $ + < = > ^ ` | ~
The Perl program will use the expected meanings; codeset=utf8
Locale 'univ.utf8' contains (at least) the following characters which have
unexpected meanings: $ + < = > ^ ` | ~
The Perl program will use the expected meanings; codeset=utf8
Locale 'univ.utf8' contains (at least) the following characters which have
unexpected meanings: $ + < = > ^ ` | ~
The Perl program will use the expected meanings; codeset=utf8
Locale 'univ.utf8' contains (at least) the following characters which have
unexpected meanings: $ + < = > ^ ` | ~
The Perl program will use the expected meanings; codeset=utf8
Locale 'univ.utf8' contains (at least) the following characters which have
unexpected meanings: $ + < = > ^ ` | ~
The Perl program will use the expected meanings; codeset=utf8
Locale 'univ.utf8' contains (at least) the following characters which have
unexpected meanings: $ + < = > ^ ` | ~
The Perl program will use the expected meanings; codeset=utf8
Locale 'univ.utf8' contains (at least) the following characters which have
unexpected meanings: $ + < = > ^ ` | ~
The Perl program will use the expected meanings; codeset=utf8
Locale 'univ.utf8' contains (at least) the following characters which have
unexpected meanings: $ + < = > ^ ` | ~
The Perl program will use the expected meanings; codeset=utf8
Locale 'univ.utf8' contains (at least) the following characters which have
unexpected meanings: $ + < = > ^ ` | ~
The Perl program will use the expected meanings; codeset=utf8
Locale 'univ.utf8' contains (at least) the following characters which have
unexpected meanings: $ + < = > ^ ` | ~
The Perl program will use the expected meanings; codeset=utf8
Locale 'univ.utf8' contains (at least) the following characters which have
unexpected meanings: $ + < = > ^ ` | ~
The Perl program will use the expected meanings; codeset=utf8
# Will use Digest::MD5
# Connected to 127.0.0.1
syswrite() isn't allowed on :utf8 handles at t/Socket.t line 47.
# Looks like your test exited with 255 just after 2.
Integer overflow in hexadecimal number at t/broken_univ_can.t line 7.
make: *** [test_harness] Error 5

error while running harness target 'test_harness': 2 at /pro/3gl/CPAN/smoke/lib/Test/Smoke.pm line 194.
[2019-03-23 10:28:44MET] 
[2019-03-23 10:28:44MET] ../lib/locale.t.............................................FAILED
[2019-03-23 10:28:44MET]     431-432, 498
[2019-03-23 10:28:44MET] ../lib/B/Deparse.t..........................................PASSED
[2019-03-23 10:28:44MET]     2
[2019-03-23 10:28:44MET] ../lib/warnings.t...........................................FAILED
[2019-03-23 10:28:44MET]     771-772
[2019-03-23 10:28:44MET] ../dist/Net-Ping/t/450_service.t............................PASSED
[2019-03-23 10:28:44MET]     9, 18
[2019-03-23 10:28:44MET] ../cpan/Module-Metadata/t/extract-version.t.................PASSED
[2019-03-23 10:28:44MET]     7, 11, 15, 19, 23, 27, 31, 35, 39, 43, 47
[2019-03-23 10:28:44MET]     51, 55, 59, 63, 67, 71, 75, 79, 83, 87
[2019-03-23 10:28:44MET]     91, 95, 99, 106, 110, 114, 118, 122, 126
[2019-03-23 10:28:44MET]     130, 134, 138, 142, 149, 153, 157, 161
[2019-03-23 10:28:44MET]     165, 169, 173, 177, 181, 185, 195, 199
[2019-03-23 10:28:44MET]     203
[2019-03-23 10:28:44MET] ../cpan/Socket/t/Socket.t...................................FAILED
[2019-03-23 10:28:44MET]     Non-zero exit status: 255
[2019-03-23 10:28:44MET] ../cpan/Socket/t/Socket.t...................................FAILED
[2019-03-23 10:28:44MET]     Bad plan.  You planned 6 tests but ran 2.
[2019-03-23 10:28:45MET] Archived results...
[2019-03-23 10:28:45MET] Unskip tests from '/pro/3gl/CPAN/smoke/p59.skip'
[2019-03-23 10:28:45MET] 
[2019-03-23 10:28:45MET] Configuration: -Dusedevel -Duseithreads -Duse64bitall
[2019-03-23 10:28:45MET] ------------------------------------------------------------------------------
[2019-03-23 10:28:45MET] make distclean ...
[2019-03-23 10:31:22MET] 
[2019-03-23 10:31:22MET] Copy Policy.sh ...
[2019-03-23 10:31:22MET] 
[2019-03-23 10:31:22MET] Configure ...
5.29.10 <=> 5.014002
===== PROCURA Policy for hpux/cc ========================
===== PROCURA Policy results ============================
cc:         cc
ccversion:  -
gccversion: -
ccflags:     +Z -z
optimize:   
ld:         
ldflags:    -L/pro/local/lib
libswanted: cl pthread cl pthread socket bind inet nsl ndbm gdbm dbm db malloc dl ld sun m crypt sec util c cposix posix ucb bsd BSD
libsdirs:    /lib /pro/local/lib
locincpth:  /pro/local/include
loclibpth:  /pro/local/lib
useshrplib: 
===== PROCURA Policy done ===============================
[2019-03-23 10:33:29MET] 
[2019-03-23 10:33:29MET] make ...
parts/inc/mess provides vmess, which is still marked todo for 5.6.0
parts/inc/mess provides vmess, which is still marked todo for 5.6.0
Warning (mostly harmless): No library found for -lposix
Warning (mostly harmless): No library found for -lcposix
cc: warning 457: The Onolimit option is not valid at this optimization level.
Making header files for XS...
[2019-03-23 10:51:35MET] Skip tests from '/pro/3gl/CPAN/smoke/p59.skip'
[2019-03-23 10:51:35MET] 
[2019-03-23 10:51:35MET]  Tests start here:
[2019-03-23 10:51:35MET] TSTENV = stdio	
No saved state, selection will be empty
Cannot figure out an encoding to use at t/use-Encode-Alias.t line 5.
# parser guessed wrong encoding expected 'CP1252' got 'UTF-8'
# Connected to 127.0.0.1
# Connected to 127.0.0.1
Redefining sub xChild::foo at xChild--23054 line 2.
Redefining sub Data::ok at -e line 1.
c++: error: +Z: No such file or directory
c++: error: +O2: No such file or directory
c++: error: +Onolimit: No such file or directory
# Will use Digest::MD5
PROG: 
use warnings 'uninitialized';

# aelem + const
use constant foo => \0;
$SIG{__WARN__} = sub {
 print STDERR
   $_[0] =~ /\$a\[([^]]+)]/ && $1 == foo
       ? "ok\n"
       : ("$1 != ",0+foo,"\n")
};
() = "$a[foo]";
undef $SIG{__WARN__};

# Multideref
() = "$a[140688675223280]";
EXPECTED:
ok
Use of uninitialized value $a[140688675223280] in string at - line 15.
GOT:
-9223372032559481776 != 9223372041150069840
Use of uninitialized value $a[140688675223280] in string at - line 15.
# Failed test 366 - 64-bit array subscripts at lib/warnings/9uninit line 2175
PROG: 
use warnings 'syntax';
@foo::bar = 1..3;
() = "$foo'bar";
() = "@foo'bar";
() = "$#foo'bar";
no warnings 'syntax' ;
() = "$foo'bar";
() = "@foo'bar";
() = "$#foo'bar";
EXPECTED:
Old package separator used in string at - line 3.
	(Did you mean "$foo\'bar" instead?)
Old package separator used in string at - line 4.
	(Did you mean "@foo\'bar" instead?)
Old package separator used in string at - line 5.
	(Did you mean "$#foo\'bar" instead?)
GOT:

# Failed test 771 - at lib/warnings/toke line 418
PROG: 
use warnings 'syntax'; use utf8;
@fooл::barл = 1..3;
() = "$fooл'barл";
() = "@fooл'barл";
() = "$#fooл'barл";
no warnings 'syntax' ;
() = "$fooл'barл";
() = "@fooл'barл";
() = "$#fooл'barл";
EXPECTED:
Old package separator used in string at - line 3.
	(Did you mean "$fooл\'barл" instead?)
Old package separator used in string at - line 4.
	(Did you mean "@fooл\'barл" instead?)
Old package separator used in string at - line 5.
	(Did you mean "$#fooл\'barл" instead?)
GOT:

# Failed test 772 - at lib/warnings/toke line 435
make: *** [test_harness] Error 6

error while running harness target 'test_harness': 2 at /pro/3gl/CPAN/smoke/lib/Test/Smoke.pm line 194.
[2019-03-23 12:35:44MET] 
[2019-03-23 12:35:44MET] ../cpan/Module-Metadata/t/extract-version.t.................PASSED
[2019-03-23 12:35:44MET]     7, 11, 15, 19, 23, 27, 31, 35, 39, 43, 47
[2019-03-23 12:35:44MET]     51, 55, 59, 63, 67, 71, 75, 79, 83, 87
[2019-03-23 12:35:44MET]     91, 95, 99, 106, 110, 114, 118, 122, 126
[2019-03-23 12:35:44MET]     130, 134, 138, 142, 149, 153, 157, 161
[2019-03-23 12:35:44MET]     165, 169, 173, 177, 181, 185, 195, 199
[2019-03-23 12:35:44MET]     203
[2019-03-23 12:35:44MET] ../dist/Net-Ping/t/450_service.t............................PASSED
[2019-03-23 12:35:44MET]     9, 18
[2019-03-23 12:35:44MET] ../lib/locale.t.............................................FAILED
[2019-03-23 12:35:44MET]     431-432, 498
[2019-03-23 12:35:44MET] ../lib/warnings.t...........................................FAILED
[2019-03-23 12:35:44MET]     366, 771-772
[2019-03-23 12:35:44MET] Archived results...
[2019-03-23 12:35:44MET] TSTENV = perlio	
PROG: 
use warnings 'uninitialized';

# aelem + const
use constant foo => \0;
$SIG{__WARN__} = sub {
 print STDERR
   $_[0] =~ /\$a\[([^]]+)]/ && $1 == foo
       ? "ok\n"
       : ("$1 != ",0+foo,"\n")
};
() = "$a[foo]";
undef $SIG{__WARN__};

# Multideref
() = "$a[140688675223280]";
EXPECTED:
ok
Use of uninitialized value $a[140688675223280] in string at - line 15.
GOT:
-9223372032559481360 != 9223372041150070256
Use of uninitialized value $a[140688675223280] in string at - line 15.
# Failed test 366 - 64-bit array subscripts at lib/warnings/9uninit line 2175
PROG: 
use warnings 'syntax';
@foo::bar = 1..3;
() = "$foo'bar";
() = "@foo'bar";
() = "$#foo'bar";
no warnings 'syntax' ;
() = "$foo'bar";
() = "@foo'bar";
() = "$#foo'bar";
EXPECTED:
Old package separator used in string at - line 3.
	(Did you mean "$foo\'bar" instead?)
Old package separator used in string at - line 4.
	(Did you mean "@foo\'bar" instead?)
Old package separator used in string at - line 5.
	(Did you mean "$#foo\'bar" instead?)
GOT:

# Failed test 771 - at lib/warnings/toke line 418
PROG: 
use warnings 'syntax'; use utf8;
@fooл::barл = 1..3;
() = "$fooл'barл";
() = "@fooл'barл";
() = "$#fooл'barл";
no warnings 'syntax' ;
() = "$fooл'barл";
() = "@fooл'barл";
() = "$#fooл'barл";
EXPECTED:
Old package separator used in string at - line 3.
	(Did you mean "$fooл\'barл" instead?)
Old package separator used in string at - line 4.
	(Did you mean "@fooл\'barл" instead?)
Old package separator used in string at - line 5.
	(Did you mean "$#fooл\'barл" instead?)
GOT:

# Failed test 772 - at lib/warnings/toke line 435
# parser guessed wrong encoding expected 'CP1252' got 'UTF-8'
c++: error: +Z: No such file or directory
c++: error: +O2: No such file or directory
c++: error: +Onolimit: No such file or directory
# Will use Digest::MD5
# Connected to 127.0.0.1
# Connected to 127.0.0.1
Cannot figure out an encoding to use at t/use-Encode-Alias.t line 5.
make: *** [test_harness] Error 6

error while running harness target 'test_harness': 2 at /pro/3gl/CPAN/smoke/lib/Test/Smoke.pm line 194.
[2019-03-23 14:06:04MET] 
[2019-03-23 14:06:04MET] ../lib/warnings.t...........................................FAILED
[2019-03-23 14:06:04MET]     366, 771-772
[2019-03-23 14:06:04MET] ../lib/locale.t.............................................FAILED
[2019-03-23 14:06:04MET]     431-432, 498
[2019-03-23 14:06:04MET] ../dist/Net-Ping/t/450_service.t............................PASSED
[2019-03-23 14:06:04MET]     9, 18
[2019-03-23 14:06:04MET] ../cpan/Module-Metadata/t/extract-version.t.................PASSED
[2019-03-23 14:06:04MET]     7, 11, 15, 19, 23, 27, 31, 35, 39, 43, 47
[2019-03-23 14:06:04MET]     51, 55, 59, 63, 67, 71, 75, 79, 83, 87
[2019-03-23 14:06:04MET]     91, 95, 99, 106, 110, 114, 118, 122, 126
[2019-03-23 14:06:04MET]     130, 134, 138, 142, 149, 153, 157, 161
[2019-03-23 14:06:04MET]     165, 169, 173, 177, 181, 185, 195, 199
[2019-03-23 14:06:04MET]     203
[2019-03-23 14:06:04MET] Archived results...
[2019-03-23 14:06:04MET] TSTENV = locale:univ.utf8	
PROG: 
use warnings 'uninitialized';

# aelem + const
use constant foo => \0;
$SIG{__WARN__} = sub {
 print STDERR
   $_[0] =~ /\$a\[([^]]+)]/ && $1 == foo
       ? "ok\n"
       : ("$1 != ",0+foo,"\n")
};
() = "$a[foo]";
undef $SIG{__WARN__};

# Multideref
() = "$a[140688675223280]";
EXPECTED:
ok
Use of uninitialized value $a[140688675223280] in string at - line 15.
GOT:
-9223372032559481720 != 9223372041150069896
Use of uninitialized value $a[140688675223280] in string at - line 15.
# Failed test 366 - 64-bit array subscripts at lib/warnings/9uninit line 2175
PROG: 
use warnings 'syntax';
@foo::bar = 1..3;
() = "$foo'bar";
() = "@foo'bar";
() = "$#foo'bar";
no warnings 'syntax' ;
() = "$foo'bar";
() = "@foo'bar";
() = "$#foo'bar";
EXPECTED:
Old package separator used in string at - line 3.
	(Did you mean "$foo\'bar" instead?)
Old package separator used in string at - line 4.
	(Did you mean "@foo\'bar" instead?)
Old package separator used in string at - line 5.
	(Did you mean "$#foo\'bar" instead?)
GOT:

# Failed test 771 - at lib/warnings/toke line 418
PROG: 
use warnings 'syntax'; use utf8;
@fooл::barл = 1..3;
() = "$fooл'barл";
() = "@fooл'barл";
() = "$#fooл'barл";
no warnings 'syntax' ;
() = "$fooл'barл";
() = "@fooл'barл";
() = "$#fooл'barл";
EXPECTED:
Old package separator used in string at - line 3.
	(Did you mean "$fooл\'barл" instead?)
Old package separator used in string at - line 4.
	(Did you mean "@fooл\'barл" instead?)
Old package separator used in string at - line 5.
	(Did you mean "$#fooл\'barл" instead?)
GOT:

# Failed test 772 - at lib/warnings/toke line 435
Locale 'univ.utf8' contains (at least) the following characters which have
unexpected meanings: $ + < = > ^ ` | ~
The Perl program will use the expected meanings; codeset=utf8
Locale 'univ.utf8' contains (at least) the following characters which have
unexpected meanings: $ + < = > ^ ` | ~
The Perl program will use the expected meanings; codeset=utf8
Locale 'univ.utf8' contains (at least) the following characters which have
unexpected meanings: $ + < = > ^ ` | ~
The Perl program will use the expected meanings; codeset=utf8
Locale 'univ.utf8' contains (at least) the following characters which have
unexpected meanings: $ + < = > ^ ` | ~
The Perl program will use the expected meanings; codeset=utf8
Locale 'univ.utf8' contains (at least) the following characters which have
unexpected meanings: $ + < = > ^ ` | ~
The Perl program will use the expected meanings; codeset=utf8
Locale 'univ.utf8' contains (at least) the following characters which have
unexpected meanings: $ + < = > ^ ` | ~
The Perl program will use the expected meanings; codeset=utf8
Locale 'univ.utf8' contains (at least) the following characters which have
unexpected meanings: $ + < = > ^ ` | ~
The Perl program will use the expected meanings; codeset=utf8
Locale 'univ.utf8' contains (at least) the following characters which have
unexpected meanings: $ + < = > ^ ` | ~
The Perl program will use the expected meanings; codeset=utf8
Locale 'univ.utf8' contains (at least) the following characters which have
unexpected meanings: $ + < = > ^ ` | ~
The Perl program will use the expected meanings; codeset=utf8
Locale 'univ.utf8' contains (at least) the following characters which have
unexpected meanings: $ + < = > ^ ` | ~
The Perl program will use the expected meanings; codeset=utf8
Locale 'univ.utf8' contains (at least) the following characters which have
unexpected meanings: $ + < = > ^ ` | ~
The Perl program will use the expected meanings; codeset=utf8
Locale 'univ.utf8' contains (at least) the following characters which have
unexpected meanings: $ + < = > ^ ` | ~
The Perl program will use the expected meanings; codeset=utf8
Locale 'univ.utf8' contains (at least) the following characters which have
unexpected meanings: $ + < = > ^ ` | ~
The Perl program will use the expected meanings; codeset=utf8
Locale 'univ.utf8' contains (at least) the following characters which have
unexpected meanings: $ + < = > ^ ` | ~
The Perl program will use the expected meanings; codeset=utf8
Locale 'univ.utf8' contains (at least) the following characters which have
unexpected meanings: $ + < = > ^ ` | ~
The Perl program will use the expected meanings; codeset=utf8
# parser guessed wrong encoding expected 'CP1252' got 'UTF-8'
c++: error: +Z: No such file or directory
c++: error: +O2: No such file or directory
c++: error: +Onolimit: No such file or directory
# Connected to 127.0.0.1
syswrite() isn't allowed on :utf8 handles at t/Socket.t line 47.
# Looks like your test exited with 255 just after 2.
# Will use Digest::MD5
make: *** [test_harness] Error 6

error while running harness target 'test_harness': 2 at /pro/3gl/CPAN/smoke/lib/Test/Smoke.pm line 194.
[2019-03-23 15:38:17MET] 
[2019-03-23 15:38:17MET] ../lib/warnings.t...........................................FAILED
[2019-03-23 15:38:17MET]     366, 771-772
[2019-03-23 15:38:17MET] ../lib/B/Deparse.t..........................................PASSED
[2019-03-23 15:38:17MET]     2
[2019-03-23 15:38:17MET] ../lib/locale.t.............................................FAILED
[2019-03-23 15:38:17MET]     431-432, 498
[2019-03-23 15:38:17MET] ../cpan/Module-Metadata/t/extract-version.t.................PASSED
[2019-03-23 15:38:17MET]     7, 11, 15, 19, 23, 27, 31, 35, 39, 43, 47
[2019-03-23 15:38:17MET]     51, 55, 59, 63, 67, 71, 75, 79, 83, 87
[2019-03-23 15:38:17MET]     91, 95, 99, 106, 110, 114, 118, 122, 126
[2019-03-23 15:38:17MET]     130, 134, 138, 142, 149, 153, 157, 161
[2019-03-23 15:38:17MET]     165, 169, 173, 177, 181, 185, 195, 199
[2019-03-23 15:38:17MET]     203
[2019-03-23 15:38:17MET] ../dist/Net-Ping/t/450_service.t............................PASSED
[2019-03-23 15:38:17MET]     9, 18
[2019-03-23 15:38:17MET] ../cpan/Socket/t/Socket.t...................................FAILED
[2019-03-23 15:38:17MET]     Non-zero exit status: 255
[2019-03-23 15:38:17MET] ../cpan/Socket/t/Socket.t...................................FAILED
[2019-03-23 15:38:17MET]     Bad plan.  You planned 6 tests but ran 2.
[2019-03-23 15:38:17MET] Archived results...
[2019-03-23 15:38:17MET] Unskip tests from '/pro/3gl/CPAN/smoke/p59.skip'
[2019-03-23 15:38:17MET] 
[2019-03-23 15:38:17MET] Configuration: -Dusedevel -Duseithreads -Duse64bitall -DDEBUGGING
[2019-03-23 15:38:17MET] ------------------------------------------------------------------------------
[2019-03-23 15:38:17MET] make distclean ...
[2019-03-23 15:39:51MET] 
[2019-03-23 15:39:51MET] Copy Policy.sh ...
[2019-03-23 15:39:51MET] 
[2019-03-23 15:39:51MET] Configure ...
5.29.10 <=> 5.014002
===== PROCURA Policy for hpux/cc ========================
===== PROCURA Policy results ============================
cc:         cc
ccversion:  -
gccversion: -
ccflags:    -DDEBUGGING +Z -z
optimize:   
ld:         
ldflags:    -L/pro/local/lib
libswanted: cl pthread cl pthread socket bind inet nsl ndbm gdbm dbm db malloc dl ld sun m crypt sec util c cposix posix ucb bsd BSD
libsdirs:    /lib /pro/local/lib
locincpth:  /pro/local/include
loclibpth:  /pro/local/lib
useshrplib: 
===== PROCURA Policy done ===============================
[2019-03-23 15:42:12MET] 
[2019-03-23 15:42:12MET] make ...
parts/inc/mess provides vmess, which is still marked todo for 5.6.0
parts/inc/mess provides vmess, which is still marked todo for 5.6.0
Warning (mostly harmless): No library found for -lposix
Warning (mostly harmless): No library found for -lcposix
cc: warning 457: The Onolimit option is not valid at this optimization level.
Making header files for XS...
[2019-03-23 16:12:55MET] Skip tests from '/pro/3gl/CPAN/smoke/p59.skip'
[2019-03-23 16:12:55MET] 
[2019-03-23 16:12:55MET]  Tests start here:
[2019-03-23 16:12:55MET] TSTENV = stdio	
No saved state, selection will be empty
Assertion failed: header->prev->next == header, file util.c, line 241
Cannot figure out an encoding to use at t/use-Encode-Alias.t line 5.
# parser guessed wrong encoding expected 'CP1252' got 'UTF-8'
# Connected to 127.0.0.1
# Connected to 127.0.0.1
Redefining sub xChild::foo at xChild--8523 line 2.
Redefining sub Data::ok at -e line 1.
c++: error: +Z: No such file or directory
c++: error: +O2: No such file or directory
c++: error: +Onolimit: No such file or directory
# Will use Digest::MD5
PROG: 
use warnings 'uninitialized';

# aelem + const
use constant foo => \0;
$SIG{__WARN__} = sub {
 print STDERR
   $_[0] =~ /\$a\[([^]]+)]/ && $1 == foo
       ? "ok\n"
       : ("$1 != ",0+foo,"\n")
};
() = "$a[foo]";
undef $SIG{__WARN__};

# Multideref
() = "$a[140688675223280]";
EXPECTED:
ok
Use of uninitialized value $a[140688675223280] in string at - line 15.
GOT:
-9223372032558284064 != 9223372041151267552
Use of uninitialized value $a[140688675223280] in string at - line 15.
# Failed test 366 - 64-bit array subscripts at lib/warnings/9uninit line 2175
PROG: 
use warnings 'syntax';
@foo::bar = 1..3;
() = "$foo'bar";
() = "@foo'bar";
() = "$#foo'bar";
no warnings 'syntax' ;
() = "$foo'bar";
() = "@foo'bar";
() = "$#foo'bar";
EXPECTED:
Old package separator used in string at - line 3.
	(Did you mean "$foo\'bar" instead?)
Old package separator used in string at - line 4.
	(Did you mean "@foo\'bar" instead?)
Old package separator used in string at - line 5.
	(Did you mean "$#foo\'bar" instead?)
GOT:

# Failed test 771 - at lib/warnings/toke line 418
PROG: 
use warnings 'syntax'; use utf8;
@fooл::barл = 1..3;
() = "$fooл'barл";
() = "@fooл'barл";
() = "$#fooл'barл";
no warnings 'syntax' ;
() = "$fooл'barл";
() = "@fooл'barл";
() = "$#fooл'barл";
EXPECTED:
Old package separator used in string at - line 3.
	(Did you mean "$fooл\'barл" instead?)
Old package separator used in string at - line 4.
	(Did you mean "@fooл\'barл" instead?)
Old package separator used in string at - line 5.
	(Did you mean "$#fooл\'barл" instead?)
GOT:

# Failed test 772 - at lib/warnings/toke line 435
make: *** [test_harness] Error 6

error while running harness target 'test_harness': 2 at /pro/3gl/CPAN/smoke/lib/Test/Smoke.pm line 194.
[2019-03-23 18:17:44MET] 
[2019-03-23 18:17:44MET] ../t/io/nargv.t.............................................FAILED
[2019-03-23 18:17:44MET]     Bad plan.  You planned 7 tests but ran 0.
[2019-03-23 18:17:44MET] ../cpan/Module-Metadata/t/extract-version.t.................PASSED
[2019-03-23 18:17:44MET]     7, 11, 15, 19, 23, 27, 31, 35, 39, 43, 47
[2019-03-23 18:17:44MET]     51, 55, 59, 63, 67, 71, 75, 79, 83, 87
[2019-03-23 18:17:44MET]     91, 95, 99, 106, 110, 114, 118, 122, 126
[2019-03-23 18:17:44MET]     130, 134, 138, 142, 149, 153, 157, 161
[2019-03-23 18:17:44MET]     165, 169, 173, 177, 181, 185, 195, 199
[2019-03-23 18:17:44MET]     203
[2019-03-23 18:17:44MET] ../dist/Net-Ping/t/450_service.t............................PASSED
[2019-03-23 18:17:44MET]     9, 18
[2019-03-23 18:17:44MET] ../lib/locale.t.............................................FAILED
[2019-03-23 18:17:44MET]     431-432, 498
[2019-03-23 18:17:44MET] ../lib/warnings.t...........................................FAILED
[2019-03-23 18:17:44MET]     366, 771-772
[2019-03-23 18:17:44MET] Archived results...
[2019-03-23 18:17:44MET] TSTENV = perlio	
Assertion failed: header->prev->next == header, file util.c, line 241
Assertion failed: header->prev->next == header, file util.c, line 241
PROG: 
use warnings 'uninitialized';

# aelem + const
use constant foo => \0;
$SIG{__WARN__} = sub {
 print STDERR
   $_[0] =~ /\$a\[([^]]+)]/ && $1 == foo
       ? "ok\n"
       : ("$1 != ",0+foo,"\n")
};
() = "$a[foo]";
undef $SIG{__WARN__};

# Multideref
() = "$a[140688675223280]";
EXPECTED:
ok
Use of uninitialized value $a[140688675223280] in string at - line 15.
GOT:
-9223372032558283544 != 9223372041151268072
Use of uninitialized value $a[140688675223280] in string at - line 15.
# Failed test 366 - 64-bit array subscripts at lib/warnings/9uninit line 2175
PROG: 
use warnings 'syntax';
@foo::bar = 1..3;
() = "$foo'bar";
() = "@foo'bar";
() = "$#foo'bar";
no warnings 'syntax' ;
() = "$foo'bar";
() = "@foo'bar";
() = "$#foo'bar";
EXPECTED:
Old package separator used in string at - line 3.
	(Did you mean "$foo\'bar" instead?)
Old package separator used in string at - line 4.
	(Did you mean "@foo\'bar" instead?)
Old package separator used in string at - line 5.
	(Did you mean "$#foo\'bar" instead?)
GOT:

# Failed test 771 - at lib/warnings/toke line 418
PROG: 
use warnings 'syntax'; use utf8;
@fooл::barл = 1..3;
() = "$fooл'barл";
() = "@fooл'barл";
() = "$#fooл'barл";
no warnings 'syntax' ;
() = "$fooл'barл";
() = "@fooл'barл";
() = "$#fooл'barл";
EXPECTED:
Old package separator used in string at - line 3.
	(Did you mean "$fooл\'barл" instead?)
Old package separator used in string at - line 4.
	(Did you mean "@fooл\'barл" instead?)
Old package separator used in string at - line 5.
	(Did you mean "$#fooл\'barл" instead?)
GOT:

# Failed test 772 - at lib/warnings/toke line 435
# parser guessed wrong encoding expected 'CP1252' got 'UTF-8'
c++: error: +Z: No such file or directory
c++: error: +O2: No such file or directory
c++: error: +Onolimit: No such file or directory
# Will use Digest::MD5
# Connected to 127.0.0.1
# Connected to 127.0.0.1
Cannot figure out an encoding to use at t/use-Encode-Alias.t line 5.
make: *** [test_harness] Error 6

error while running harness target 'test_harness': 2 at /pro/3gl/CPAN/smoke/lib/Test/Smoke.pm line 194.
[2019-03-23 20:10:09MET] 
[2019-03-23 20:10:09MET] ../t/io/iprefix.t...........................................FAILED
[2019-03-23 20:10:09MET]     Bad plan.  You planned 2 tests but ran 0.
[2019-03-23 20:10:09MET] ../t/io/nargv.t.............................................FAILED
[2019-03-23 20:10:09MET]     Bad plan.  You planned 7 tests but ran 6.
[2019-03-23 20:10:09MET] ../lib/warnings.t...........................................FAILED
[2019-03-23 20:10:09MET]     366, 771-772
[2019-03-23 20:10:09MET] ../lib/locale.t.............................................FAILED
[2019-03-23 20:10:09MET]     431-432, 498
[2019-03-23 20:10:09MET] ../dist/Thread-Queue/t/03_peek.t............................FAILED
[2019-03-23 20:10:09MET]     Bad plan.  You planned 19 tests but ran 1.
[2019-03-23 20:10:09MET] ../dist/Net-Ping/t/450_service.t............................PASSED
[2019-03-23 20:10:09MET]     9, 18
[2019-03-23 20:10:09MET] ../cpan/Module-Metadata/t/extract-version.t.................PASSED
[2019-03-23 20:10:09MET]     7, 11, 15, 19, 23, 27, 31, 35, 39, 43, 47
[2019-03-23 20:10:09MET]     51, 55, 59, 63, 67, 71, 75, 79, 83, 87
[2019-03-23 20:10:09MET]     91, 95, 99, 106, 110, 114, 118, 122, 126
[2019-03-23 20:10:09MET]     130, 134, 138, 142, 149, 153, 157, 161
[2019-03-23 20:10:09MET]     165, 169, 173, 177, 181, 185, 195, 199
[2019-03-23 20:10:09MET]     203
[2019-03-23 20:10:09MET] Archived results...
[2019-03-23 20:10:09MET] TSTENV = locale:univ.utf8	
PROG: 
use warnings 'uninitialized';

# aelem + const
use constant foo => \0;
$SIG{__WARN__} = sub {
 print STDERR
   $_[0] =~ /\$a\[([^]]+)]/ && $1 == foo
       ? "ok\n"
       : ("$1 != ",0+foo,"\n")
};
() = "$a[foo]";
undef $SIG{__WARN__};

# Multideref
() = "$a[140688675223280]";
EXPECTED:
ok
Use of uninitialized value $a[140688675223280] in string at - line 15.
GOT:
-9223372032558283960 != 9223372041151267656
Use of uninitialized value $a[140688675223280] in string at - line 15.
# Failed test 366 - 64-bit array subscripts at lib/warnings/9uninit line 2175
PROG: 
use warnings 'syntax';
@foo::bar = 1..3;
() = "$foo'bar";
() = "@foo'bar";
() = "$#foo'bar";
no warnings 'syntax' ;
() = "$foo'bar";
() = "@foo'bar";
() = "$#foo'bar";
EXPECTED:
Old package separator used in string at - line 3.
	(Did you mean "$foo\'bar" instead?)
Old package separator used in string at - line 4.
	(Did you mean "@foo\'bar" instead?)
Old package separator used in string at - line 5.
	(Did you mean "$#foo\'bar" instead?)
GOT:

# Failed test 771 - at lib/warnings/toke line 418
PROG: 
use warnings 'syntax'; use utf8;
@fooл::barл = 1..3;
() = "$fooл'barл";
() = "@fooл'barл";
() = "$#fooл'barл";
no warnings 'syntax' ;
() = "$fooл'barл";
() = "@fooл'barл";
() = "$#fooл'barл";
EXPECTED:
Old package separator used in string at - line 3.
	(Did you mean "$fooл\'barл" instead?)
Old package separator used in string at - line 4.
	(Did you mean "@fooл\'barл" instead?)
Old package separator used in string at - line 5.
	(Did you mean "$#fooл\'barл" instead?)
GOT:

# Failed test 772 - at lib/warnings/toke line 435
# parser guessed wrong encoding expected 'CP1252' got 'UTF-8'
Locale 'univ.utf8' contains (at least) the following characters which have
unexpected meanings: $ + < = > ^ ` | ~
The Perl program will use the expected meanings; codeset=utf8
Locale 'univ.utf8' contains (at least) the following characters which have
unexpected meanings: $ + < = > ^ ` | ~
The Perl program will use the expected meanings; codeset=utf8
Locale 'univ.utf8' contains (at least) the following characters which have
unexpected meanings: $ + < = > ^ ` | ~
The Perl program will use the expected meanings; codeset=utf8
Locale 'univ.utf8' contains (at least) the following characters which have
unexpected meanings: $ + < = > ^ ` | ~
The Perl program will use the expected meanings; codeset=utf8
Locale 'univ.utf8' contains (at least) the following characters which have
unexpected meanings: $ + < = > ^ ` | ~
The Perl program will use the expected meanings; codeset=utf8
Locale 'univ.utf8' contains (at least) the following characters which have
unexpected meanings: $ + < = > ^ ` | ~
The Perl program will use the expected meanings; codeset=utf8
Locale 'univ.utf8' contains (at least) the following characters which have
unexpected meanings: $ + < = > ^ ` | ~
The Perl program will use the expected meanings; codeset=utf8
Locale 'univ.utf8' contains (at least) the following characters which have
unexpected meanings: $ + < = > ^ ` | ~
The Perl program will use the expected meanings; codeset=utf8
Locale 'univ.utf8' contains (at least) the following characters which have
unexpected meanings: $ + < = > ^ ` | ~
The Perl program will use the expected meanings; codeset=utf8
Locale 'univ.utf8' contains (at least) the following characters which have
unexpected meanings: $ + < = > ^ ` | ~
The Perl program will use the expected meanings; codeset=utf8
Locale 'univ.utf8' contains (at least) the following characters which have
unexpected meanings: $ + < = > ^ ` | ~
The Perl program will use the expected meanings; codeset=utf8
Locale 'univ.utf8' contains (at least) the following characters which have
unexpected meanings: $ + < = > ^ ` | ~
The Perl program will use the expected meanings; codeset=utf8
Locale 'univ.utf8' contains (at least) the following characters which have
unexpected meanings: $ + < = > ^ ` | ~
The Perl program will use the expected meanings; codeset=utf8
Locale 'univ.utf8' contains (at least) the following characters which have
unexpected meanings: $ + < = > ^ ` | ~
The Perl program will use the expected meanings; codeset=utf8
Locale 'univ.utf8' contains (at least) the following characters which have
unexpected meanings: $ + < = > ^ ` | ~
The Perl program will use the expected meanings; codeset=utf8
c++: error: +Z: No such file or directory
c++: error: +O2: No such file or directory
c++: error: +Onolimit: No such file or directory
# Will use Digest::MD5
# Connected to 127.0.0.1
syswrite() isn't allowed on :utf8 handles at t/Socket.t line 47.
# Looks like your test exited with 255 just after 2.
make: *** [test_harness] Error 6

error while running harness target 'test_harness': 2 at /pro/3gl/CPAN/smoke/lib/Test/Smoke.pm line 194.
[2019-03-23 22:06:57MET] 
[2019-03-23 22:06:57MET] ../lib/warnings.t...........................................FAILED
[2019-03-23 22:06:57MET]     366, 771-772
[2019-03-23 22:06:57MET] ../lib/locale.t.............................................FAILED
[2019-03-23 22:06:57MET]     431-432, 498
[2019-03-23 22:06:57MET] ../lib/B/Deparse.t..........................................PASSED
[2019-03-23 22:06:57MET]     2
[2019-03-23 22:06:57MET] ../cpan/Module-Metadata/t/extract-version.t.................PASSED
[2019-03-23 22:06:57MET]     7, 11, 15, 19, 23, 27, 31, 35, 39, 43, 47
[2019-03-23 22:06:57MET]     51, 55, 59, 63, 67, 71, 75, 79, 83, 87
[2019-03-23 22:06:57MET]     91, 95, 99, 106, 110, 114, 118, 122, 126
[2019-03-23 22:06:57MET]     130, 134, 138, 142, 149, 153, 157, 161
[2019-03-23 22:06:57MET]     165, 169, 173, 177, 181, 185, 195, 199
[2019-03-23 22:06:57MET]     203
[2019-03-23 22:06:57MET] ../dist/Net-Ping/t/450_service.t............................PASSED
[2019-03-23 22:06:57MET]     9, 18
[2019-03-23 22:06:57MET] ../cpan/Socket/t/Socket.t...................................FAILED
[2019-03-23 22:06:57MET]     Non-zero exit status: 255
[2019-03-23 22:06:57MET] ../cpan/Socket/t/Socket.t...................................FAILED
[2019-03-23 22:06:57MET]     Bad plan.  You planned 6 tests but ran 2.
[2019-03-23 22:06:57MET] Archived results...
[2019-03-23 22:06:57MET] Unskip tests from '/pro/3gl/CPAN/smoke/p59.skip'
[2019-03-23 22:06:57MET] Finished smoking b877c1ff7374e89bad1d494c2a847af552d40782 v5.29.9-12-gb877c1ff73 blead
[2019-03-23 22:06:57MET] Reading smokeresult from /pro/3gl/CPAN/perl-current/mktest.out
[2019-03-23 22:06:58MET] Processing []
[2019-03-23 22:06:58MET] Processing [-DDEBUGGING]
[2019-03-23 22:06:58MET] Processing [-Duse64bitall]
[2019-03-23 22:06:58MET] Processing [-DDEBUGGING -Duse64bitall]
[2019-03-23 22:06:58MET] Processing [-Duseithreads]
[2019-03-23 22:06:58MET] Processing [-DDEBUGGING -Duseithreads]
[2019-03-23 22:06:58MET] Processing [-Duseithreads -Duse64bitall]
[2019-03-23 22:06:58MET] Processing [-DDEBUGGING -Duseithreads -Duse64bitall]
[2019-03-23 22:06:58MET] Writing report to '/pro/3gl/CPAN/perl-current/mktest.rpt'
[2019-03-23 22:06:59MET] Locally applied patches from '/pro/3gl/CPAN/perl-current/patchlevel.h'
[2019-03-23 22:06:59MET] Patches: 'uncommitted-changes;SMOKEb877c1ff7374e89bad1d494c2a847af552d40782'
[2019-03-23 22:06:59MET] Looking for cc messages: 'hpux'
-- 
Report generated by Test::Smoke::Gateway v0.09_01