Show report
[2018-08-20 10:57:15-0500] ==> Starting synctree
[2018-08-20 10:57:15-0500] qx[/usr/pkg/bin/git clone file:///home/core/smoke/git /home/core/smoke/git-perl 2>&1]
[2018-08-20 10:59:29-0500] qx[/usr/pkg/bin/git remote update --prune 2>&1]
[2018-08-20 10:59:29-0500] qx[/usr/pkg/bin/git checkout smoke-me/khw-core
[2018-08-20 10:59:29-0500]  2>&1]
Already on 'smoke-me/khw-core'
[2018-08-20 10:59:29-0500] qx[/usr/pkg/bin/git reset --hard origin/smoke-me/khw-core
[2018-08-20 10:59:29-0500]  2>&1]
[2018-08-20 10:59:29-0500] qx[/usr/pkg/bin/git clone /home/core/smoke/git-perl /home/core/smoke/perl-current 2>&1]
[2018-08-20 10:59:36-0500] qx[/usr/pkg/bin/git clean -dfx 2>&1]
[2018-08-20 10:59:36-0500] qx[/usr/pkg/bin/git fetch origin 2>&1]
[2018-08-20 10:59:36-0500] qx[/usr/pkg/bin/git checkout smoke-me/khw-core
[2018-08-20 10:59:36-0500]  2>&1]
Already on 'smoke-me/khw-core'
[2018-08-20 10:59:36-0500] qx[/usr/pkg/bin/git reset --hard origin/smoke-me/khw-core
[2018-08-20 10:59:36-0500]  2>&1]
[2018-08-20 10:59:36-0500] qx[/home/core/bin/perl-5.26.1/bin/perl5.26.1 Porting/make_dot_patch.pl > .patch]
[2018-08-20 10:59:36-0500] /home/core/smoke/perl-current is now up to patchlevel f4943dafc2559abbc6254d4e8bceaae9ebf57842
[2018-08-20 10:59:36-0500] ==> Starting runsmoke
[2018-08-20 10:59:36-0500] [./tssmokeperl.pl] chdir(/home/core/smoke/perl-current)
[2018-08-20 10:59:36-0500] qx[/home/core/bin/perl-5.26.1/bin/perl5.26.1 -e "require q[/home/core/smoke/perl-current/cpan/Test-Harness/lib/Test/Harness.pm];print Test::Harness->VERSION" 2>&1]
[2018-08-20 10:59:36-0500] Found: Test::Harness version 3.42.
[2018-08-20 10:59:36-0500] Reading build configurations from /home/core/smoke/TestSmoke/perlcurrent.cfg
[2018-08-20 10:59:36-0500] Reading 'Policy.sh' from default content (v=1)
[2018-08-20 10:59:36-0500] Running smoke tests without $ENV{PERLIO}
[2018-08-20 10:59:36-0500] Running test suite only with 'harness'
[2018-08-20 10:59:36-0500] make distclean ...
[2018-08-20 10:59:36-0500] Smoking patch f4943dafc2559abbc6254d4e8bceaae9ebf57842 v5.29.1-135-gf4943dafc2
[2018-08-20 10:59:36-0500] Smoking branch smoke-me/khw-core
[2018-08-20 10:59:36-0500] Locally applied patches from '/home/core/smoke/perl-current/patchlevel.h'
[2018-08-20 10:59:36-0500] Patches: 'uncommitted-changes'
[2018-08-20 10:59:36-0500] Adding 'SMOKEf4943dafc2559abbc6254d4e8bceaae9ebf57842' to the registered patches.
[2018-08-20 10:59:36-0500] 
[2018-08-20 10:59:36-0500] Configuration: -Dusedevel
[2018-08-20 10:59:36-0500] ------------------------------------------------------------------------------
[2018-08-20 10:59:36-0500] make distclean ...
[2018-08-20 10:59:36-0500] 
[2018-08-20 10:59:36-0500] Copy Policy.sh ...
[2018-08-20 10:59:36-0500] 
[2018-08-20 10:59:36-0500] Configure ...
[2018-08-20 11:00:10-0500] 
[2018-08-20 11:00:10-0500] make ...
op.c: In function 'S_gen_constant_list':
op.c:5658:31: warning: argument 'o' might be clobbered by 'longjmp' or 'vfork'
toke.c: In function 'Perl_scan_num':
toke.c:11102:24: warning: 'b' may be used uninitialized in this function
pp.c: In function 'Perl_pp_argelem':
pp.c:6780:13: warning: value computed is not used
pp_sys.c: In function 'Perl_pp_stat':
pp_sys.c:2997:6: warning: comparison of unsigned expression < 0 is always false
doio.c: In function 'S_argvout_free':
doio.c:1197:21: warning: implicit declaration of function 'unlinkat'
doio.c: In function 'Perl_do_close':
doio.c:1618:21: warning: implicit declaration of function 'linkat'
doio.c:1631:25: warning: implicit declaration of function 'renameat'
doio.c: In function 'Perl_do_msgsnd':
doio.c:3033:25: warning: defining a type in a cast is invalid in C++
doio.c: In function 'Perl_do_msgrcv':
doio.c:3071:26: warning: defining a type in a cast is invalid in C++
In file included from globals.c:32:0:
perl.h:7179:19: warning: non-local variable 'PL_inf' with anonymous type is questionable in C++
perl.h:7215:19: warning: non-local variable 'PL_nan' with anonymous type is questionable in C++
perlio.c: In function 'PerlIOStdio_set_ptrcnt':
perlio.c:3599:2: warning: pointer targets in assignment differ in signedness
/usr/include/sys/cdefs_elf.h:67:20: error: missing binary operator before token "("
/usr/include/sys/cdefs_elf.h:73:20: error: missing binary operator before token "("
op.c: In function 'S_gen_constant_list':
op.c:5658:31: warning: argument 'o' might be clobbered by 'longjmp' or 'vfork'
parts/inc/mess provides vmess, which is still marked todo for 5.6.0
Warning (mostly harmless): No library found for -ldb
parts/inc/mess provides vmess, which is still marked todo for 5.6.0
RealPPPort.xs: In function 'XS_Devel__PPPort_check_HeUTF8':
RealPPPort.xs:1817:17: warning: value computed is not used
Warning (mostly harmless): No library found for -lndbm
Warning (mostly harmless): No library found for -ldbm
Warning (mostly harmless): No library found for -lucb
Warning (mostly harmless): No library found for -lcposix
POSIX.xs:1062:11: warning: 'my_rint' defined but not used
In file included from HiRes.xs:961:0:
const-c.inc: In function 'constant_19':
const-c.inc:351:42: warning: unused parameter 'iv_return'
Making header files for XS...
[2018-08-20 11:03:44-0500] Skip tests from '/home/core/smoke/TestSmoke/smokecurrent.skiptests'
[2018-08-20 11:03:44-0500] 
[2018-08-20 11:03:44-0500]  Tests start here:
[2018-08-20 11:03:44-0500] TSTENV = stdio	
# Failed test 37 - POSIX::strtod() uses underlying locale at ./test.pl line 1063
#      got "1"
# expected "1.5"
# PROG: 
#                     use POSIX;
#                     POSIX::setlocale(POSIX::LC_NUMERIC(),"af_ZA.ISO8859-1");
#                     my $one_point_5 = POSIX::strtod("1,5");
#                     $one_point_5 =~ s/0+$//;  # Remove any trailing zeros
#                     print $one_point_5, "
# ";
# STATUS: 0
Subroutine Math::BigInt::carp redefined at t/option_l.t line 16.
# parser guessed wrong encoding expected 'CP1252' got 'UTF-8'
# Will use Digest::MD5

error while running harness target 'test_harness': 1 at /home/core/smoke/TestSmoke/Test/Smoke/App/RunSmoke.pm line 118.
[2018-08-20 11:26:15-0500] 
[2018-08-20 11:26:15-0500] ../t/run/locale.t...........................................FAILED
[2018-08-20 11:26:15-0500]     37
[2018-08-20 11:26:15-0500] ../lib/locale.t.............................................FAILED
[2018-08-20 11:26:15-0500]     445-446, 450, 453, 467
[2018-08-20 11:26:15-0500] Archived results...
[2018-08-20 11:26:15-0500] Unskip tests from '/home/core/smoke/TestSmoke/smokecurrent.skiptests'
[2018-08-20 11:26:15-0500] 
[2018-08-20 11:26:15-0500] Configuration: -Dusedevel -DDEBUGGING
[2018-08-20 11:26:15-0500] ------------------------------------------------------------------------------
[2018-08-20 11:26:15-0500] make distclean ...
[2018-08-20 11:26:33-0500] 
[2018-08-20 11:26:33-0500] Copy Policy.sh ...
[2018-08-20 11:26:33-0500] 
[2018-08-20 11:26:33-0500] Configure ...
[2018-08-20 11:27:02-0500] 
[2018-08-20 11:27:02-0500] make ...
op.c: In function 'S_gen_constant_list':
op.c:5658:31: warning: argument 'o' might be clobbered by 'longjmp' or 'vfork'
toke.c: In function 'Perl_scan_num':
toke.c:11102:24: warning: 'b' may be used uninitialized in this function
pp.c: In function 'Perl_pp_argelem':
pp.c:6780:13: warning: value computed is not used
pp_sys.c: In function 'Perl_pp_stat':
pp_sys.c:2997:6: warning: comparison of unsigned expression < 0 is always false
doio.c: In function 'S_argvout_free':
doio.c:1197:21: warning: implicit declaration of function 'unlinkat'
doio.c: In function 'Perl_do_close':
doio.c:1618:21: warning: implicit declaration of function 'linkat'
doio.c:1631:25: warning: implicit declaration of function 'renameat'
doio.c: In function 'Perl_do_msgsnd':
doio.c:3033:25: warning: defining a type in a cast is invalid in C++
doio.c: In function 'Perl_do_msgrcv':
doio.c:3071:26: warning: defining a type in a cast is invalid in C++
In file included from globals.c:32:0:
perl.h:7179:19: warning: non-local variable 'PL_inf' with anonymous type is questionable in C++
perl.h:7215:19: warning: non-local variable 'PL_nan' with anonymous type is questionable in C++
perlio.c: In function 'PerlIOStdio_set_ptrcnt':
perlio.c:3599:2: warning: pointer targets in assignment differ in signedness
/usr/include/sys/cdefs_elf.h:67:20: error: missing binary operator before token "("
/usr/include/sys/cdefs_elf.h:73:20: error: missing binary operator before token "("
op.c: In function 'S_gen_constant_list':
op.c:5658:31: warning: argument 'o' might be clobbered by 'longjmp' or 'vfork'
parts/inc/mess provides vmess, which is still marked todo for 5.6.0
Warning (mostly harmless): No library found for -ldb
parts/inc/mess provides vmess, which is still marked todo for 5.6.0
RealPPPort.xs: In function 'XS_Devel__PPPort_check_HeUTF8':
RealPPPort.xs:1817:17: warning: value computed is not used
Warning (mostly harmless): No library found for -lndbm
Warning (mostly harmless): No library found for -ldbm
Warning (mostly harmless): No library found for -lucb
Warning (mostly harmless): No library found for -lcposix
POSIX.xs:1062:11: warning: 'my_rint' defined but not used
In file included from HiRes.xs:961:0:
const-c.inc: In function 'constant_19':
const-c.inc:351:42: warning: unused parameter 'iv_return'
Making header files for XS...
[2018-08-20 11:32:30-0500] Skip tests from '/home/core/smoke/TestSmoke/smokecurrent.skiptests'
[2018-08-20 11:32:30-0500] 
[2018-08-20 11:32:30-0500]  Tests start here:
[2018-08-20 11:32:30-0500] TSTENV = stdio	
# Failed test 37 - POSIX::strtod() uses underlying locale at ./test.pl line 1063
#      got "1"
# expected "1.5"
# PROG: 
#                     use POSIX;
#                     POSIX::setlocale(POSIX::LC_NUMERIC(),"af_ZA.ISO8859-1");
#                     my $one_point_5 = POSIX::strtod("1,5");
#                     $one_point_5 =~ s/0+$//;  # Remove any trailing zeros
#                     print $one_point_5, "
# ";
# STATUS: 0
Subroutine Math::BigInt::carp redefined at t/option_l.t line 16.
# parser guessed wrong encoding expected 'CP1252' got 'UTF-8'
# Will use Digest::MD5

error while running harness target 'test_harness': 1 at /home/core/smoke/TestSmoke/Test/Smoke/App/RunSmoke.pm line 118.
[2018-08-20 12:00:29-0500] 
[2018-08-20 12:00:29-0500] ../t/run/locale.t...........................................FAILED
[2018-08-20 12:00:29-0500]     37
[2018-08-20 12:00:29-0500] ../lib/locale.t.............................................FAILED
[2018-08-20 12:00:29-0500]     445-446, 450, 453, 467
[2018-08-20 12:00:29-0500] Archived results...
[2018-08-20 12:00:29-0500] Unskip tests from '/home/core/smoke/TestSmoke/smokecurrent.skiptests'
[2018-08-20 12:00:29-0500] 
[2018-08-20 12:00:29-0500] Configuration: -Dusedevel -Duse64bitall
[2018-08-20 12:00:29-0500] ------------------------------------------------------------------------------
[2018-08-20 12:00:29-0500] make distclean ...
[2018-08-20 12:00:52-0500] 
[2018-08-20 12:00:52-0500] Copy Policy.sh ...
[2018-08-20 12:00:52-0500] 
[2018-08-20 12:00:52-0500] Configure ...
[2018-08-20 12:01:20-0500] 
[2018-08-20 12:01:20-0500] make ...
op.c: In function 'S_gen_constant_list':
op.c:5658:31: warning: argument 'o' might be clobbered by 'longjmp' or 'vfork'
toke.c: In function 'Perl_scan_num':
toke.c:11102:24: warning: 'b' may be used uninitialized in this function
pp.c: In function 'Perl_pp_argelem':
pp.c:6780:13: warning: value computed is not used
pp_sys.c: In function 'Perl_pp_stat':
pp_sys.c:2997:6: warning: comparison of unsigned expression < 0 is always false
doio.c: In function 'S_argvout_free':
doio.c:1197:21: warning: implicit declaration of function 'unlinkat'
doio.c: In function 'Perl_do_close':
doio.c:1618:21: warning: implicit declaration of function 'linkat'
doio.c:1631:25: warning: implicit declaration of function 'renameat'
doio.c: In function 'Perl_do_msgsnd':
doio.c:3033:25: warning: defining a type in a cast is invalid in C++
doio.c: In function 'Perl_do_msgrcv':
doio.c:3071:26: warning: defining a type in a cast is invalid in C++
In file included from globals.c:32:0:
perl.h:7179:19: warning: non-local variable 'PL_inf' with anonymous type is questionable in C++
perl.h:7215:19: warning: non-local variable 'PL_nan' with anonymous type is questionable in C++
perlio.c: In function 'PerlIOStdio_set_ptrcnt':
perlio.c:3599:2: warning: pointer targets in assignment differ in signedness
/usr/include/sys/cdefs_elf.h:67:20: error: missing binary operator before token "("
/usr/include/sys/cdefs_elf.h:73:20: error: missing binary operator before token "("
op.c: In function 'S_gen_constant_list':
op.c:5658:31: warning: argument 'o' might be clobbered by 'longjmp' or 'vfork'
parts/inc/mess provides vmess, which is still marked todo for 5.6.0
Warning (mostly harmless): No library found for -ldb
parts/inc/mess provides vmess, which is still marked todo for 5.6.0
RealPPPort.xs: In function 'XS_Devel__PPPort_check_HeUTF8':
RealPPPort.xs:1817:17: warning: value computed is not used
Warning (mostly harmless): No library found for -lndbm
Warning (mostly harmless): No library found for -ldbm
Warning (mostly harmless): No library found for -lucb
Warning (mostly harmless): No library found for -lcposix
POSIX.xs:1062:11: warning: 'my_rint' defined but not used
In file included from HiRes.xs:961:0:
const-c.inc: In function 'constant_19':
const-c.inc:351:42: warning: unused parameter 'iv_return'
Making header files for XS...
[2018-08-20 12:04:53-0500] Skip tests from '/home/core/smoke/TestSmoke/smokecurrent.skiptests'
[2018-08-20 12:04:53-0500] 
[2018-08-20 12:04:53-0500]  Tests start here:
[2018-08-20 12:04:53-0500] TSTENV = stdio	
# Failed test 37 - POSIX::strtod() uses underlying locale at ./test.pl line 1063
#      got "1"
# expected "1.5"
# PROG: 
#                     use POSIX;
#                     POSIX::setlocale(POSIX::LC_NUMERIC(),"af_ZA.ISO8859-1");
#                     my $one_point_5 = POSIX::strtod("1,5");
#                     $one_point_5 =~ s/0+$//;  # Remove any trailing zeros
#                     print $one_point_5, "
# ";
# STATUS: 0
Subroutine Math::BigInt::carp redefined at t/option_l.t line 16.
# parser guessed wrong encoding expected 'CP1252' got 'UTF-8'
# Will use Digest::MD5

error while running harness target 'test_harness': 1 at /home/core/smoke/TestSmoke/Test/Smoke/App/RunSmoke.pm line 118.
[2018-08-20 12:27:18-0500] 
[2018-08-20 12:27:18-0500] ../t/run/locale.t...........................................FAILED
[2018-08-20 12:27:18-0500]     37
[2018-08-20 12:27:18-0500] ../lib/locale.t.............................................FAILED
[2018-08-20 12:27:18-0500]     445-446, 450, 453, 467
[2018-08-20 12:27:18-0500] Archived results...
[2018-08-20 12:27:18-0500] Unskip tests from '/home/core/smoke/TestSmoke/smokecurrent.skiptests'
[2018-08-20 12:27:18-0500] 
[2018-08-20 12:27:18-0500] Configuration: -Dusedevel -Duse64bitall -DDEBUGGING
[2018-08-20 12:27:18-0500] ------------------------------------------------------------------------------
[2018-08-20 12:27:18-0500] make distclean ...
[2018-08-20 12:27:36-0500] 
[2018-08-20 12:27:36-0500] Copy Policy.sh ...
[2018-08-20 12:27:36-0500] 
[2018-08-20 12:27:36-0500] Configure ...
[2018-08-20 12:28:04-0500] 
[2018-08-20 12:28:04-0500] make ...
op.c: In function 'S_gen_constant_list':
op.c:5658:31: warning: argument 'o' might be clobbered by 'longjmp' or 'vfork'
toke.c: In function 'Perl_scan_num':
toke.c:11102:24: warning: 'b' may be used uninitialized in this function
pp.c: In function 'Perl_pp_argelem':
pp.c:6780:13: warning: value computed is not used
pp_sys.c: In function 'Perl_pp_stat':
pp_sys.c:2997:6: warning: comparison of unsigned expression < 0 is always false
doio.c: In function 'S_argvout_free':
doio.c:1197:21: warning: implicit declaration of function 'unlinkat'
doio.c: In function 'Perl_do_close':
doio.c:1618:21: warning: implicit declaration of function 'linkat'
doio.c:1631:25: warning: implicit declaration of function 'renameat'
doio.c: In function 'Perl_do_msgsnd':
doio.c:3033:25: warning: defining a type in a cast is invalid in C++
doio.c: In function 'Perl_do_msgrcv':
doio.c:3071:26: warning: defining a type in a cast is invalid in C++
In file included from globals.c:32:0:
perl.h:7179:19: warning: non-local variable 'PL_inf' with anonymous type is questionable in C++
perl.h:7215:19: warning: non-local variable 'PL_nan' with anonymous type is questionable in C++
perlio.c: In function 'PerlIOStdio_set_ptrcnt':
perlio.c:3599:2: warning: pointer targets in assignment differ in signedness
/usr/include/sys/cdefs_elf.h:67:20: error: missing binary operator before token "("
/usr/include/sys/cdefs_elf.h:73:20: error: missing binary operator before token "("
op.c: In function 'S_gen_constant_list':
op.c:5658:31: warning: argument 'o' might be clobbered by 'longjmp' or 'vfork'
parts/inc/mess provides vmess, which is still marked todo for 5.6.0
Warning (mostly harmless): No library found for -ldb
parts/inc/mess provides vmess, which is still marked todo for 5.6.0
RealPPPort.xs: In function 'XS_Devel__PPPort_check_HeUTF8':
RealPPPort.xs:1817:17: warning: value computed is not used
Warning (mostly harmless): No library found for -lndbm
Warning (mostly harmless): No library found for -ldbm
Warning (mostly harmless): No library found for -lucb
Warning (mostly harmless): No library found for -lcposix
POSIX.xs:1062:11: warning: 'my_rint' defined but not used
In file included from HiRes.xs:961:0:
const-c.inc: In function 'constant_19':
const-c.inc:351:42: warning: unused parameter 'iv_return'
Making header files for XS...
[2018-08-20 12:33:35-0500] Skip tests from '/home/core/smoke/TestSmoke/smokecurrent.skiptests'
[2018-08-20 12:33:35-0500] 
[2018-08-20 12:33:35-0500]  Tests start here:
[2018-08-20 12:33:35-0500] TSTENV = stdio	
# Failed test 37 - POSIX::strtod() uses underlying locale at ./test.pl line 1063
#      got "1"
# expected "1.5"
# PROG: 
#                     use POSIX;
#                     POSIX::setlocale(POSIX::LC_NUMERIC(),"af_ZA.ISO8859-1");
#                     my $one_point_5 = POSIX::strtod("1,5");
#                     $one_point_5 =~ s/0+$//;  # Remove any trailing zeros
#                     print $one_point_5, "
# ";
# STATUS: 0
Subroutine Math::BigInt::carp redefined at t/option_l.t line 16.
# parser guessed wrong encoding expected 'CP1252' got 'UTF-8'
# Will use Digest::MD5

error while running harness target 'test_harness': 1 at /home/core/smoke/TestSmoke/Test/Smoke/App/RunSmoke.pm line 118.
[2018-08-20 13:01:26-0500] 
[2018-08-20 13:01:26-0500] ../t/run/locale.t...........................................FAILED
[2018-08-20 13:01:26-0500]     37
[2018-08-20 13:01:26-0500] ../lib/locale.t.............................................FAILED
[2018-08-20 13:01:26-0500]     445-446, 450, 453, 467
[2018-08-20 13:01:26-0500] Archived results...
[2018-08-20 13:01:26-0500] Unskip tests from '/home/core/smoke/TestSmoke/smokecurrent.skiptests'
[2018-08-20 13:01:26-0500] 
[2018-08-20 13:01:26-0500] Configuration: -Dusedevel -Duseithreads
[2018-08-20 13:01:26-0500] ------------------------------------------------------------------------------
[2018-08-20 13:01:26-0500] make distclean ...
[2018-08-20 13:01:50-0500] 
[2018-08-20 13:01:50-0500] Copy Policy.sh ...
[2018-08-20 13:01:50-0500] 
[2018-08-20 13:01:50-0500] Configure ...
[2018-08-20 13:02:22-0500] 
[2018-08-20 13:02:22-0500] make ...
op.c: In function 'S_gen_constant_list':
op.c:5658:31: warning: argument 'o' might be clobbered by 'longjmp' or 'vfork'
toke.c: In function 'Perl_scan_num':
toke.c:11102:24: warning: 'b' may be used uninitialized in this function
pp.c: In function 'Perl_pp_argelem':
pp.c:6780:13: warning: value computed is not used
pp_sys.c: In function 'Perl_pp_stat':
pp_sys.c:2997:6: warning: comparison of unsigned expression < 0 is always false
doio.c: In function 'S_argvout_free':
doio.c:1197:21: warning: implicit declaration of function 'unlinkat'
doio.c: In function 'Perl_do_close':
doio.c:1618:21: warning: implicit declaration of function 'linkat'
doio.c:1631:25: warning: implicit declaration of function 'renameat'
doio.c: In function 'Perl_do_msgsnd':
doio.c:3033:25: warning: defining a type in a cast is invalid in C++
doio.c: In function 'Perl_do_msgrcv':
doio.c:3071:26: warning: defining a type in a cast is invalid in C++
In file included from globals.c:32:0:
perl.h:7179:19: warning: non-local variable 'PL_inf' with anonymous type is questionable in C++
perl.h:7215:19: warning: non-local variable 'PL_nan' with anonymous type is questionable in C++
perlio.c: In function 'PerlIOStdio_set_ptrcnt':
perlio.c:3599:2: warning: pointer targets in assignment differ in signedness
/usr/include/sys/cdefs_elf.h:67:20: error: missing binary operator before token "("
/usr/include/sys/cdefs_elf.h:73:20: error: missing binary operator before token "("
op.c: In function 'S_gen_constant_list':
op.c:5658:31: warning: argument 'o' might be clobbered by 'longjmp' or 'vfork'
parts/inc/mess provides vmess, which is still marked todo for 5.6.0
Warning (mostly harmless): No library found for -ldb
parts/inc/mess provides vmess, which is still marked todo for 5.6.0
RealPPPort.xs: In function 'XS_Devel__PPPort_check_HeUTF8':
RealPPPort.xs:1817:17: warning: value computed is not used
Warning (mostly harmless): No library found for -lndbm
Warning (mostly harmless): No library found for -ldbm
Warning (mostly harmless): No library found for -lucb
Warning (mostly harmless): No library found for -lcposix
POSIX.xs:1062:11: warning: 'my_rint' defined but not used
In file included from HiRes.xs:961:0:
const-c.inc: In function 'constant_19':
const-c.inc:351:42: warning: unused parameter 'iv_return'
Making header files for XS...
shared.xs: In function 'sharedsv_array_mg_CLEAR':
shared.xs:1103:17: warning: 'iter' may be used uninitialized in this function
[2018-08-20 13:06:10-0500] Skip tests from '/home/core/smoke/TestSmoke/smokecurrent.skiptests'
[2018-08-20 13:06:10-0500] 
[2018-08-20 13:06:10-0500]  Tests start here:
[2018-08-20 13:06:10-0500] TSTENV = stdio	
# Failed test 37 - POSIX::strtod() uses underlying locale at ./test.pl line 1063
#      got "1"
# expected "1.5"
# PROG: 
#                     use POSIX;
#                     POSIX::setlocale(POSIX::LC_NUMERIC(),"af_ZA.ISO8859-1");
#                     my $one_point_5 = POSIX::strtod("1,5");
#                     $one_point_5 =~ s/0+$//;  # Remove any trailing zeros
#                     print $one_point_5, "
# ";
# STATUS: 0
Subroutine Math::BigInt::carp redefined at t/option_l.t line 16.
# parser guessed wrong encoding expected 'CP1252' got 'UTF-8'
# Will use Digest::MD5

error while running harness target 'test_harness': 1 at /home/core/smoke/TestSmoke/Test/Smoke/App/RunSmoke.pm line 118.
[2018-08-20 13:32:15-0500] 
[2018-08-20 13:32:15-0500] ../t/run/locale.t...........................................FAILED
[2018-08-20 13:32:15-0500]     37
[2018-08-20 13:32:15-0500] ../lib/locale.t.............................................FAILED
[2018-08-20 13:32:15-0500]     445-446, 450, 453, 467
[2018-08-20 13:32:15-0500] Archived results...
[2018-08-20 13:32:15-0500] Unskip tests from '/home/core/smoke/TestSmoke/smokecurrent.skiptests'
[2018-08-20 13:32:15-0500] 
[2018-08-20 13:32:15-0500] Configuration: -Dusedevel -Duseithreads -DDEBUGGING
[2018-08-20 13:32:15-0500] ------------------------------------------------------------------------------
[2018-08-20 13:32:15-0500] make distclean ...
[2018-08-20 13:32:36-0500] 
[2018-08-20 13:32:36-0500] Copy Policy.sh ...
[2018-08-20 13:32:36-0500] 
[2018-08-20 13:32:36-0500] Configure ...
[2018-08-20 13:33:06-0500] 
[2018-08-20 13:33:06-0500] make ...
op.c: In function 'S_gen_constant_list':
op.c:5658:31: warning: argument 'o' might be clobbered by 'longjmp' or 'vfork'
toke.c: In function 'Perl_scan_num':
toke.c:11102:24: warning: 'b' may be used uninitialized in this function
pp.c: In function 'Perl_pp_argelem':
pp.c:6780:13: warning: value computed is not used
pp_sys.c: In function 'Perl_pp_stat':
pp_sys.c:2997:6: warning: comparison of unsigned expression < 0 is always false
doio.c: In function 'S_argvout_free':
doio.c:1197:21: warning: implicit declaration of function 'unlinkat'
doio.c: In function 'Perl_do_close':
doio.c:1618:21: warning: implicit declaration of function 'linkat'
doio.c:1631:25: warning: implicit declaration of function 'renameat'
doio.c: In function 'Perl_do_msgsnd':
doio.c:3033:25: warning: defining a type in a cast is invalid in C++
doio.c: In function 'Perl_do_msgrcv':
doio.c:3071:26: warning: defining a type in a cast is invalid in C++
In file included from globals.c:32:0:
perl.h:7179:19: warning: non-local variable 'PL_inf' with anonymous type is questionable in C++
perl.h:7215:19: warning: non-local variable 'PL_nan' with anonymous type is questionable in C++
perlio.c: In function 'PerlIOStdio_set_ptrcnt':
perlio.c:3599:2: warning: pointer targets in assignment differ in signedness
/usr/include/sys/cdefs_elf.h:67:20: error: missing binary operator before token "("
/usr/include/sys/cdefs_elf.h:73:20: error: missing binary operator before token "("
op.c: In function 'S_gen_constant_list':
op.c:5658:31: warning: argument 'o' might be clobbered by 'longjmp' or 'vfork'
parts/inc/mess provides vmess, which is still marked todo for 5.6.0
Warning (mostly harmless): No library found for -ldb
parts/inc/mess provides vmess, which is still marked todo for 5.6.0
RealPPPort.xs: In function 'XS_Devel__PPPort_check_HeUTF8':
RealPPPort.xs:1817:17: warning: value computed is not used
Warning (mostly harmless): No library found for -lndbm
Warning (mostly harmless): No library found for -ldbm
Warning (mostly harmless): No library found for -lucb
Warning (mostly harmless): No library found for -lcposix
POSIX.xs:1062:11: warning: 'my_rint' defined but not used
In file included from HiRes.xs:961:0:
const-c.inc: In function 'constant_19':
const-c.inc:351:42: warning: unused parameter 'iv_return'
Making header files for XS...
shared.xs: In function 'sharedsv_array_mg_CLEAR':
shared.xs:1103:17: warning: 'iter' may be used uninitialized in this function
[2018-08-20 13:39:08-0500] Skip tests from '/home/core/smoke/TestSmoke/smokecurrent.skiptests'
[2018-08-20 13:39:08-0500] 
[2018-08-20 13:39:08-0500]  Tests start here:
[2018-08-20 13:39:08-0500] TSTENV = stdio	
# Failed test 37 - POSIX::strtod() uses underlying locale at ./test.pl line 1063
#      got "1"
# expected "1.5"
# PROG: 
#                     use POSIX;
#                     POSIX::setlocale(POSIX::LC_NUMERIC(),"af_ZA.ISO8859-1");
#                     my $one_point_5 = POSIX::strtod("1,5");
#                     $one_point_5 =~ s/0+$//;  # Remove any trailing zeros
#                     print $one_point_5, "
# ";
# STATUS: 0
Subroutine Math::BigInt::carp redefined at t/option_l.t line 16.
# parser guessed wrong encoding expected 'CP1252' got 'UTF-8'
# Will use Digest::MD5

error while running harness target 'test_harness': 1 at /home/core/smoke/TestSmoke/Test/Smoke/App/RunSmoke.pm line 118.
[2018-08-20 14:12:08-0500] 
[2018-08-20 14:12:08-0500] ../t/run/locale.t...........................................FAILED
[2018-08-20 14:12:08-0500]     37
[2018-08-20 14:12:08-0500] ../lib/locale.t.............................................FAILED
[2018-08-20 14:12:08-0500]     445-446, 450, 453, 467
[2018-08-20 14:12:08-0500] Archived results...
[2018-08-20 14:12:08-0500] Unskip tests from '/home/core/smoke/TestSmoke/smokecurrent.skiptests'
[2018-08-20 14:12:08-0500] 
[2018-08-20 14:12:08-0500] Configuration: -Dusedevel -Duseithreads -Duse64bitall
[2018-08-20 14:12:08-0500] ------------------------------------------------------------------------------
[2018-08-20 14:12:08-0500] make distclean ...
[2018-08-20 14:12:34-0500] 
[2018-08-20 14:12:34-0500] Copy Policy.sh ...
[2018-08-20 14:12:34-0500] 
[2018-08-20 14:12:34-0500] Configure ...
[2018-08-20 14:13:05-0500] 
[2018-08-20 14:13:05-0500] make ...
op.c: In function 'S_gen_constant_list':
op.c:5658:31: warning: argument 'o' might be clobbered by 'longjmp' or 'vfork'
toke.c: In function 'Perl_scan_num':
toke.c:11102:24: warning: 'b' may be used uninitialized in this function
pp.c: In function 'Perl_pp_argelem':
pp.c:6780:13: warning: value computed is not used
pp_sys.c: In function 'Perl_pp_stat':
pp_sys.c:2997:6: warning: comparison of unsigned expression < 0 is always false
doio.c: In function 'S_argvout_free':
doio.c:1197:21: warning: implicit declaration of function 'unlinkat'
doio.c: In function 'Perl_do_close':
doio.c:1618:21: warning: implicit declaration of function 'linkat'
doio.c:1631:25: warning: implicit declaration of function 'renameat'
doio.c: In function 'Perl_do_msgsnd':
doio.c:3033:25: warning: defining a type in a cast is invalid in C++
doio.c: In function 'Perl_do_msgrcv':
doio.c:3071:26: warning: defining a type in a cast is invalid in C++
In file included from globals.c:32:0:
perl.h:7179:19: warning: non-local variable 'PL_inf' with anonymous type is questionable in C++
perl.h:7215:19: warning: non-local variable 'PL_nan' with anonymous type is questionable in C++
perlio.c: In function 'PerlIOStdio_set_ptrcnt':
perlio.c:3599:2: warning: pointer targets in assignment differ in signedness
/usr/include/sys/cdefs_elf.h:67:20: error: missing binary operator before token "("
/usr/include/sys/cdefs_elf.h:73:20: error: missing binary operator before token "("
op.c: In function 'S_gen_constant_list':
op.c:5658:31: warning: argument 'o' might be clobbered by 'longjmp' or 'vfork'
parts/inc/mess provides vmess, which is still marked todo for 5.6.0
Warning (mostly harmless): No library found for -ldb
parts/inc/mess provides vmess, which is still marked todo for 5.6.0
RealPPPort.xs: In function 'XS_Devel__PPPort_check_HeUTF8':
RealPPPort.xs:1817:17: warning: value computed is not used
Warning (mostly harmless): No library found for -lndbm
Warning (mostly harmless): No library found for -ldbm
Warning (mostly harmless): No library found for -lucb
Warning (mostly harmless): No library found for -lcposix
POSIX.xs:1062:11: warning: 'my_rint' defined but not used
In file included from HiRes.xs:961:0:
const-c.inc: In function 'constant_19':
const-c.inc:351:42: warning: unused parameter 'iv_return'
Making header files for XS...
shared.xs: In function 'sharedsv_array_mg_CLEAR':
shared.xs:1103:17: warning: 'iter' may be used uninitialized in this function
[2018-08-20 14:16:52-0500] Skip tests from '/home/core/smoke/TestSmoke/smokecurrent.skiptests'
[2018-08-20 14:16:52-0500] 
[2018-08-20 14:16:52-0500]  Tests start here:
[2018-08-20 14:16:52-0500] TSTENV = stdio	
# Failed test 37 - POSIX::strtod() uses underlying locale at ./test.pl line 1063
#      got "1"
# expected "1.5"
# PROG: 
#                     use POSIX;
#                     POSIX::setlocale(POSIX::LC_NUMERIC(),"af_ZA.ISO8859-1");
#                     my $one_point_5 = POSIX::strtod("1,5");
#                     $one_point_5 =~ s/0+$//;  # Remove any trailing zeros
#                     print $one_point_5, "
# ";
# STATUS: 0
Subroutine Math::BigInt::carp redefined at t/option_l.t line 16.
# parser guessed wrong encoding expected 'CP1252' got 'UTF-8'
# Will use Digest::MD5

error while running harness target 'test_harness': 1 at /home/core/smoke/TestSmoke/Test/Smoke/App/RunSmoke.pm line 118.
[2018-08-20 14:42:50-0500] 
[2018-08-20 14:42:50-0500] ../t/run/locale.t...........................................FAILED
[2018-08-20 14:42:50-0500]     37
[2018-08-20 14:42:50-0500] ../lib/locale.t.............................................FAILED
[2018-08-20 14:42:50-0500]     445-446, 450, 453, 467
[2018-08-20 14:42:50-0500] Archived results...
[2018-08-20 14:42:50-0500] Unskip tests from '/home/core/smoke/TestSmoke/smokecurrent.skiptests'
[2018-08-20 14:42:50-0500] 
[2018-08-20 14:42:50-0500] Configuration: -Dusedevel -Duseithreads -Duse64bitall -DDEBUGGING
[2018-08-20 14:42:50-0500] ------------------------------------------------------------------------------
[2018-08-20 14:42:50-0500] make distclean ...
[2018-08-20 14:43:10-0500] 
[2018-08-20 14:43:10-0500] Copy Policy.sh ...
[2018-08-20 14:43:10-0500] 
[2018-08-20 14:43:10-0500] Configure ...
[2018-08-20 14:43:41-0500] 
[2018-08-20 14:43:41-0500] make ...
op.c: In function 'S_gen_constant_list':
op.c:5658:31: warning: argument 'o' might be clobbered by 'longjmp' or 'vfork'
toke.c: In function 'Perl_scan_num':
toke.c:11102:24: warning: 'b' may be used uninitialized in this function
pp.c: In function 'Perl_pp_argelem':
pp.c:6780:13: warning: value computed is not used
pp_sys.c: In function 'Perl_pp_stat':
pp_sys.c:2997:6: warning: comparison of unsigned expression < 0 is always false
doio.c: In function 'S_argvout_free':
doio.c:1197:21: warning: implicit declaration of function 'unlinkat'
doio.c: In function 'Perl_do_close':
doio.c:1618:21: warning: implicit declaration of function 'linkat'
doio.c:1631:25: warning: implicit declaration of function 'renameat'
doio.c: In function 'Perl_do_msgsnd':
doio.c:3033:25: warning: defining a type in a cast is invalid in C++
doio.c: In function 'Perl_do_msgrcv':
doio.c:3071:26: warning: defining a type in a cast is invalid in C++
In file included from globals.c:32:0:
perl.h:7179:19: warning: non-local variable 'PL_inf' with anonymous type is questionable in C++
perl.h:7215:19: warning: non-local variable 'PL_nan' with anonymous type is questionable in C++
perlio.c: In function 'PerlIOStdio_set_ptrcnt':
perlio.c:3599:2: warning: pointer targets in assignment differ in signedness
/usr/include/sys/cdefs_elf.h:67:20: error: missing binary operator before token "("
/usr/include/sys/cdefs_elf.h:73:20: error: missing binary operator before token "("
op.c: In function 'S_gen_constant_list':
op.c:5658:31: warning: argument 'o' might be clobbered by 'longjmp' or 'vfork'
parts/inc/mess provides vmess, which is still marked todo for 5.6.0
Warning (mostly harmless): No library found for -ldb
parts/inc/mess provides vmess, which is still marked todo for 5.6.0
RealPPPort.xs: In function 'XS_Devel__PPPort_check_HeUTF8':
RealPPPort.xs:1817:17: warning: value computed is not used
Warning (mostly harmless): No library found for -lndbm
Warning (mostly harmless): No library found for -ldbm
Warning (mostly harmless): No library found for -lucb
Warning (mostly harmless): No library found for -lcposix
POSIX.xs:1062:11: warning: 'my_rint' defined but not used
In file included from HiRes.xs:961:0:
const-c.inc: In function 'constant_19':
const-c.inc:351:42: warning: unused parameter 'iv_return'
Making header files for XS...
shared.xs: In function 'sharedsv_array_mg_CLEAR':
shared.xs:1103:17: warning: 'iter' may be used uninitialized in this function
[2018-08-20 14:49:39-0500] Skip tests from '/home/core/smoke/TestSmoke/smokecurrent.skiptests'
[2018-08-20 14:49:39-0500] 
[2018-08-20 14:49:39-0500]  Tests start here:
[2018-08-20 14:49:39-0500] TSTENV = stdio	
# Failed test 37 - POSIX::strtod() uses underlying locale at ./test.pl line 1063
#      got "1"
# expected "1.5"
# PROG: 
#                     use POSIX;
#                     POSIX::setlocale(POSIX::LC_NUMERIC(),"af_ZA.ISO8859-1");
#                     my $one_point_5 = POSIX::strtod("1,5");
#                     $one_point_5 =~ s/0+$//;  # Remove any trailing zeros
#                     print $one_point_5, "
# ";
# STATUS: 0
Subroutine Math::BigInt::carp redefined at t/option_l.t line 16.
# parser guessed wrong encoding expected 'CP1252' got 'UTF-8'
# Will use Digest::MD5

error while running harness target 'test_harness': 1 at /home/core/smoke/TestSmoke/Test/Smoke/App/RunSmoke.pm line 118.
[2018-08-20 15:22:47-0500] 
[2018-08-20 15:22:47-0500] ../t/run/locale.t...........................................FAILED
[2018-08-20 15:22:47-0500]     37
[2018-08-20 15:22:47-0500] ../lib/locale.t.............................................FAILED
[2018-08-20 15:22:47-0500]     445-446, 450, 453, 467
[2018-08-20 15:22:47-0500] Archived results...
[2018-08-20 15:22:47-0500] Unskip tests from '/home/core/smoke/TestSmoke/smokecurrent.skiptests'
[2018-08-20 15:22:47-0500] Finished smoking f4943dafc2559abbc6254d4e8bceaae9ebf57842 v5.29.1-135-gf4943dafc2 smoke-me/khw-core
[2018-08-20 15:22:47-0500] Reading smokeresult from /home/core/smoke/perl-current/mktest.out
[2018-08-20 15:22:47-0500] Processing []
[2018-08-20 15:22:47-0500] Processing [-DDEBUGGING]
[2018-08-20 15:22:47-0500] Processing [-Duse64bitall]
[2018-08-20 15:22:47-0500] Processing [-DDEBUGGING -Duse64bitall]
[2018-08-20 15:22:47-0500] Processing [-Duseithreads]
[2018-08-20 15:22:47-0500] Processing [-DDEBUGGING -Duseithreads]
[2018-08-20 15:22:47-0500] Processing [-Duseithreads -Duse64bitall]
[2018-08-20 15:22:47-0500] Processing [-DDEBUGGING -Duseithreads -Duse64bitall]
[2018-08-20 15:22:47-0500] ==> Starting reporter
[2018-08-20 15:22:47-0500] Writing report to '/home/core/smoke/perl-current/mktest.rpt'
-- 
Report generated by Test::Smoke::Gateway v0.09_01