Show report
[2018-07-23 05:33:02-0500] ==> Starting synctree
[2018-07-23 05:33:02-0500] qx[/usr/bin/git clone file:///home/core/smoke/git /home/core/smoke/git-perl 2>&1]
[2018-07-23 05:34:29-0500] qx[/usr/bin/git remote update --prune 2>&1]
[2018-07-23 05:34:29-0500] qx[/usr/bin/git checkout blead
[2018-07-23 05:34:29-0500]  2>&1]
Already on 'blead'
[2018-07-23 05:34:30-0500] qx[/usr/bin/git reset --hard origin/blead
[2018-07-23 05:34:30-0500]  2>&1]
[2018-07-23 05:34:30-0500] qx[/usr/bin/git clone /home/core/smoke/git-perl /home/core/smoke/perl-current 2>&1]
[2018-07-23 05:34:32-0500] qx[/usr/bin/git clean -dfx 2>&1]
[2018-07-23 05:34:32-0500] qx[/usr/bin/git fetch origin 2>&1]
[2018-07-23 05:34:32-0500] qx[/usr/bin/git checkout blead
[2018-07-23 05:34:32-0500]  2>&1]
Already on 'blead'
[2018-07-23 05:34:32-0500] qx[/usr/bin/git reset --hard origin/blead
[2018-07-23 05:34:32-0500]  2>&1]
[2018-07-23 05:34:32-0500] qx[/home/core/bin/perl-5.26.1/bin/perl5.26.1 Porting/make_dot_patch.pl > .patch]
[2018-07-23 05:34:32-0500] /home/core/smoke/perl-current is now up to patchlevel 3d50648cc4f452d51a0564164a214e51dd6aad95
[2018-07-23 05:34:32-0500] ==> Starting runsmoke
[2018-07-23 05:34:32-0500] [./tssmokeperl.pl] chdir(/home/core/smoke/perl-current)
[2018-07-23 05:34:32-0500] qx[/home/core/bin/perl-5.26.1/bin/perl5.26.1 -e "require q[/home/core/smoke/perl-current/cpan/Test-Harness/lib/Test/Harness.pm];print Test::Harness->VERSION" 2>&1]
[2018-07-23 05:34:32-0500] Found: Test::Harness version 3.42.
[2018-07-23 05:34:32-0500] Reading build configurations from /home/core/smoke/TestSmoke/perlcurrent.cfg
[2018-07-23 05:34:32-0500] Reading 'Policy.sh' from default content (v=1)
[2018-07-23 05:34:32-0500] Running smoke tests without $ENV{PERLIO}
[2018-07-23 05:34:32-0500] Running test suite only with 'harness'
[2018-07-23 05:34:32-0500] make distclean ...
[2018-07-23 05:34:32-0500] Smoking patch 3d50648cc4f452d51a0564164a214e51dd6aad95 v5.29.1-29-g3d50648
[2018-07-23 05:34:32-0500] Smoking branch blead
[2018-07-23 05:34:33-0500] Locally applied patches from '/home/core/smoke/perl-current/patchlevel.h'
[2018-07-23 05:34:33-0500] Patches: 'uncommitted-changes'
[2018-07-23 05:34:33-0500] Adding 'SMOKE3d50648cc4f452d51a0564164a214e51dd6aad95' to the registered patches.
[2018-07-23 05:34:33-0500] 
[2018-07-23 05:34:33-0500] Configuration: -Dusedevel
[2018-07-23 05:34:33-0500] ------------------------------------------------------------------------------
[2018-07-23 05:34:33-0500] make distclean ...
[2018-07-23 05:34:33-0500] 
[2018-07-23 05:34:33-0500] Copy Policy.sh ...
[2018-07-23 05:34:33-0500] 
[2018-07-23 05:34:33-0500] Configure ...
[2018-07-23 05:35:35-0500] 
[2018-07-23 05:35:35-0500] make ...
parts/inc/mess provides vmess, which is still marked todo for 5.6.0
parts/inc/mess provides vmess, which is still marked todo for 5.6.0
Warning (mostly harmless): No library found for -lposix
Warning (mostly harmless): No library found for -lcposix
Making header files for XS...
[2018-07-23 05:39:44-0500] Skip tests from '/home/core/smoke/TestSmoke/smokecurrent.skiptests'
[2018-07-23 05:39:44-0500] 
[2018-07-23 05:39:44-0500]  Tests start here:
[2018-07-23 05:39:44-0500] TSTENV = stdio	
Subroutine Math::BigInt::carp redefined at t/option_l.t line 16.
# parser guessed wrong encoding expected 'CP1252' got 'UTF-8'
# Will use Digest::MD5
[2018-07-23 05:58:15-0500] 
[2018-07-23 05:58:15-0500] All tests successful.
[2018-07-23 05:58:15-0500] Archived results...
[2018-07-23 05:58:15-0500] Unskip tests from '/home/core/smoke/TestSmoke/smokecurrent.skiptests'
[2018-07-23 05:58:15-0500] 
[2018-07-23 05:58:15-0500] Configuration: -Dusedevel -DDEBUGGING
[2018-07-23 05:58:15-0500] ------------------------------------------------------------------------------
[2018-07-23 05:58:15-0500] make distclean ...
[2018-07-23 05:58:31-0500] 
[2018-07-23 05:58:31-0500] Copy Policy.sh ...
[2018-07-23 05:58:31-0500] 
[2018-07-23 05:58:31-0500] Configure ...
[2018-07-23 05:59:26-0500] 
[2018-07-23 05:59:26-0500] make ...
parts/inc/mess provides vmess, which is still marked todo for 5.6.0
parts/inc/mess provides vmess, which is still marked todo for 5.6.0
Warning (mostly harmless): No library found for -lposix
Warning (mostly harmless): No library found for -lcposix
Making header files for XS...
[2018-07-23 06:05:31-0500] Skip tests from '/home/core/smoke/TestSmoke/smokecurrent.skiptests'
[2018-07-23 06:05:31-0500] 
[2018-07-23 06:05:31-0500]  Tests start here:
[2018-07-23 06:05:31-0500] TSTENV = stdio	
Subroutine Math::BigInt::carp redefined at t/option_l.t line 16.
# parser guessed wrong encoding expected 'CP1252' got 'UTF-8'
# Will use Digest::MD5
[2018-07-23 06:26:36-0500] 
[2018-07-23 06:26:36-0500] All tests successful.
[2018-07-23 06:26:36-0500] Archived results...
[2018-07-23 06:26:36-0500] Unskip tests from '/home/core/smoke/TestSmoke/smokecurrent.skiptests'
[2018-07-23 06:26:36-0500] 
[2018-07-23 06:26:36-0500] Configuration: -Dusedevel -Dusequadmath
[2018-07-23 06:26:36-0500] ------------------------------------------------------------------------------
[2018-07-23 06:26:36-0500] make distclean ...
[2018-07-23 06:26:55-0500] 
[2018-07-23 06:26:55-0500] Copy Policy.sh ...
[2018-07-23 06:26:55-0500] 
[2018-07-23 06:26:55-0500] Configure ...
[2018-07-23 06:27:50-0500] 
[2018-07-23 06:27:50-0500] make ...
parts/inc/mess provides vmess, which is still marked todo for 5.6.0
parts/inc/mess provides vmess, which is still marked todo for 5.6.0
Warning (mostly harmless): No library found for -lposix
Warning (mostly harmless): No library found for -lcposix
Making header files for XS...
[2018-07-23 06:32:08-0500] Skip tests from '/home/core/smoke/TestSmoke/smokecurrent.skiptests'
[2018-07-23 06:32:08-0500] 
[2018-07-23 06:32:08-0500]  Tests start here:
[2018-07-23 06:32:08-0500] TSTENV = stdio	
Subroutine Math::BigInt::carp redefined at t/option_l.t line 16.
# parser guessed wrong encoding expected 'CP1252' got 'UTF-8'
# Will use Digest::MD5

#   Failed test 'mtime preserved by copy() while testing cross-partition'
#   at ../lib/File/Copy.t line 128.
#          got: '1000000000.123449998'
#     expected: '1000000000.123449999'
# Looks like you failed 1 test of 466.
make: *** [test_harness] Error 1

error while running harness target 'test_harness': 2 at /home/core/smoke/TestSmoke/Test/Smoke/App/RunSmoke.pm line 118.
[2018-07-23 06:51:08-0500] 
[2018-07-23 06:51:08-0500] ../lib/File/Copy.t..........................................FAILED
[2018-07-23 06:51:08-0500]     53
[2018-07-23 06:51:08-0500] ../lib/File/Copy.t..........................................FAILED
[2018-07-23 06:51:08-0500]     Non-zero exit status: 1
[2018-07-23 06:51:08-0500] Archived results...
[2018-07-23 06:51:08-0500] Unskip tests from '/home/core/smoke/TestSmoke/smokecurrent.skiptests'
[2018-07-23 06:51:08-0500] 
[2018-07-23 06:51:08-0500] Configuration: -Dusedevel -Dusequadmath -DDEBUGGING
[2018-07-23 06:51:08-0500] ------------------------------------------------------------------------------
[2018-07-23 06:51:08-0500] make distclean ...
[2018-07-23 06:51:25-0500] 
[2018-07-23 06:51:25-0500] Copy Policy.sh ...
[2018-07-23 06:51:25-0500] 
[2018-07-23 06:51:25-0500] Configure ...
[2018-07-23 06:52:21-0500] 
[2018-07-23 06:52:21-0500] make ...
parts/inc/mess provides vmess, which is still marked todo for 5.6.0
parts/inc/mess provides vmess, which is still marked todo for 5.6.0
Warning (mostly harmless): No library found for -lposix
Warning (mostly harmless): No library found for -lcposix
Making header files for XS...
[2018-07-23 06:58:26-0500] Skip tests from '/home/core/smoke/TestSmoke/smokecurrent.skiptests'
[2018-07-23 06:58:26-0500] 
[2018-07-23 06:58:26-0500]  Tests start here:
[2018-07-23 06:58:26-0500] TSTENV = stdio	
Subroutine Math::BigInt::carp redefined at t/option_l.t line 16.
# parser guessed wrong encoding expected 'CP1252' got 'UTF-8'
# Will use Digest::MD5

#   Failed test 'mtime preserved by copy() while testing cross-partition'
#   at ../lib/File/Copy.t line 128.
#          got: '1000000000.123449998'
#     expected: '1000000000.123449999'
# Looks like you failed 1 test of 466.
make: *** [test_harness] Error 1

error while running harness target 'test_harness': 2 at /home/core/smoke/TestSmoke/Test/Smoke/App/RunSmoke.pm line 118.
[2018-07-23 07:19:54-0500] 
[2018-07-23 07:19:54-0500] ../lib/File/Copy.t..........................................FAILED
[2018-07-23 07:19:54-0500]     53
[2018-07-23 07:19:54-0500] ../lib/File/Copy.t..........................................FAILED
[2018-07-23 07:19:54-0500]     Non-zero exit status: 1
[2018-07-23 07:19:54-0500] Archived results...
[2018-07-23 07:19:54-0500] Unskip tests from '/home/core/smoke/TestSmoke/smokecurrent.skiptests'
[2018-07-23 07:19:54-0500] 
[2018-07-23 07:19:54-0500] Configuration: -Dusedevel -Duse64bitall
[2018-07-23 07:19:54-0500] ------------------------------------------------------------------------------
[2018-07-23 07:19:54-0500] make distclean ...
[2018-07-23 07:20:13-0500] 
[2018-07-23 07:20:13-0500] Copy Policy.sh ...
[2018-07-23 07:20:13-0500] 
[2018-07-23 07:20:13-0500] Configure ...
[2018-07-23 07:21:08-0500] 
[2018-07-23 07:21:08-0500] make ...
parts/inc/mess provides vmess, which is still marked todo for 5.6.0
parts/inc/mess provides vmess, which is still marked todo for 5.6.0
Warning (mostly harmless): No library found for -lposix
Warning (mostly harmless): No library found for -lcposix
Making header files for XS...
[2018-07-23 07:25:33-0500] Skip tests from '/home/core/smoke/TestSmoke/smokecurrent.skiptests'
[2018-07-23 07:25:33-0500] 
[2018-07-23 07:25:33-0500]  Tests start here:
[2018-07-23 07:25:33-0500] TSTENV = stdio	
Subroutine Math::BigInt::carp redefined at t/option_l.t line 16.
# parser guessed wrong encoding expected 'CP1252' got 'UTF-8'
# Will use Digest::MD5
[2018-07-23 07:44:29-0500] 
[2018-07-23 07:44:29-0500] All tests successful.
[2018-07-23 07:44:29-0500] Archived results...
[2018-07-23 07:44:29-0500] Unskip tests from '/home/core/smoke/TestSmoke/smokecurrent.skiptests'
[2018-07-23 07:44:29-0500] 
[2018-07-23 07:44:29-0500] Configuration: -Dusedevel -Duse64bitall -DDEBUGGING
[2018-07-23 07:44:29-0500] ------------------------------------------------------------------------------
[2018-07-23 07:44:29-0500] make distclean ...
[2018-07-23 07:44:46-0500] 
[2018-07-23 07:44:46-0500] Copy Policy.sh ...
[2018-07-23 07:44:46-0500] 
[2018-07-23 07:44:46-0500] Configure ...
[2018-07-23 07:45:43-0500] 
[2018-07-23 07:45:43-0500] make ...
parts/inc/mess provides vmess, which is still marked todo for 5.6.0
parts/inc/mess provides vmess, which is still marked todo for 5.6.0
Warning (mostly harmless): No library found for -lposix
Warning (mostly harmless): No library found for -lcposix
Making header files for XS...
[2018-07-23 07:51:48-0500] Skip tests from '/home/core/smoke/TestSmoke/smokecurrent.skiptests'
[2018-07-23 07:51:48-0500] 
[2018-07-23 07:51:48-0500]  Tests start here:
[2018-07-23 07:51:48-0500] TSTENV = stdio	
Subroutine Math::BigInt::carp redefined at t/option_l.t line 16.
# parser guessed wrong encoding expected 'CP1252' got 'UTF-8'
# Will use Digest::MD5
[2018-07-23 08:13:18-0500] 
[2018-07-23 08:13:18-0500] All tests successful.
[2018-07-23 08:13:18-0500] Archived results...
[2018-07-23 08:13:18-0500] Unskip tests from '/home/core/smoke/TestSmoke/smokecurrent.skiptests'
[2018-07-23 08:13:18-0500] 
[2018-07-23 08:13:18-0500] Configuration: -Dusedevel -Duseithreads
[2018-07-23 08:13:18-0500] ------------------------------------------------------------------------------
[2018-07-23 08:13:18-0500] make distclean ...
[2018-07-23 08:13:37-0500] 
[2018-07-23 08:13:37-0500] Copy Policy.sh ...
[2018-07-23 08:13:37-0500] 
[2018-07-23 08:13:37-0500] Configure ...
[2018-07-23 08:14:36-0500] 
[2018-07-23 08:14:36-0500] make ...
parts/inc/mess provides vmess, which is still marked todo for 5.6.0
parts/inc/mess provides vmess, which is still marked todo for 5.6.0
Warning (mostly harmless): No library found for -lposix
Warning (mostly harmless): No library found for -lcposix
Making header files for XS...
[2018-07-23 08:19:09-0500] Skip tests from '/home/core/smoke/TestSmoke/smokecurrent.skiptests'
[2018-07-23 08:19:09-0500] 
[2018-07-23 08:19:09-0500]  Tests start here:
[2018-07-23 08:19:09-0500] TSTENV = stdio	
Subroutine Math::BigInt::carp redefined at t/option_l.t line 16.
# parser guessed wrong encoding expected 'CP1252' got 'UTF-8'
# Will use Digest::MD5
Too late to run INIT block at ../../lib/Test2/IPC.pm line 22.
Too late to run INIT block at ../../lib/Test2/IPC.pm line 22.
Too late to run INIT block at ../../lib/Test2/IPC.pm line 22.
Too late to run INIT block at ../../lib/Test2/IPC.pm line 22.
[2018-07-23 08:41:52-0500] 
[2018-07-23 08:41:52-0500] All tests successful.
[2018-07-23 08:41:52-0500] Archived results...
[2018-07-23 08:41:52-0500] Unskip tests from '/home/core/smoke/TestSmoke/smokecurrent.skiptests'
[2018-07-23 08:41:52-0500] 
[2018-07-23 08:41:52-0500] Configuration: -Dusedevel -Duseithreads -DDEBUGGING
[2018-07-23 08:41:52-0500] ------------------------------------------------------------------------------
[2018-07-23 08:41:52-0500] make distclean ...
[2018-07-23 08:42:09-0500] 
[2018-07-23 08:42:09-0500] Copy Policy.sh ...
[2018-07-23 08:42:09-0500] 
[2018-07-23 08:42:09-0500] Configure ...
[2018-07-23 08:43:10-0500] 
[2018-07-23 08:43:10-0500] make ...
parts/inc/mess provides vmess, which is still marked todo for 5.6.0
parts/inc/mess provides vmess, which is still marked todo for 5.6.0
Warning (mostly harmless): No library found for -lposix
Warning (mostly harmless): No library found for -lcposix
Making header files for XS...
[2018-07-23 08:49:39-0500] Skip tests from '/home/core/smoke/TestSmoke/smokecurrent.skiptests'
[2018-07-23 08:49:39-0500] 
[2018-07-23 08:49:39-0500]  Tests start here:
[2018-07-23 08:49:39-0500] TSTENV = stdio	
Subroutine Math::BigInt::carp redefined at t/option_l.t line 16.
# parser guessed wrong encoding expected 'CP1252' got 'UTF-8'
# Will use Digest::MD5
Too late to run INIT block at ../../lib/Test2/IPC.pm line 22.
Too late to run INIT block at ../../lib/Test2/IPC.pm line 22.
Too late to run INIT block at ../../lib/Test2/IPC.pm line 22.
Too late to run INIT block at ../../lib/Test2/IPC.pm line 22.
[2018-07-23 09:16:08-0500] 
[2018-07-23 09:16:08-0500] All tests successful.
[2018-07-23 09:16:08-0500] Archived results...
[2018-07-23 09:16:08-0500] Unskip tests from '/home/core/smoke/TestSmoke/smokecurrent.skiptests'
[2018-07-23 09:16:08-0500] 
[2018-07-23 09:16:08-0500] Configuration: -Dusedevel -Duseithreads -Dusequadmath
[2018-07-23 09:16:08-0500] ------------------------------------------------------------------------------
[2018-07-23 09:16:08-0500] make distclean ...
[2018-07-23 09:16:30-0500] 
[2018-07-23 09:16:30-0500] Copy Policy.sh ...
[2018-07-23 09:16:30-0500] 
[2018-07-23 09:16:30-0500] Configure ...
[2018-07-23 09:17:31-0500] 
[2018-07-23 09:17:31-0500] make ...
parts/inc/mess provides vmess, which is still marked todo for 5.6.0
parts/inc/mess provides vmess, which is still marked todo for 5.6.0
Warning (mostly harmless): No library found for -lposix
Warning (mostly harmless): No library found for -lcposix
Making header files for XS...
[2018-07-23 09:22:04-0500] Skip tests from '/home/core/smoke/TestSmoke/smokecurrent.skiptests'
[2018-07-23 09:22:04-0500] 
[2018-07-23 09:22:04-0500]  Tests start here:
[2018-07-23 09:22:04-0500] TSTENV = stdio	
Subroutine Math::BigInt::carp redefined at t/option_l.t line 16.
# parser guessed wrong encoding expected 'CP1252' got 'UTF-8'
# Will use Digest::MD5
Too late to run INIT block at ../../lib/Test2/IPC.pm line 22.
Too late to run INIT block at ../../lib/Test2/IPC.pm line 22.
Too late to run INIT block at ../../lib/Test2/IPC.pm line 22.
Too late to run INIT block at ../../lib/Test2/IPC.pm line 22.

#   Failed test 'mtime preserved by copy() while testing cross-partition'
#   at ../lib/File/Copy.t line 128.
#          got: '1000000000.123449998'
#     expected: '1000000000.123449999'
# Looks like you failed 1 test of 466.
make: *** [test_harness] Error 1

error while running harness target 'test_harness': 2 at /home/core/smoke/TestSmoke/Test/Smoke/App/RunSmoke.pm line 118.
[2018-07-23 09:44:43-0500] 
[2018-07-23 09:44:43-0500] ../lib/File/Copy.t..........................................FAILED
[2018-07-23 09:44:43-0500]     53
[2018-07-23 09:44:43-0500] ../lib/File/Copy.t..........................................FAILED
[2018-07-23 09:44:43-0500]     Non-zero exit status: 1
[2018-07-23 09:44:43-0500] Archived results...
[2018-07-23 09:44:43-0500] Unskip tests from '/home/core/smoke/TestSmoke/smokecurrent.skiptests'
[2018-07-23 09:44:43-0500] 
[2018-07-23 09:44:43-0500] Configuration: -Dusedevel -Duseithreads -Dusequadmath -DDEBUGGING
[2018-07-23 09:44:43-0500] ------------------------------------------------------------------------------
[2018-07-23 09:44:43-0500] make distclean ...
[2018-07-23 09:45:00-0500] 
[2018-07-23 09:45:00-0500] Copy Policy.sh ...
[2018-07-23 09:45:00-0500] 
[2018-07-23 09:45:00-0500] Configure ...
[2018-07-23 09:46:01-0500] 
[2018-07-23 09:46:01-0500] make ...
parts/inc/mess provides vmess, which is still marked todo for 5.6.0
parts/inc/mess provides vmess, which is still marked todo for 5.6.0
Warning (mostly harmless): No library found for -lposix
Warning (mostly harmless): No library found for -lcposix
Making header files for XS...
[2018-07-23 09:52:32-0500] Skip tests from '/home/core/smoke/TestSmoke/smokecurrent.skiptests'
[2018-07-23 09:52:32-0500] 
[2018-07-23 09:52:32-0500]  Tests start here:
[2018-07-23 09:52:32-0500] TSTENV = stdio	
Subroutine Math::BigInt::carp redefined at t/option_l.t line 16.
# parser guessed wrong encoding expected 'CP1252' got 'UTF-8'
# Will use Digest::MD5
Too late to run INIT block at ../../lib/Test2/IPC.pm line 22.
Too late to run INIT block at ../../lib/Test2/IPC.pm line 22.
Too late to run INIT block at ../../lib/Test2/IPC.pm line 22.
Too late to run INIT block at ../../lib/Test2/IPC.pm line 22.

#   Failed test 'mtime preserved by copy() while testing cross-partition'
#   at ../lib/File/Copy.t line 128.
#          got: '1000000000.123449998'
#     expected: '1000000000.123449999'
# Looks like you failed 1 test of 466.
make: *** [test_harness] Error 1

error while running harness target 'test_harness': 2 at /home/core/smoke/TestSmoke/Test/Smoke/App/RunSmoke.pm line 118.
[2018-07-23 10:18:56-0500] 
[2018-07-23 10:18:56-0500] ../lib/File/Copy.t..........................................FAILED
[2018-07-23 10:18:56-0500]     53
[2018-07-23 10:18:56-0500] ../lib/File/Copy.t..........................................FAILED
[2018-07-23 10:18:56-0500]     Non-zero exit status: 1
[2018-07-23 10:18:56-0500] Archived results...
[2018-07-23 10:18:56-0500] Unskip tests from '/home/core/smoke/TestSmoke/smokecurrent.skiptests'
[2018-07-23 10:18:56-0500] 
[2018-07-23 10:18:56-0500] Configuration: -Dusedevel -Duseithreads -Duse64bitall
[2018-07-23 10:18:56-0500] ------------------------------------------------------------------------------
[2018-07-23 10:18:56-0500] make distclean ...
[2018-07-23 10:19:17-0500] 
[2018-07-23 10:19:17-0500] Copy Policy.sh ...
[2018-07-23 10:19:17-0500] 
[2018-07-23 10:19:17-0500] Configure ...
[2018-07-23 10:20:17-0500] 
[2018-07-23 10:20:17-0500] make ...
parts/inc/mess provides vmess, which is still marked todo for 5.6.0
parts/inc/mess provides vmess, which is still marked todo for 5.6.0
Warning (mostly harmless): No library found for -lposix
Warning (mostly harmless): No library found for -lcposix
Making header files for XS...
[2018-07-23 10:24:51-0500] Skip tests from '/home/core/smoke/TestSmoke/smokecurrent.skiptests'
[2018-07-23 10:24:51-0500] 
[2018-07-23 10:24:51-0500]  Tests start here:
[2018-07-23 10:24:51-0500] TSTENV = stdio	
Subroutine Math::BigInt::carp redefined at t/option_l.t line 16.
# parser guessed wrong encoding expected 'CP1252' got 'UTF-8'
# Will use Digest::MD5
Too late to run INIT block at ../../lib/Test2/IPC.pm line 22.
Too late to run INIT block at ../../lib/Test2/IPC.pm line 22.
Too late to run INIT block at ../../lib/Test2/IPC.pm line 22.
Too late to run INIT block at ../../lib/Test2/IPC.pm line 22.
[2018-07-23 10:47:39-0500] 
[2018-07-23 10:47:39-0500] All tests successful.
[2018-07-23 10:47:39-0500] Archived results...
[2018-07-23 10:47:39-0500] Unskip tests from '/home/core/smoke/TestSmoke/smokecurrent.skiptests'
[2018-07-23 10:47:39-0500] 
[2018-07-23 10:47:39-0500] Configuration: -Dusedevel -Duseithreads -Duse64bitall -DDEBUGGING
[2018-07-23 10:47:39-0500] ------------------------------------------------------------------------------
[2018-07-23 10:47:39-0500] make distclean ...
[2018-07-23 10:47:56-0500] 
[2018-07-23 10:47:56-0500] Copy Policy.sh ...
[2018-07-23 10:47:56-0500] 
[2018-07-23 10:47:56-0500] Configure ...
[2018-07-23 10:48:55-0500] 
[2018-07-23 10:48:55-0500] make ...
parts/inc/mess provides vmess, which is still marked todo for 5.6.0
parts/inc/mess provides vmess, which is still marked todo for 5.6.0
Warning (mostly harmless): No library found for -lposix
Warning (mostly harmless): No library found for -lcposix
Making header files for XS...
[2018-07-23 10:55:16-0500] Skip tests from '/home/core/smoke/TestSmoke/smokecurrent.skiptests'
[2018-07-23 10:55:16-0500] 
[2018-07-23 10:55:16-0500]  Tests start here:
[2018-07-23 10:55:16-0500] TSTENV = stdio	
Subroutine Math::BigInt::carp redefined at t/option_l.t line 16.
# parser guessed wrong encoding expected 'CP1252' got 'UTF-8'
# Will use Digest::MD5
Too late to run INIT block at ../../lib/Test2/IPC.pm line 22.
Too late to run INIT block at ../../lib/Test2/IPC.pm line 22.
Too late to run INIT block at ../../lib/Test2/IPC.pm line 22.
Too late to run INIT block at ../../lib/Test2/IPC.pm line 22.
[2018-07-23 11:21:41-0500] 
[2018-07-23 11:21:41-0500] All tests successful.
[2018-07-23 11:21:41-0500] Archived results...
[2018-07-23 11:21:41-0500] Unskip tests from '/home/core/smoke/TestSmoke/smokecurrent.skiptests'
[2018-07-23 11:21:41-0500] Finished smoking 3d50648cc4f452d51a0564164a214e51dd6aad95 v5.29.1-29-g3d50648 blead
[2018-07-23 11:21:41-0500] Reading smokeresult from /home/core/smoke/perl-current/mktest.out
[2018-07-23 11:21:41-0500] Processing []
[2018-07-23 11:21:41-0500] Processing [-DDEBUGGING]
[2018-07-23 11:21:41-0500] Processing [-Dusequadmath]
[2018-07-23 11:21:41-0500] Processing [-DDEBUGGING -Dusequadmath]
[2018-07-23 11:21:41-0500] Processing [-Duse64bitall]
[2018-07-23 11:21:41-0500] Processing [-DDEBUGGING -Duse64bitall]
[2018-07-23 11:21:41-0500] Processing [-Duseithreads]
[2018-07-23 11:21:41-0500] Processing [-DDEBUGGING -Duseithreads]
[2018-07-23 11:21:41-0500] Processing [-Duseithreads -Dusequadmath]
[2018-07-23 11:21:41-0500] Processing [-DDEBUGGING -Duseithreads -Dusequadmath]
[2018-07-23 11:21:41-0500] Processing [-Duseithreads -Duse64bitall]
[2018-07-23 11:21:41-0500] Processing [-DDEBUGGING -Duseithreads -Duse64bitall]
[2018-07-23 11:21:41-0500] ==> Starting reporter
[2018-07-23 11:21:41-0500] Writing report to '/home/core/smoke/perl-current/mktest.rpt'
-- 
Report generated by Test::Smoke::Gateway v0.09_01