Show report
[2018-07-11 15:11:07-0500] ==> Starting synctree
[2018-07-11 15:11:07-0500] qx[/usr/pkg/bin/git clone file:///home/core/smoke/git /home/core/smoke/git-perl 2>&1]
[2018-07-11 15:13:24-0500] qx[/usr/pkg/bin/git remote update --prune 2>&1]
[2018-07-11 15:13:24-0500] qx[/usr/pkg/bin/git checkout blead
[2018-07-11 15:13:24-0500]  2>&1]
Already on 'blead'
[2018-07-11 15:13:24-0500] qx[/usr/pkg/bin/git reset --hard origin/blead
[2018-07-11 15:13:24-0500]  2>&1]
[2018-07-11 15:13:24-0500] qx[/usr/pkg/bin/git clone /home/core/smoke/git-perl /home/core/smoke/perl-current 2>&1]
[2018-07-11 15:13:31-0500] qx[/usr/pkg/bin/git clean -dfx 2>&1]
[2018-07-11 15:13:31-0500] qx[/usr/pkg/bin/git fetch origin 2>&1]
[2018-07-11 15:13:31-0500] qx[/usr/pkg/bin/git checkout blead
[2018-07-11 15:13:31-0500]  2>&1]
Already on 'blead'
[2018-07-11 15:13:31-0500] qx[/usr/pkg/bin/git reset --hard origin/blead
[2018-07-11 15:13:31-0500]  2>&1]
[2018-07-11 15:13:31-0500] qx[/home/core/bin/perl-5.26.1/bin/perl5.26.1 Porting/make_dot_patch.pl > .patch]
[2018-07-11 15:13:31-0500] /home/core/smoke/perl-current is now up to patchlevel a13f1de4e34633a275aa79d4e7874c2796bc0417
[2018-07-11 15:13:31-0500] ==> Starting runsmoke
[2018-07-11 15:13:31-0500] [./tssmokeperl.pl] chdir(/home/core/smoke/perl-current)
[2018-07-11 15:13:31-0500] qx[/home/core/bin/perl-5.26.1/bin/perl5.26.1 -e "require q[/home/core/smoke/perl-current/cpan/Test-Harness/lib/Test/Harness.pm];print Test::Harness->VERSION" 2>&1]
[2018-07-11 15:13:31-0500] Found: Test::Harness version 3.42.
[2018-07-11 15:13:31-0500] Reading build configurations from /home/core/smoke/TestSmoke/perlcurrent.cfg
[2018-07-11 15:13:31-0500] Reading 'Policy.sh' from default content (v=1)
[2018-07-11 15:13:31-0500] Running smoke tests without $ENV{PERLIO}
[2018-07-11 15:13:31-0500] Running test suite only with 'harness'
[2018-07-11 15:13:31-0500] make distclean ...
[2018-07-11 15:13:31-0500] Smoking patch a13f1de4e34633a275aa79d4e7874c2796bc0417 v5.29.0-87-ga13f1de4e3
[2018-07-11 15:13:31-0500] Smoking branch blead
[2018-07-11 15:13:32-0500] Locally applied patches from '/home/core/smoke/perl-current/patchlevel.h'
[2018-07-11 15:13:32-0500] Patches: 'uncommitted-changes'
[2018-07-11 15:13:32-0500] Adding 'SMOKEa13f1de4e34633a275aa79d4e7874c2796bc0417' to the registered patches.
[2018-07-11 15:13:32-0500] 
[2018-07-11 15:13:32-0500] Configuration: -Dusedevel
[2018-07-11 15:13:32-0500] ------------------------------------------------------------------------------
[2018-07-11 15:13:32-0500] make distclean ...
[2018-07-11 15:13:32-0500] 
[2018-07-11 15:13:32-0500] Copy Policy.sh ...
[2018-07-11 15:13:32-0500] 
[2018-07-11 15:13:32-0500] Configure ...
size != strlen(buffer) + 1 (0 != 1)
[2018-07-11 15:14:20-0500] 
[2018-07-11 15:14:20-0500] make ...
In file included from regexp.h:21:0,
                 from perl.h:3638,
                 from toke.c:40:
toke.c: In function 'Perl_yylex':
utf8.h:442:43: warning: 'uv' may be used uninitialized in this function [-Wmaybe-uninitialized]
                                    ((old) << UTF_ACCUMULATION_SHIFT)           \
                                           ^
In file included from perl.h:5867:0,
                 from toke.c:40:
inline.h:1805:8: note: 'uv' was declared here
     UV uv;
        ^
In file included from regexp.h:21:0,
                 from perl.h:3638,
                 from toke.c:40:
utf8.h:442:43: warning: 'uv' may be used uninitialized in this function [-Wmaybe-uninitialized]
                                    ((old) << UTF_ACCUMULATION_SHIFT)           \
                                           ^
In file included from perl.h:5867:0,
                 from toke.c:40:
inline.h:1805:8: note: 'uv' was declared here
     UV uv;
        ^
=cut missing? numeric.c:1087:*/
Unable to place to_utf8_upper!
Unable to place to_utf8_title!
Unable to place to_utf8_lower!
Unable to place to_utf8_fold!
no docs for _utf8n_to_uvchr_msgs_helper
/usr/include/sys/cdefs_elf.h:67:20: error: missing binary operator before token "("
 #if __GNUC_PREREQ__(4, 0)
                    ^
/usr/include/sys/cdefs_elf.h:73:20: error: missing binary operator before token "("
 #if __GNUC_PREREQ__(4, 0)
                    ^
/usr/include/sys/cdefs_elf.h:79:20: error: missing binary operator before token "("
 #if __GNUC_PREREQ__(4, 2)
                    ^
Warning (mostly harmless): No library found for -ldb
Warning (mostly harmless): No library found for -lndbm
Warning (mostly harmless): No library found for -ldbm
Warning (mostly harmless): No library found for -lucb
Warning (mostly harmless): No library found for -lcposix
Socket.c: In function 'XS_Socket_pack_ip_mreq_source':
Socket.c:1654:7: warning: variable 'interface' set but not used [-Wunused-but-set-variable]
  SV * interface;
       ^
In file included from HiRes.xs:959:0:
const-c.inc: In function 'constant_19':
const-c.inc:351:42: warning: unused parameter 'iv_return' [-Wunused-parameter]
 constant_19 (pTHX_ const char *name, IV *iv_return) {
                                          ^
Making header files for XS...
[2018-07-11 15:18:35-0500] Skip tests from '/home/core/smoke/TestSmoke/smokecurrent.skiptests'
[2018-07-11 15:18:35-0500] 
[2018-07-11 15:18:35-0500]  Tests start here:
[2018-07-11 15:18:35-0500] TSTENV = stdio	
Subroutine Math::BigInt::carp redefined at t/option_l.t line 16.
# parser guessed wrong encoding expected 'CP1252' got 'UTF-8'
# Will use Digest::MD5

#   Failed test at t/usleep.t line 35.

#   Failed test at t/usleep.t line 43.
# Looks like you failed 2 tests of 6.

error while running harness target 'test_harness': 1 at /home/core/smoke/TestSmoke/Test/Smoke/App/RunSmoke.pm line 118.
[2018-07-11 15:40:22-0500] 
[2018-07-11 15:40:22-0500] ../dist/Time-HiRes/t/usleep.t...............................FAILED
[2018-07-11 15:40:22-0500]     3-4
[2018-07-11 15:40:22-0500] ../dist/Time-HiRes/t/usleep.t...............................FAILED
[2018-07-11 15:40:22-0500]     Non-zero exit status: 2
[2018-07-11 15:40:22-0500] Archived results...
[2018-07-11 15:40:22-0500] Unskip tests from '/home/core/smoke/TestSmoke/smokecurrent.skiptests'
[2018-07-11 15:40:22-0500] 
[2018-07-11 15:40:22-0500] Configuration: -Dusedevel -DDEBUGGING
[2018-07-11 15:40:22-0500] ------------------------------------------------------------------------------
[2018-07-11 15:40:22-0500] make distclean ...
[2018-07-11 15:40:43-0500] 
[2018-07-11 15:40:43-0500] Copy Policy.sh ...
[2018-07-11 15:40:43-0500] 
[2018-07-11 15:40:43-0500] Configure ...
size != strlen(buffer) + 1 (0 != 1)
[2018-07-11 15:41:26-0500] 
[2018-07-11 15:41:26-0500] make ...
=cut missing? numeric.c:1087:*/
Unable to place to_utf8_upper!
Unable to place to_utf8_title!
Unable to place to_utf8_lower!
Unable to place to_utf8_fold!
no docs for _utf8n_to_uvchr_msgs_helper
/usr/include/sys/cdefs_elf.h:67:20: error: missing binary operator before token "("
 #if __GNUC_PREREQ__(4, 0)
                    ^
/usr/include/sys/cdefs_elf.h:73:20: error: missing binary operator before token "("
 #if __GNUC_PREREQ__(4, 0)
                    ^
/usr/include/sys/cdefs_elf.h:79:20: error: missing binary operator before token "("
 #if __GNUC_PREREQ__(4, 2)
                    ^
Warning (mostly harmless): No library found for -ldb
Warning (mostly harmless): No library found for -lndbm
Warning (mostly harmless): No library found for -ldbm
Warning (mostly harmless): No library found for -lucb
Warning (mostly harmless): No library found for -lcposix
Socket.c: In function 'XS_Socket_pack_ip_mreq_source':
Socket.c:1654:7: warning: variable 'interface' set but not used [-Wunused-but-set-variable]
  SV * interface;
       ^
In file included from HiRes.xs:959:0:
const-c.inc: In function 'constant_19':
const-c.inc:351:42: warning: unused parameter 'iv_return' [-Wunused-parameter]
 constant_19 (pTHX_ const char *name, IV *iv_return) {
                                          ^
Making header files for XS...
[2018-07-11 15:47:39-0500] Skip tests from '/home/core/smoke/TestSmoke/smokecurrent.skiptests'
[2018-07-11 15:47:39-0500] 
[2018-07-11 15:47:39-0500]  Tests start here:
[2018-07-11 15:47:39-0500] TSTENV = stdio	
Subroutine Math::BigInt::carp redefined at t/option_l.t line 16.
# parser guessed wrong encoding expected 'CP1252' got 'UTF-8'
# Will use Digest::MD5
[2018-07-11 16:14:59-0500] 
[2018-07-11 16:14:59-0500] All tests successful.
[2018-07-11 16:14:59-0500] Archived results...
[2018-07-11 16:14:59-0500] Unskip tests from '/home/core/smoke/TestSmoke/smokecurrent.skiptests'
[2018-07-11 16:14:59-0500] 
[2018-07-11 16:14:59-0500] Configuration: -Dusedevel -Duse64bitall
[2018-07-11 16:14:59-0500] ------------------------------------------------------------------------------
[2018-07-11 16:14:59-0500] make distclean ...
[2018-07-11 16:15:26-0500] 
[2018-07-11 16:15:26-0500] Copy Policy.sh ...
[2018-07-11 16:15:26-0500] 
[2018-07-11 16:15:26-0500] Configure ...
size != strlen(buffer) + 1 (0 != 1)
[2018-07-11 16:16:09-0500] 
[2018-07-11 16:16:09-0500] make ...
In file included from regexp.h:21:0,
                 from perl.h:3638,
                 from toke.c:40:
toke.c: In function 'Perl_yylex':
utf8.h:442:43: warning: 'uv' may be used uninitialized in this function [-Wmaybe-uninitialized]
                                    ((old) << UTF_ACCUMULATION_SHIFT)           \
                                           ^
In file included from perl.h:5867:0,
                 from toke.c:40:
inline.h:1805:8: note: 'uv' was declared here
     UV uv;
        ^
In file included from regexp.h:21:0,
                 from perl.h:3638,
                 from toke.c:40:
utf8.h:442:43: warning: 'uv' may be used uninitialized in this function [-Wmaybe-uninitialized]
                                    ((old) << UTF_ACCUMULATION_SHIFT)           \
                                           ^
In file included from perl.h:5867:0,
                 from toke.c:40:
inline.h:1805:8: note: 'uv' was declared here
     UV uv;
        ^
=cut missing? numeric.c:1087:*/
Unable to place to_utf8_upper!
Unable to place to_utf8_title!
Unable to place to_utf8_lower!
Unable to place to_utf8_fold!
no docs for _utf8n_to_uvchr_msgs_helper
/usr/include/sys/cdefs_elf.h:67:20: error: missing binary operator before token "("
 #if __GNUC_PREREQ__(4, 0)
                    ^
/usr/include/sys/cdefs_elf.h:73:20: error: missing binary operator before token "("
 #if __GNUC_PREREQ__(4, 0)
                    ^
/usr/include/sys/cdefs_elf.h:79:20: error: missing binary operator before token "("
 #if __GNUC_PREREQ__(4, 2)
                    ^
Warning (mostly harmless): No library found for -ldb
Warning (mostly harmless): No library found for -lndbm
Warning (mostly harmless): No library found for -ldbm
Warning (mostly harmless): No library found for -lucb
Warning (mostly harmless): No library found for -lcposix
Socket.c: In function 'XS_Socket_pack_ip_mreq_source':
Socket.c:1654:7: warning: variable 'interface' set but not used [-Wunused-but-set-variable]
  SV * interface;
       ^
In file included from HiRes.xs:959:0:
const-c.inc: In function 'constant_19':
const-c.inc:351:42: warning: unused parameter 'iv_return' [-Wunused-parameter]
 constant_19 (pTHX_ const char *name, IV *iv_return) {
                                          ^
Making header files for XS...
[2018-07-11 16:20:20-0500] Skip tests from '/home/core/smoke/TestSmoke/smokecurrent.skiptests'
[2018-07-11 16:20:20-0500] 
[2018-07-11 16:20:20-0500]  Tests start here:
[2018-07-11 16:20:20-0500] TSTENV = stdio	
Subroutine Math::BigInt::carp redefined at t/option_l.t line 16.
# parser guessed wrong encoding expected 'CP1252' got 'UTF-8'
# Will use Digest::MD5
[2018-07-11 16:42:20-0500] 
[2018-07-11 16:42:20-0500] All tests successful.
[2018-07-11 16:42:20-0500] Archived results...
[2018-07-11 16:42:20-0500] Unskip tests from '/home/core/smoke/TestSmoke/smokecurrent.skiptests'
[2018-07-11 16:42:20-0500] 
[2018-07-11 16:42:20-0500] Configuration: -Dusedevel -Duse64bitall -DDEBUGGING
[2018-07-11 16:42:20-0500] ------------------------------------------------------------------------------
[2018-07-11 16:42:20-0500] make distclean ...
[2018-07-11 16:42:44-0500] 
[2018-07-11 16:42:44-0500] Copy Policy.sh ...
[2018-07-11 16:42:44-0500] 
[2018-07-11 16:42:44-0500] Configure ...
size != strlen(buffer) + 1 (0 != 1)
[2018-07-11 16:43:29-0500] 
[2018-07-11 16:43:29-0500] make ...
=cut missing? numeric.c:1087:*/
Unable to place to_utf8_upper!
Unable to place to_utf8_title!
Unable to place to_utf8_lower!
Unable to place to_utf8_fold!
no docs for _utf8n_to_uvchr_msgs_helper
/usr/include/sys/cdefs_elf.h:67:20: error: missing binary operator before token "("
 #if __GNUC_PREREQ__(4, 0)
                    ^
/usr/include/sys/cdefs_elf.h:73:20: error: missing binary operator before token "("
 #if __GNUC_PREREQ__(4, 0)
                    ^
/usr/include/sys/cdefs_elf.h:79:20: error: missing binary operator before token "("
 #if __GNUC_PREREQ__(4, 2)
                    ^
Warning (mostly harmless): No library found for -ldb
Warning (mostly harmless): No library found for -lndbm
Warning (mostly harmless): No library found for -ldbm
Warning (mostly harmless): No library found for -lucb
Warning (mostly harmless): No library found for -lcposix
Socket.c: In function 'XS_Socket_pack_ip_mreq_source':
Socket.c:1654:7: warning: variable 'interface' set but not used [-Wunused-but-set-variable]
  SV * interface;
       ^
In file included from HiRes.xs:959:0:
const-c.inc: In function 'constant_19':
const-c.inc:351:42: warning: unused parameter 'iv_return' [-Wunused-parameter]
 constant_19 (pTHX_ const char *name, IV *iv_return) {
                                          ^
Making header files for XS...
[2018-07-11 16:49:57-0500] Skip tests from '/home/core/smoke/TestSmoke/smokecurrent.skiptests'
[2018-07-11 16:49:57-0500] 
[2018-07-11 16:49:57-0500]  Tests start here:
[2018-07-11 16:49:57-0500] TSTENV = stdio	
Subroutine Math::BigInt::carp redefined at t/option_l.t line 16.
# parser guessed wrong encoding expected 'CP1252' got 'UTF-8'
# Will use Digest::MD5
[2018-07-11 17:17:24-0500] 
[2018-07-11 17:17:24-0500] All tests successful.
[2018-07-11 17:17:24-0500] Archived results...
[2018-07-11 17:17:24-0500] Unskip tests from '/home/core/smoke/TestSmoke/smokecurrent.skiptests'
[2018-07-11 17:17:24-0500] 
[2018-07-11 17:17:24-0500] Configuration: -Dusedevel -Duseithreads
[2018-07-11 17:17:24-0500] ------------------------------------------------------------------------------
[2018-07-11 17:17:24-0500] make distclean ...
[2018-07-11 17:17:51-0500] 
[2018-07-11 17:17:51-0500] Copy Policy.sh ...
[2018-07-11 17:17:51-0500] 
[2018-07-11 17:17:51-0500] Configure ...
size != strlen(buffer) + 1 (0 != 1)
[2018-07-11 17:18:37-0500] 
[2018-07-11 17:18:37-0500] make ...
In file included from regexp.h:21:0,
                 from perl.h:3638,
                 from toke.c:40:
toke.c: In function 'Perl_yylex':
utf8.h:442:43: warning: 'uv' may be used uninitialized in this function [-Wmaybe-uninitialized]
                                    ((old) << UTF_ACCUMULATION_SHIFT)           \
                                           ^
In file included from perl.h:5867:0,
                 from toke.c:40:
inline.h:1805:8: note: 'uv' was declared here
     UV uv;
        ^
In file included from regexp.h:21:0,
                 from perl.h:3638,
                 from toke.c:40:
utf8.h:442:43: warning: 'uv' may be used uninitialized in this function [-Wmaybe-uninitialized]
                                    ((old) << UTF_ACCUMULATION_SHIFT)           \
                                           ^
In file included from perl.h:5867:0,
                 from toke.c:40:
inline.h:1805:8: note: 'uv' was declared here
     UV uv;
        ^
=cut missing? numeric.c:1087:*/
Unable to place to_utf8_upper!
Unable to place to_utf8_title!
Unable to place to_utf8_lower!
Unable to place to_utf8_fold!
no docs for _utf8n_to_uvchr_msgs_helper
/usr/include/sys/cdefs_elf.h:67:20: error: missing binary operator before token "("
 #if __GNUC_PREREQ__(4, 0)
                    ^
/usr/include/sys/cdefs_elf.h:73:20: error: missing binary operator before token "("
 #if __GNUC_PREREQ__(4, 0)
                    ^
/usr/include/sys/cdefs_elf.h:79:20: error: missing binary operator before token "("
 #if __GNUC_PREREQ__(4, 2)
                    ^
Warning (mostly harmless): No library found for -ldb
Warning (mostly harmless): No library found for -lndbm
Warning (mostly harmless): No library found for -ldbm
Warning (mostly harmless): No library found for -lucb
Warning (mostly harmless): No library found for -lcposix
Socket.c: In function 'XS_Socket_pack_ip_mreq_source':
Socket.c:1654:7: warning: variable 'interface' set but not used [-Wunused-but-set-variable]
  SV * interface;
       ^
In file included from HiRes.xs:959:0:
const-c.inc: In function 'constant_19':
const-c.inc:351:42: warning: unused parameter 'iv_return' [-Wunused-parameter]
 constant_19 (pTHX_ const char *name, IV *iv_return) {
                                          ^
Making header files for XS...
[2018-07-11 17:23:08-0500] Skip tests from '/home/core/smoke/TestSmoke/smokecurrent.skiptests'
[2018-07-11 17:23:08-0500] 
[2018-07-11 17:23:08-0500]  Tests start here:
[2018-07-11 17:23:08-0500] TSTENV = stdio	
Subroutine Math::BigInt::carp redefined at t/option_l.t line 16.
# parser guessed wrong encoding expected 'CP1252' got 'UTF-8'
# Will use Digest::MD5
[2018-07-11 17:48:31-0500] 
[2018-07-11 17:48:31-0500] All tests successful.
[2018-07-11 17:48:31-0500] Archived results...
[2018-07-11 17:48:31-0500] Unskip tests from '/home/core/smoke/TestSmoke/smokecurrent.skiptests'
[2018-07-11 17:48:31-0500] 
[2018-07-11 17:48:31-0500] Configuration: -Dusedevel -Duseithreads -DDEBUGGING
[2018-07-11 17:48:31-0500] ------------------------------------------------------------------------------
[2018-07-11 17:48:31-0500] make distclean ...
[2018-07-11 17:48:55-0500] 
[2018-07-11 17:48:55-0500] Copy Policy.sh ...
[2018-07-11 17:48:55-0500] 
[2018-07-11 17:48:55-0500] Configure ...
size != strlen(buffer) + 1 (0 != 1)
[2018-07-11 17:49:43-0500] 
[2018-07-11 17:49:43-0500] make ...
=cut missing? numeric.c:1087:*/
Unable to place to_utf8_upper!
Unable to place to_utf8_title!
Unable to place to_utf8_lower!
Unable to place to_utf8_fold!
no docs for _utf8n_to_uvchr_msgs_helper
/usr/include/sys/cdefs_elf.h:67:20: error: missing binary operator before token "("
 #if __GNUC_PREREQ__(4, 0)
                    ^
/usr/include/sys/cdefs_elf.h:73:20: error: missing binary operator before token "("
 #if __GNUC_PREREQ__(4, 0)
                    ^
/usr/include/sys/cdefs_elf.h:79:20: error: missing binary operator before token "("
 #if __GNUC_PREREQ__(4, 2)
                    ^
Warning (mostly harmless): No library found for -ldb
Warning (mostly harmless): No library found for -lndbm
Warning (mostly harmless): No library found for -ldbm
Warning (mostly harmless): No library found for -lucb
Warning (mostly harmless): No library found for -lcposix
Socket.c: In function 'XS_Socket_pack_ip_mreq_source':
Socket.c:1654:7: warning: variable 'interface' set but not used [-Wunused-but-set-variable]
  SV * interface;
       ^
In file included from HiRes.xs:959:0:
const-c.inc: In function 'constant_19':
const-c.inc:351:42: warning: unused parameter 'iv_return' [-Wunused-parameter]
 constant_19 (pTHX_ const char *name, IV *iv_return) {
                                          ^
Making header files for XS...
[2018-07-11 17:56:32-0500] Skip tests from '/home/core/smoke/TestSmoke/smokecurrent.skiptests'
[2018-07-11 17:56:32-0500] 
[2018-07-11 17:56:32-0500]  Tests start here:
[2018-07-11 17:56:32-0500] TSTENV = stdio	
Subroutine Math::BigInt::carp redefined at t/option_l.t line 16.
# parser guessed wrong encoding expected 'CP1252' got 'UTF-8'
# Will use Digest::MD5
[2018-07-11 18:28:33-0500] 
[2018-07-11 18:28:33-0500] All tests successful.
[2018-07-11 18:28:33-0500] Archived results...
[2018-07-11 18:28:33-0500] Unskip tests from '/home/core/smoke/TestSmoke/smokecurrent.skiptests'
[2018-07-11 18:28:33-0500] 
[2018-07-11 18:28:33-0500] Configuration: -Dusedevel -Duseithreads -Duse64bitall
[2018-07-11 18:28:33-0500] ------------------------------------------------------------------------------
[2018-07-11 18:28:33-0500] make distclean ...
[2018-07-11 18:29:03-0500] 
[2018-07-11 18:29:03-0500] Copy Policy.sh ...
[2018-07-11 18:29:03-0500] 
[2018-07-11 18:29:03-0500] Configure ...
size != strlen(buffer) + 1 (0 != 1)
[2018-07-11 18:29:47-0500] 
[2018-07-11 18:29:47-0500] make ...
In file included from regexp.h:21:0,
                 from perl.h:3638,
                 from toke.c:40:
toke.c: In function 'Perl_yylex':
utf8.h:442:43: warning: 'uv' may be used uninitialized in this function [-Wmaybe-uninitialized]
                                    ((old) << UTF_ACCUMULATION_SHIFT)           \
                                           ^
In file included from perl.h:5867:0,
                 from toke.c:40:
inline.h:1805:8: note: 'uv' was declared here
     UV uv;
        ^
In file included from regexp.h:21:0,
                 from perl.h:3638,
                 from toke.c:40:
utf8.h:442:43: warning: 'uv' may be used uninitialized in this function [-Wmaybe-uninitialized]
                                    ((old) << UTF_ACCUMULATION_SHIFT)           \
                                           ^
In file included from perl.h:5867:0,
                 from toke.c:40:
inline.h:1805:8: note: 'uv' was declared here
     UV uv;
        ^
=cut missing? numeric.c:1087:*/
Unable to place to_utf8_upper!
Unable to place to_utf8_title!
Unable to place to_utf8_lower!
Unable to place to_utf8_fold!
no docs for _utf8n_to_uvchr_msgs_helper
/usr/include/sys/cdefs_elf.h:67:20: error: missing binary operator before token "("
 #if __GNUC_PREREQ__(4, 0)
                    ^
/usr/include/sys/cdefs_elf.h:73:20: error: missing binary operator before token "("
 #if __GNUC_PREREQ__(4, 0)
                    ^
/usr/include/sys/cdefs_elf.h:79:20: error: missing binary operator before token "("
 #if __GNUC_PREREQ__(4, 2)
                    ^
Warning (mostly harmless): No library found for -ldb
Warning (mostly harmless): No library found for -lndbm
Warning (mostly harmless): No library found for -ldbm
Warning (mostly harmless): No library found for -lucb
Warning (mostly harmless): No library found for -lcposix
Socket.c: In function 'XS_Socket_pack_ip_mreq_source':
Socket.c:1654:7: warning: variable 'interface' set but not used [-Wunused-but-set-variable]
  SV * interface;
       ^
In file included from HiRes.xs:959:0:
const-c.inc: In function 'constant_19':
const-c.inc:351:42: warning: unused parameter 'iv_return' [-Wunused-parameter]
 constant_19 (pTHX_ const char *name, IV *iv_return) {
                                          ^
Making header files for XS...
[2018-07-11 18:34:05-0500] Skip tests from '/home/core/smoke/TestSmoke/smokecurrent.skiptests'
[2018-07-11 18:34:05-0500] 
[2018-07-11 18:34:05-0500]  Tests start here:
[2018-07-11 18:34:05-0500] TSTENV = stdio	
Subroutine Math::BigInt::carp redefined at t/option_l.t line 16.
# parser guessed wrong encoding expected 'CP1252' got 'UTF-8'
# Will use Digest::MD5
[2018-07-11 18:58:40-0500] 
[2018-07-11 18:58:40-0500] All tests successful.
[2018-07-11 18:58:40-0500] Archived results...
[2018-07-11 18:58:40-0500] Unskip tests from '/home/core/smoke/TestSmoke/smokecurrent.skiptests'
[2018-07-11 18:58:40-0500] 
[2018-07-11 18:58:40-0500] Configuration: -Dusedevel -Duseithreads -Duse64bitall -DDEBUGGING
[2018-07-11 18:58:40-0500] ------------------------------------------------------------------------------
[2018-07-11 18:58:40-0500] make distclean ...
[2018-07-11 18:59:01-0500] 
[2018-07-11 18:59:01-0500] Copy Policy.sh ...
[2018-07-11 18:59:01-0500] 
[2018-07-11 18:59:01-0500] Configure ...
size != strlen(buffer) + 1 (0 != 1)
[2018-07-11 18:59:47-0500] 
[2018-07-11 18:59:47-0500] make ...
=cut missing? numeric.c:1087:*/
Unable to place to_utf8_upper!
Unable to place to_utf8_title!
Unable to place to_utf8_lower!
Unable to place to_utf8_fold!
no docs for _utf8n_to_uvchr_msgs_helper
/usr/include/sys/cdefs_elf.h:67:20: error: missing binary operator before token "("
 #if __GNUC_PREREQ__(4, 0)
                    ^
/usr/include/sys/cdefs_elf.h:73:20: error: missing binary operator before token "("
 #if __GNUC_PREREQ__(4, 0)
                    ^
/usr/include/sys/cdefs_elf.h:79:20: error: missing binary operator before token "("
 #if __GNUC_PREREQ__(4, 2)
                    ^
Warning (mostly harmless): No library found for -ldb
Warning (mostly harmless): No library found for -lndbm
Warning (mostly harmless): No library found for -ldbm
Warning (mostly harmless): No library found for -lucb
Warning (mostly harmless): No library found for -lcposix
Socket.c: In function 'XS_Socket_pack_ip_mreq_source':
Socket.c:1654:7: warning: variable 'interface' set but not used [-Wunused-but-set-variable]
  SV * interface;
       ^
In file included from HiRes.xs:959:0:
const-c.inc: In function 'constant_19':
const-c.inc:351:42: warning: unused parameter 'iv_return' [-Wunused-parameter]
 constant_19 (pTHX_ const char *name, IV *iv_return) {
                                          ^
Making header files for XS...
[2018-07-11 19:06:09-0500] Skip tests from '/home/core/smoke/TestSmoke/smokecurrent.skiptests'
[2018-07-11 19:06:09-0500] 
[2018-07-11 19:06:09-0500]  Tests start here:
[2018-07-11 19:06:09-0500] TSTENV = stdio	
Subroutine Math::BigInt::carp redefined at t/option_l.t line 16.
# parser guessed wrong encoding expected 'CP1252' got 'UTF-8'
# Will use Digest::MD5
[2018-07-11 19:36:44-0500] 
[2018-07-11 19:36:44-0500] All tests successful.
[2018-07-11 19:36:44-0500] Archived results...
[2018-07-11 19:36:44-0500] Unskip tests from '/home/core/smoke/TestSmoke/smokecurrent.skiptests'
[2018-07-11 19:36:44-0500] Finished smoking a13f1de4e34633a275aa79d4e7874c2796bc0417 v5.29.0-87-ga13f1de4e3 blead
[2018-07-11 19:36:44-0500] Reading smokeresult from /home/core/smoke/perl-current/mktest.out
[2018-07-11 19:36:44-0500] Processing []
[2018-07-11 19:36:44-0500] Processing [-DDEBUGGING]
[2018-07-11 19:36:44-0500] Processing [-Duse64bitall]
[2018-07-11 19:36:44-0500] Processing [-DDEBUGGING -Duse64bitall]
[2018-07-11 19:36:44-0500] Processing [-Duseithreads]
[2018-07-11 19:36:44-0500] Processing [-DDEBUGGING -Duseithreads]
[2018-07-11 19:36:44-0500] Processing [-Duseithreads -Duse64bitall]
[2018-07-11 19:36:44-0500] Processing [-DDEBUGGING -Duseithreads -Duse64bitall]
[2018-07-11 19:36:44-0500] ==> Starting reporter
[2018-07-11 19:36:44-0500] Writing report to '/home/core/smoke/perl-current/mktest.rpt'
-- 
Report generated by Test::Smoke::Gateway v0.09_01