Show report
[2018-07-11 23:15:01+0200] ==> Starting synctree
[2018-07-11 23:15:01+0200] qx[/usr/bin/git remote update --prune 2>&1]
[2018-07-11 23:15:02+0200] qx[/usr/bin/git checkout blead 2>&1]
[2018-07-11 23:15:02+0200] qx[/usr/bin/git reset --hard origin/blead 2>&1]
[2018-07-11 23:15:02+0200] qx[/usr/bin/git clean -dfx 2>&1]
[2018-07-11 23:15:02+0200] qx[/usr/bin/git fetch origin 2>&1]
[2018-07-11 23:15:02+0200] qx[/usr/bin/git checkout blead 2>&1]
[2018-07-11 23:15:02+0200] qx[/usr/bin/git reset --hard origin/blead 2>&1]
[2018-07-11 23:15:03+0200] qx[/usr/bin/perl Porting/make_dot_patch.pl > .patch]
[2018-07-11 23:15:03+0200] /home/abeltje/Test-Smoke/perl-current is now up to patchlevel a13f1de4e34633a275aa79d4e7874c2796bc0417
[2018-07-11 23:15:03+0200] ==> Starting runsmoke
[2018-07-11 23:15:03+0200] [../bin/tssmokeperl.pl] chdir(/home/abeltje/Test-Smoke/perl-current)
[2018-07-11 23:15:03+0200] qx[/usr/bin/perl -e "require q[/home/abeltje/Test-Smoke/perl-current/cpan/Test-Harness/lib/Test/Harness.pm];print Test::Harness->VERSION" 2>&1]
[2018-07-11 23:15:03+0200] Found: Test::Harness version 3.42.
[2018-07-11 23:15:03+0200] Reading build configurations from /home/abeltje/Test-Smoke/etc/perlcurrent.cfg
[2018-07-11 23:15:03+0200] Reading 'Policy.sh' from default content (v=1)
[2018-07-11 23:15:03+0200] make distclean ...
[2018-07-11 23:15:03+0200] Smoking patch a13f1de4e34633a275aa79d4e7874c2796bc0417 v5.29.0-87-ga13f1de
[2018-07-11 23:15:03+0200] Smoking branch blead
[2018-07-11 23:15:03+0200] Locally applied patches from '/home/abeltje/Test-Smoke/perl-current/patchlevel.h'
[2018-07-11 23:15:03+0200] Patches: 'uncommitted-changes'
[2018-07-11 23:15:03+0200] Adding 'SMOKEa13f1de4e34633a275aa79d4e7874c2796bc0417' to the registered patches.
[2018-07-11 23:15:03+0200] 
[2018-07-11 23:15:03+0200] Configuration: -Dusedevel -Dcc='ccache gcc'
[2018-07-11 23:15:03+0200] ------------------------------------------------------------------------------
[2018-07-11 23:15:03+0200] make distclean ...
[2018-07-11 23:15:03+0200] 
[2018-07-11 23:15:03+0200] Copy Policy.sh ...
[2018-07-11 23:15:03+0200] 
[2018-07-11 23:15:03+0200] Configure ...
[2018-07-11 23:15:43+0200] 
[2018-07-11 23:15:43+0200] make ...
locale.c:109:58: warning: defining type in ‘sizeof’ expression is invalid in C++ [-Wc++-compat]
=cut missing? numeric.c:1087:*/
Unable to place to_utf8_upper!
Unable to place to_utf8_title!
Unable to place to_utf8_lower!
Unable to place to_utf8_fold!
no docs for _utf8n_to_uvchr_msgs_helper
Warning (mostly harmless): No library found for -lposix
Warning (mostly harmless): No library found for -lcposix
Making header files for XS...
[2018-07-11 23:18:09+0200] Skip tests from '/home/abeltje/Test-Smoke/etc/blead.skiptests'
[2018-07-11 23:18:09+0200] 	t/porting/pending-author.t: ok
[2018-07-11 23:18:09+0200] 
[2018-07-11 23:18:09+0200]  Tests start here:
[2018-07-11 23:18:09+0200] TSTENV = stdio	
# Will use Digest::MD5
Subroutine Math::BigInt::carp redefined at t/option_l.t line 16.
# parser guessed wrong encoding expected 'CP1252' got 'UTF-8'
# Failed test 9948 - File t/porting/pending-author.t exists at porting/manifest.t line 57
Can't open porting/pending-author.t: No such file or directory at porting/test_bootstrap.t line 35, <$fh> chunk 5907.
Failed 2 tests out of 2456, 99.92% okay.
### Since not all tests were successful, you may want to run some of
### them individually and examine any diagnostic messages they produce.
### See the INSTALL document's section on "make test".
### You have a good chance to get more information by running
###   ./perl harness
### in the 't' directory since most (>=80%) of the tests succeeded.
### You may have to set your dynamic library search path,
### LD_LIBRARY_PATH, to point to the build directory:
###   setenv LD_LIBRARY_PATH `pwd`:$LD_LIBRARY_PATH; cd t; ./perl harness
###   LD_LIBRARY_PATH=`pwd`:$LD_LIBRARY_PATH; export LD_LIBRARY_PATH; cd t; ./perl harness
###   export LD_LIBRARY_PATH=`pwd`:$LD_LIBRARY_PATH; cd t; ./perl harness
### for csh-style shells, like tcsh; or for traditional/modern
### Bourne-style shells, like bash, ksh, and zsh, respectively.
make: *** [_test] Error 1
[2018-07-11 23:18:09+0200] ./runtests choose
[2018-07-11 23:29:52+0200] t/porting/manifest ............................................. FAILED at test 9948
[2018-07-11 23:30:06+0200] t/porting/test_bootstrap ....................................... FAILED--non-zero wait status: 512
[2018-07-11 23:30:10+0200] Elapsed: 721 sec
[2018-07-11 23:30:10+0200] u=12.64  s=3.09  cu=430.28  cs=43.46  scripts=2456  tests=1153470
[2018-07-11 23:30:10+0200] makefile:788: recipe for target '_test' failed
[2018-07-11 23:30:10+0200] 
[2018-07-11 23:30:10+0200] Error while reading test-results: 2
[2018-07-11 23:30:10+0200] 
[2018-07-11 23:30:10+0200] Extending failures with harness:
[2018-07-11 23:30:10+0200] 	../t/porting/manifest.t ../t/porting/test_bootstrap.t
# Failed test 9948 - File t/porting/pending-author.t exists at ../t/porting/manifest.t line 57
Can't open porting/pending-author.t: No such file or directory at ../t/porting/test_bootstrap.t line 35, <$fh> chunk 5907.
[2018-07-11 23:30:12+0200] ../t/porting/manifest.t ........ 
[2018-07-11 23:30:12+0200] Failed 1/10519 subtests 
[2018-07-11 23:30:12+0200] ../t/porting/test_bootstrap.t .. 
[2018-07-11 23:30:12+0200] Dubious, test returned 2 (wstat 512, 0x200)
[2018-07-11 23:30:12+0200] All 473 subtests passed 

[2018-07-11 23:30:12+0200] Test Summary Report
[2018-07-11 23:30:12+0200] -------------------
[2018-07-11 23:30:12+0200] ../t/porting/manifest.t      (Wstat: 0 Tests: 10519 Failed: 1)
[2018-07-11 23:30:12+0200]   Failed test:  9948
[2018-07-11 23:30:12+0200] ../t/porting/test_bootstrap.t (Wstat: 512 Tests: 473 Failed: 0)
[2018-07-11 23:30:12+0200]   Non-zero exit status: 2
[2018-07-11 23:30:12+0200] Files=2, Tests=10992,  2 wallclock secs ( 0.37 usr  0.00 sys +  1.57 cusr  0.06 csys =  2.00 CPU)
[2018-07-11 23:30:12+0200] Result: FAIL
[2018-07-11 23:30:12+0200] 
[2018-07-11 23:30:12+0200]     ../t/porting/manifest.t.....................................FAILED
[2018-07-11 23:30:12+0200]         9948
[2018-07-11 23:30:12+0200]     ../t/porting/test_bootstrap.t...............................FAILED
[2018-07-11 23:30:12+0200]         Non-zero exit status: 2

[2018-07-11 23:30:12+0200] TSTENV = perlio	
# Will use Digest::MD5
Subroutine Math::BigInt::carp redefined at t/option_l.t line 16.
# parser guessed wrong encoding expected 'CP1252' got 'UTF-8'
# Failed test 9948 - File t/porting/pending-author.t exists at porting/manifest.t line 57
Can't open porting/pending-author.t: No such file or directory at porting/test_bootstrap.t line 35, <$fh> chunk 5907.
Failed 2 tests out of 2458, 99.92% okay.
### Since not all tests were successful, you may want to run some of
### them individually and examine any diagnostic messages they produce.
### See the INSTALL document's section on "make test".
### You have a good chance to get more information by running
###   ./perl harness
### in the 't' directory since most (>=80%) of the tests succeeded.
### You may have to set your dynamic library search path,
### LD_LIBRARY_PATH, to point to the build directory:
###   setenv LD_LIBRARY_PATH `pwd`:$LD_LIBRARY_PATH; cd t; ./perl harness
###   LD_LIBRARY_PATH=`pwd`:$LD_LIBRARY_PATH; export LD_LIBRARY_PATH; cd t; ./perl harness
###   export LD_LIBRARY_PATH=`pwd`:$LD_LIBRARY_PATH; cd t; ./perl harness
### for csh-style shells, like tcsh; or for traditional/modern
### Bourne-style shells, like bash, ksh, and zsh, respectively.
make: *** [_test] Error 1
[2018-07-11 23:30:12+0200] ./runtests choose
[2018-07-11 23:41:08+0200] t/porting/manifest ............................................. FAILED at test 9948
[2018-07-11 23:41:22+0200] t/porting/test_bootstrap ....................................... FAILED--non-zero wait status: 512
[2018-07-11 23:41:25+0200] Elapsed: 673 sec
[2018-07-11 23:41:25+0200] u=11.22  s=2.92  cu=384.25  cs=40.21  scripts=2458  tests=1153520
[2018-07-11 23:41:25+0200] makefile:788: recipe for target '_test' failed
[2018-07-11 23:41:25+0200] 
[2018-07-11 23:41:25+0200] Error while reading test-results: 2
[2018-07-11 23:41:25+0200] 
[2018-07-11 23:41:25+0200] Extending failures with harness:
[2018-07-11 23:41:25+0200] 	../t/porting/manifest.t ../t/porting/test_bootstrap.t
# Failed test 9948 - File t/porting/pending-author.t exists at ../t/porting/manifest.t line 57
Can't open porting/pending-author.t: No such file or directory at ../t/porting/test_bootstrap.t line 35, <$fh> chunk 5907.
[2018-07-11 23:41:27+0200] ../t/porting/manifest.t ........ 
[2018-07-11 23:41:27+0200] Failed 1/10519 subtests 
[2018-07-11 23:41:27+0200] ../t/porting/test_bootstrap.t .. 
[2018-07-11 23:41:27+0200] Dubious, test returned 2 (wstat 512, 0x200)
[2018-07-11 23:41:27+0200] All 473 subtests passed 

[2018-07-11 23:41:27+0200] Test Summary Report
[2018-07-11 23:41:27+0200] -------------------
[2018-07-11 23:41:27+0200] ../t/porting/manifest.t      (Wstat: 0 Tests: 10519 Failed: 1)
[2018-07-11 23:41:27+0200]   Failed test:  9948
[2018-07-11 23:41:27+0200] ../t/porting/test_bootstrap.t (Wstat: 512 Tests: 473 Failed: 0)
[2018-07-11 23:41:27+0200]   Non-zero exit status: 2
[2018-07-11 23:41:27+0200] Files=2, Tests=10992,  2 wallclock secs ( 0.37 usr  0.00 sys +  1.63 cusr  0.02 csys =  2.02 CPU)
[2018-07-11 23:41:27+0200] Result: FAIL
[2018-07-11 23:41:27+0200] 
[2018-07-11 23:41:27+0200]     ../t/porting/manifest.t.....................................FAILED
[2018-07-11 23:41:27+0200]         9948
[2018-07-11 23:41:27+0200]     ../t/porting/test_bootstrap.t...............................FAILED
[2018-07-11 23:41:27+0200]         Non-zero exit status: 2

[2018-07-11 23:41:27+0200] TSTENV = locale:nl_NL.utf8	
# Will use Digest::MD5
recv() is deprecated on :utf8 handles. This will be a fatal error in Perl 5.30 at (eval 12) line 28.
Subroutine Math::BigInt::carp redefined at t/option_l.t line 16.
# parser guessed wrong encoding expected 'CP1252' got 'UTF-8'
# Failed test 9948 - File t/porting/pending-author.t exists at porting/manifest.t line 57
Can't open porting/pending-author.t: No such file or directory at porting/test_bootstrap.t line 35, <$fh> chunk 5907.
Failed 2 tests out of 2457, 99.92% okay.
### Since not all tests were successful, you may want to run some of
### them individually and examine any diagnostic messages they produce.
### See the INSTALL document's section on "make test".
### You have a good chance to get more information by running
###   ./perl harness
### in the 't' directory since most (>=80%) of the tests succeeded.
### You may have to set your dynamic library search path,
### LD_LIBRARY_PATH, to point to the build directory:
###   setenv LD_LIBRARY_PATH `pwd`:$LD_LIBRARY_PATH; cd t; ./perl harness
###   LD_LIBRARY_PATH=`pwd`:$LD_LIBRARY_PATH; export LD_LIBRARY_PATH; cd t; ./perl harness
###   export LD_LIBRARY_PATH=`pwd`:$LD_LIBRARY_PATH; cd t; ./perl harness
### for csh-style shells, like tcsh; or for traditional/modern
### Bourne-style shells, like bash, ksh, and zsh, respectively.
make: *** [_test] Error 1
[2018-07-11 23:41:27+0200] ./runtests choose
[2018-07-11 23:52:33+0200] t/porting/manifest ............................................. FAILED at test 9948
[2018-07-11 23:52:47+0200] t/porting/test_bootstrap ....................................... FAILED--non-zero wait status: 512
[2018-07-11 23:52:50+0200] Elapsed: 683 sec
[2018-07-11 23:52:50+0200] u=11.58  s=2.69  cu=397.16  cs=39.64  scripts=2457  tests=1153523
[2018-07-11 23:52:50+0200] makefile:788: recipe for target '_test' failed
[2018-07-11 23:52:50+0200] 
[2018-07-11 23:52:50+0200] Error while reading test-results: 2
[2018-07-11 23:52:50+0200] 
[2018-07-11 23:52:50+0200] Extending failures with harness:
[2018-07-11 23:52:50+0200] 	../t/porting/manifest.t ../t/porting/test_bootstrap.t
# Failed test 9948 - File t/porting/pending-author.t exists at ../t/porting/manifest.t line 57
Can't open porting/pending-author.t: No such file or directory at ../t/porting/test_bootstrap.t line 35, <$fh> chunk 5907.
[2018-07-11 23:52:52+0200] ../t/porting/manifest.t ........ 
[2018-07-11 23:52:52+0200] Failed 1/10519 subtests 
[2018-07-11 23:52:52+0200] ../t/porting/test_bootstrap.t .. 
[2018-07-11 23:52:52+0200] Dubious, test returned 2 (wstat 512, 0x200)
[2018-07-11 23:52:52+0200] All 473 subtests passed 

[2018-07-11 23:52:52+0200] Test Summary Report
[2018-07-11 23:52:52+0200] -------------------
[2018-07-11 23:52:52+0200] ../t/porting/manifest.t      (Wstat: 0 Tests: 10519 Failed: 1)
[2018-07-11 23:52:52+0200]   Failed test:  9948
[2018-07-11 23:52:52+0200] ../t/porting/test_bootstrap.t (Wstat: 512 Tests: 473 Failed: 0)
[2018-07-11 23:52:52+0200]   Non-zero exit status: 2
[2018-07-11 23:52:52+0200] Files=2, Tests=10992,  2 wallclock secs ( 0.38 usr  0.01 sys +  1.60 cusr  0.05 csys =  2.04 CPU)
[2018-07-11 23:52:52+0200] Result: FAIL
[2018-07-11 23:52:53+0200] 
[2018-07-11 23:52:53+0200]     ../t/porting/manifest.t.....................................FAILED
[2018-07-11 23:52:53+0200]         9948
[2018-07-11 23:52:53+0200]     ../t/porting/test_bootstrap.t...............................FAILED
[2018-07-11 23:52:53+0200]         Non-zero exit status: 2

[2018-07-11 23:52:53+0200] Unskip tests from '/home/abeltje/Test-Smoke/etc/blead.skiptests'
[2018-07-11 23:52:53+0200] 	t/porting/pending-author.t: ok
[2018-07-11 23:52:53+0200] 
[2018-07-11 23:52:53+0200] Configuration: -Dusedevel -Dcc='ccache gcc' -DDEBUGGING
[2018-07-11 23:52:53+0200] ------------------------------------------------------------------------------
[2018-07-11 23:52:53+0200] make distclean ...
[2018-07-11 23:53:02+0200] 
[2018-07-11 23:53:02+0200] Copy Policy.sh ...
[2018-07-11 23:53:02+0200] 
[2018-07-11 23:53:02+0200] Configure ...
[2018-07-11 23:53:32+0200] 
[2018-07-11 23:53:32+0200] make ...
=cut missing? numeric.c:1087:*/
Unable to place to_utf8_upper!
Unable to place to_utf8_title!
Unable to place to_utf8_lower!
Unable to place to_utf8_fold!
no docs for _utf8n_to_uvchr_msgs_helper
Warning (mostly harmless): No library found for -lposix
Warning (mostly harmless): No library found for -lcposix
Making header files for XS...
[2018-07-11 23:56:28+0200] Skip tests from '/home/abeltje/Test-Smoke/etc/blead.skiptests'
[2018-07-11 23:56:28+0200] 	t/porting/pending-author.t: ok
[2018-07-11 23:56:28+0200] 
[2018-07-11 23:56:28+0200]  Tests start here:
[2018-07-11 23:56:28+0200] TSTENV = stdio	
# Will use Digest::MD5
Subroutine Math::BigInt::carp redefined at t/option_l.t line 16.
# parser guessed wrong encoding expected 'CP1252' got 'UTF-8'
# Failed test 9948 - File t/porting/pending-author.t exists at porting/manifest.t line 57
Can't open porting/pending-author.t: No such file or directory at porting/test_bootstrap.t line 35, <$fh> chunk 5907.
Failed 2 tests out of 2457, 99.92% okay.
### Since not all tests were successful, you may want to run some of
### them individually and examine any diagnostic messages they produce.
### See the INSTALL document's section on "make test".
### You have a good chance to get more information by running
###   ./perl harness
### in the 't' directory since most (>=80%) of the tests succeeded.
### You may have to set your dynamic library search path,
### LD_LIBRARY_PATH, to point to the build directory:
###   setenv LD_LIBRARY_PATH `pwd`:$LD_LIBRARY_PATH; cd t; ./perl harness
###   LD_LIBRARY_PATH=`pwd`:$LD_LIBRARY_PATH; export LD_LIBRARY_PATH; cd t; ./perl harness
###   export LD_LIBRARY_PATH=`pwd`:$LD_LIBRARY_PATH; cd t; ./perl harness
### for csh-style shells, like tcsh; or for traditional/modern
### Bourne-style shells, like bash, ksh, and zsh, respectively.
make: *** [_test] Error 1
[2018-07-11 23:56:28+0200] ./runtests choose
[2018-07-12 00:09:23+0200] t/porting/manifest ............................................. FAILED at test 9948
[2018-07-12 00:09:41+0200] t/porting/test_bootstrap ....................................... FAILED--non-zero wait status: 512
[2018-07-12 00:09:45+0200] Elapsed: 797 sec
[2018-07-12 00:09:45+0200] u=14.00  s=3.17  cu=507.09  cs=44.88  scripts=2457  tests=1153479
[2018-07-12 00:09:45+0200] makefile:788: recipe for target '_test' failed
[2018-07-12 00:09:45+0200] 
[2018-07-12 00:09:45+0200] Error while reading test-results: 2
[2018-07-12 00:09:45+0200] 
[2018-07-12 00:09:45+0200] Extending failures with harness:
[2018-07-12 00:09:45+0200] 	../t/porting/manifest.t ../t/porting/test_bootstrap.t
# Failed test 9948 - File t/porting/pending-author.t exists at ../t/porting/manifest.t line 57
Can't open porting/pending-author.t: No such file or directory at ../t/porting/test_bootstrap.t line 35, <$fh> chunk 5907.
[2018-07-12 00:09:48+0200] ../t/porting/manifest.t ........ 
[2018-07-12 00:09:48+0200] Failed 1/10519 subtests 
[2018-07-12 00:09:48+0200] ../t/porting/test_bootstrap.t .. 
[2018-07-12 00:09:48+0200] Dubious, test returned 2 (wstat 512, 0x200)
[2018-07-12 00:09:48+0200] All 473 subtests passed 

[2018-07-12 00:09:48+0200] Test Summary Report
[2018-07-12 00:09:48+0200] -------------------
[2018-07-12 00:09:48+0200] ../t/porting/manifest.t      (Wstat: 0 Tests: 10519 Failed: 1)
[2018-07-12 00:09:48+0200]   Failed test:  9948
[2018-07-12 00:09:48+0200] ../t/porting/test_bootstrap.t (Wstat: 512 Tests: 473 Failed: 0)
[2018-07-12 00:09:48+0200]   Non-zero exit status: 2
[2018-07-12 00:09:48+0200] Files=2, Tests=10992,  3 wallclock secs ( 0.45 usr  0.00 sys +  2.41 cusr  0.03 csys =  2.89 CPU)
[2018-07-12 00:09:48+0200] Result: FAIL
[2018-07-12 00:09:48+0200] 
[2018-07-12 00:09:48+0200]     ../t/porting/manifest.t.....................................FAILED
[2018-07-12 00:09:48+0200]         9948
[2018-07-12 00:09:48+0200]     ../t/porting/test_bootstrap.t...............................FAILED
[2018-07-12 00:09:48+0200]         Non-zero exit status: 2

[2018-07-12 00:09:48+0200] TSTENV = perlio	
# Will use Digest::MD5
Subroutine Math::BigInt::carp redefined at t/option_l.t line 16.
# parser guessed wrong encoding expected 'CP1252' got 'UTF-8'
# Failed test 9948 - File t/porting/pending-author.t exists at porting/manifest.t line 57
Can't open porting/pending-author.t: No such file or directory at porting/test_bootstrap.t line 35, <$fh> chunk 5907.
Failed 2 tests out of 2459, 99.92% okay.
### Since not all tests were successful, you may want to run some of
### them individually and examine any diagnostic messages they produce.
### See the INSTALL document's section on "make test".
### You have a good chance to get more information by running
###   ./perl harness
### in the 't' directory since most (>=80%) of the tests succeeded.
### You may have to set your dynamic library search path,
### LD_LIBRARY_PATH, to point to the build directory:
###   setenv LD_LIBRARY_PATH `pwd`:$LD_LIBRARY_PATH; cd t; ./perl harness
###   LD_LIBRARY_PATH=`pwd`:$LD_LIBRARY_PATH; export LD_LIBRARY_PATH; cd t; ./perl harness
###   export LD_LIBRARY_PATH=`pwd`:$LD_LIBRARY_PATH; cd t; ./perl harness
### for csh-style shells, like tcsh; or for traditional/modern
### Bourne-style shells, like bash, ksh, and zsh, respectively.
make: *** [_test] Error 1
[2018-07-12 00:09:48+0200] ./runtests choose
[2018-07-12 00:22:39+0200] t/porting/manifest ............................................. FAILED at test 9948
[2018-07-12 00:22:57+0200] t/porting/test_bootstrap ....................................... FAILED--non-zero wait status: 512
[2018-07-12 00:23:01+0200] Elapsed: 793 sec
[2018-07-12 00:23:01+0200] u=13.67  s=3.07  cu=480.85  cs=43.21  scripts=2459  tests=1153505
[2018-07-12 00:23:01+0200] makefile:788: recipe for target '_test' failed
[2018-07-12 00:23:01+0200] 
[2018-07-12 00:23:01+0200] Error while reading test-results: 2
[2018-07-12 00:23:01+0200] 
[2018-07-12 00:23:01+0200] Extending failures with harness:
[2018-07-12 00:23:01+0200] 	../t/porting/manifest.t ../t/porting/test_bootstrap.t
# Failed test 9948 - File t/porting/pending-author.t exists at ../t/porting/manifest.t line 57
Can't open porting/pending-author.t: No such file or directory at ../t/porting/test_bootstrap.t line 35, <$fh> chunk 5907.
[2018-07-12 00:23:04+0200] ../t/porting/manifest.t ........ 
[2018-07-12 00:23:04+0200] Failed 1/10519 subtests 
[2018-07-12 00:23:04+0200] ../t/porting/test_bootstrap.t .. 
[2018-07-12 00:23:04+0200] Dubious, test returned 2 (wstat 512, 0x200)
[2018-07-12 00:23:04+0200] All 473 subtests passed 

[2018-07-12 00:23:04+0200] Test Summary Report
[2018-07-12 00:23:04+0200] -------------------
[2018-07-12 00:23:04+0200] ../t/porting/manifest.t      (Wstat: 0 Tests: 10519 Failed: 1)
[2018-07-12 00:23:04+0200]   Failed test:  9948
[2018-07-12 00:23:04+0200] ../t/porting/test_bootstrap.t (Wstat: 512 Tests: 473 Failed: 0)
[2018-07-12 00:23:04+0200]   Non-zero exit status: 2
[2018-07-12 00:23:04+0200] Files=2, Tests=10992,  3 wallclock secs ( 0.47 usr  0.00 sys +  2.44 cusr  0.02 csys =  2.93 CPU)
[2018-07-12 00:23:04+0200] Result: FAIL
[2018-07-12 00:23:04+0200] 
[2018-07-12 00:23:04+0200]     ../t/porting/manifest.t.....................................FAILED
[2018-07-12 00:23:04+0200]         9948
[2018-07-12 00:23:04+0200]     ../t/porting/test_bootstrap.t...............................FAILED
[2018-07-12 00:23:04+0200]         Non-zero exit status: 2

[2018-07-12 00:23:04+0200] TSTENV = locale:nl_NL.utf8	
# Will use Digest::MD5
recv() is deprecated on :utf8 handles. This will be a fatal error in Perl 5.30 at (eval 12) line 28.
Subroutine Math::BigInt::carp redefined at t/option_l.t line 16.
# parser guessed wrong encoding expected 'CP1252' got 'UTF-8'
# Failed test 9948 - File t/porting/pending-author.t exists at porting/manifest.t line 57
Can't open porting/pending-author.t: No such file or directory at porting/test_bootstrap.t line 35, <$fh> chunk 5907.
Failed 2 tests out of 2458, 99.92% okay.
### Since not all tests were successful, you may want to run some of
### them individually and examine any diagnostic messages they produce.
### See the INSTALL document's section on "make test".
### You have a good chance to get more information by running
###   ./perl harness
### in the 't' directory since most (>=80%) of the tests succeeded.
### You may have to set your dynamic library search path,
### LD_LIBRARY_PATH, to point to the build directory:
###   setenv LD_LIBRARY_PATH `pwd`:$LD_LIBRARY_PATH; cd t; ./perl harness
###   LD_LIBRARY_PATH=`pwd`:$LD_LIBRARY_PATH; export LD_LIBRARY_PATH; cd t; ./perl harness
###   export LD_LIBRARY_PATH=`pwd`:$LD_LIBRARY_PATH; cd t; ./perl harness
### for csh-style shells, like tcsh; or for traditional/modern
### Bourne-style shells, like bash, ksh, and zsh, respectively.
make: *** [_test] Error 1
[2018-07-12 00:23:04+0200] ./runtests choose
[2018-07-12 00:36:20+0200] t/porting/manifest ............................................. FAILED at test 9948
[2018-07-12 00:36:38+0200] t/porting/test_bootstrap ....................................... FAILED--non-zero wait status: 512
[2018-07-12 00:36:42+0200] Elapsed: 818 sec
[2018-07-12 00:36:42+0200] u=13.90  s=3.06  cu=489.90  cs=43.68  scripts=2458  tests=1153416
[2018-07-12 00:36:42+0200] makefile:788: recipe for target '_test' failed
[2018-07-12 00:36:42+0200] 
[2018-07-12 00:36:42+0200] Error while reading test-results: 2
[2018-07-12 00:36:42+0200] 
[2018-07-12 00:36:42+0200] Extending failures with harness:
[2018-07-12 00:36:42+0200] 	../t/porting/manifest.t ../t/porting/test_bootstrap.t
# Failed test 9948 - File t/porting/pending-author.t exists at ../t/porting/manifest.t line 57
Can't open porting/pending-author.t: No such file or directory at ../t/porting/test_bootstrap.t line 35, <$fh> chunk 5907.
[2018-07-12 00:36:45+0200] ../t/porting/manifest.t ........ 
[2018-07-12 00:36:45+0200] Failed 1/10519 subtests 
[2018-07-12 00:36:45+0200] ../t/porting/test_bootstrap.t .. 
[2018-07-12 00:36:45+0200] Dubious, test returned 2 (wstat 512, 0x200)
[2018-07-12 00:36:45+0200] All 473 subtests passed 

[2018-07-12 00:36:45+0200] Test Summary Report
[2018-07-12 00:36:45+0200] -------------------
[2018-07-12 00:36:45+0200] ../t/porting/manifest.t      (Wstat: 0 Tests: 10519 Failed: 1)
[2018-07-12 00:36:45+0200]   Failed test:  9948
[2018-07-12 00:36:45+0200] ../t/porting/test_bootstrap.t (Wstat: 512 Tests: 473 Failed: 0)
[2018-07-12 00:36:45+0200]   Non-zero exit status: 2
[2018-07-12 00:36:45+0200] Files=2, Tests=10992,  3 wallclock secs ( 0.48 usr  0.00 sys +  2.46 cusr  0.06 csys =  3.00 CPU)
[2018-07-12 00:36:45+0200] Result: FAIL
[2018-07-12 00:36:45+0200] 
[2018-07-12 00:36:45+0200]     ../t/porting/manifest.t.....................................FAILED
[2018-07-12 00:36:45+0200]         9948
[2018-07-12 00:36:45+0200]     ../t/porting/test_bootstrap.t...............................FAILED
[2018-07-12 00:36:45+0200]         Non-zero exit status: 2

[2018-07-12 00:36:45+0200] Unskip tests from '/home/abeltje/Test-Smoke/etc/blead.skiptests'
[2018-07-12 00:36:45+0200] 	t/porting/pending-author.t: ok
[2018-07-12 00:36:45+0200] 
[2018-07-12 00:36:45+0200] Configuration: -Dusedevel -Dcc='ccache gcc' -Duseithreads
[2018-07-12 00:36:45+0200] ------------------------------------------------------------------------------
[2018-07-12 00:36:45+0200] make distclean ...
[2018-07-12 00:36:56+0200] 
[2018-07-12 00:36:56+0200] Copy Policy.sh ...
[2018-07-12 00:36:56+0200] 
[2018-07-12 00:36:56+0200] Configure ...
[2018-07-12 00:37:28+0200] 
[2018-07-12 00:37:28+0200] make ...
locale.c:109:58: warning: defining type in ‘sizeof’ expression is invalid in C++ [-Wc++-compat]
=cut missing? numeric.c:1087:*/
Unable to place to_utf8_upper!
Unable to place to_utf8_title!
Unable to place to_utf8_lower!
Unable to place to_utf8_fold!
no docs for _utf8n_to_uvchr_msgs_helper
Warning (mostly harmless): No library found for -lposix
Warning (mostly harmless): No library found for -lcposix
Making header files for XS...
[2018-07-12 00:39:36+0200] Skip tests from '/home/abeltje/Test-Smoke/etc/blead.skiptests'
[2018-07-12 00:39:36+0200] 	t/porting/pending-author.t: ok
[2018-07-12 00:39:36+0200] 
[2018-07-12 00:39:36+0200]  Tests start here:
[2018-07-12 00:39:36+0200] TSTENV = stdio	
# Will use Digest::MD5
Subroutine Math::BigInt::carp redefined at t/option_l.t line 16.
# parser guessed wrong encoding expected 'CP1252' got 'UTF-8'
# Failed test 9948 - File t/porting/pending-author.t exists at porting/manifest.t line 57
Can't open porting/pending-author.t: No such file or directory at porting/test_bootstrap.t line 35, <$fh> chunk 5907.
Failed 2 tests out of 2540, 99.92% okay.
### Since not all tests were successful, you may want to run some of
### them individually and examine any diagnostic messages they produce.
### See the INSTALL document's section on "make test".
### You have a good chance to get more information by running
###   ./perl harness
### in the 't' directory since most (>=80%) of the tests succeeded.
### You may have to set your dynamic library search path,
### LD_LIBRARY_PATH, to point to the build directory:
###   setenv LD_LIBRARY_PATH `pwd`:$LD_LIBRARY_PATH; cd t; ./perl harness
###   LD_LIBRARY_PATH=`pwd`:$LD_LIBRARY_PATH; export LD_LIBRARY_PATH; cd t; ./perl harness
###   export LD_LIBRARY_PATH=`pwd`:$LD_LIBRARY_PATH; cd t; ./perl harness
### for csh-style shells, like tcsh; or for traditional/modern
### Bourne-style shells, like bash, ksh, and zsh, respectively.
make: *** [_test] Error 1
[2018-07-12 00:39:36+0200] ./runtests choose
[2018-07-12 00:54:02+0200] t/porting/manifest ............................................. FAILED at test 9948
[2018-07-12 00:54:17+0200] t/porting/test_bootstrap ....................................... FAILED--non-zero wait status: 512
[2018-07-12 00:54:21+0200] Elapsed: 885 sec
[2018-07-12 00:54:21+0200] u=12.46  s=3.09  cu=486.73  cs=46.27  scripts=2540  tests=1164805
[2018-07-12 00:54:21+0200] makefile:788: recipe for target '_test' failed
[2018-07-12 00:54:21+0200] 
[2018-07-12 00:54:21+0200] Error while reading test-results: 2
[2018-07-12 00:54:21+0200] 
[2018-07-12 00:54:21+0200] Extending failures with harness:
[2018-07-12 00:54:21+0200] 	../t/porting/manifest.t ../t/porting/test_bootstrap.t
# Failed test 9948 - File t/porting/pending-author.t exists at ../t/porting/manifest.t line 57
Can't open porting/pending-author.t: No such file or directory at ../t/porting/test_bootstrap.t line 35, <$fh> chunk 5907.
[2018-07-12 00:54:24+0200] ../t/porting/manifest.t ........ 
[2018-07-12 00:54:24+0200] Failed 1/10519 subtests 
[2018-07-12 00:54:24+0200] ../t/porting/test_bootstrap.t .. 
[2018-07-12 00:54:24+0200] Dubious, test returned 2 (wstat 512, 0x200)
[2018-07-12 00:54:24+0200] All 473 subtests passed 

[2018-07-12 00:54:24+0200] Test Summary Report
[2018-07-12 00:54:24+0200] -------------------
[2018-07-12 00:54:24+0200] ../t/porting/manifest.t      (Wstat: 0 Tests: 10519 Failed: 1)
[2018-07-12 00:54:24+0200]   Failed test:  9948
[2018-07-12 00:54:24+0200] ../t/porting/test_bootstrap.t (Wstat: 512 Tests: 473 Failed: 0)
[2018-07-12 00:54:24+0200]   Non-zero exit status: 2
[2018-07-12 00:54:24+0200] Files=2, Tests=10992,  3 wallclock secs ( 0.41 usr  0.01 sys +  1.65 cusr  0.03 csys =  2.10 CPU)
[2018-07-12 00:54:24+0200] Result: FAIL
[2018-07-12 00:54:24+0200] 
[2018-07-12 00:54:24+0200]     ../t/porting/manifest.t.....................................FAILED
[2018-07-12 00:54:24+0200]         9948
[2018-07-12 00:54:24+0200]     ../t/porting/test_bootstrap.t...............................FAILED
[2018-07-12 00:54:24+0200]         Non-zero exit status: 2

[2018-07-12 00:54:24+0200] TSTENV = perlio	
# Will use Digest::MD5
Subroutine Math::BigInt::carp redefined at t/option_l.t line 16.
# parser guessed wrong encoding expected 'CP1252' got 'UTF-8'
# Failed test 9948 - File t/porting/pending-author.t exists at porting/manifest.t line 57
Can't open porting/pending-author.t: No such file or directory at porting/test_bootstrap.t line 35, <$fh> chunk 5907.
Failed 2 tests out of 2542, 99.92% okay.
### Since not all tests were successful, you may want to run some of
### them individually and examine any diagnostic messages they produce.
### See the INSTALL document's section on "make test".
### You have a good chance to get more information by running
###   ./perl harness
### in the 't' directory since most (>=80%) of the tests succeeded.
### You may have to set your dynamic library search path,
### LD_LIBRARY_PATH, to point to the build directory:
###   setenv LD_LIBRARY_PATH `pwd`:$LD_LIBRARY_PATH; cd t; ./perl harness
###   LD_LIBRARY_PATH=`pwd`:$LD_LIBRARY_PATH; export LD_LIBRARY_PATH; cd t; ./perl harness
###   export LD_LIBRARY_PATH=`pwd`:$LD_LIBRARY_PATH; cd t; ./perl harness
### for csh-style shells, like tcsh; or for traditional/modern
### Bourne-style shells, like bash, ksh, and zsh, respectively.
make: *** [_test] Error 1
[2018-07-12 00:54:24+0200] ./runtests choose
[2018-07-12 01:08:16+0200] t/porting/manifest ............................................. FAILED at test 9948
[2018-07-12 01:08:30+0200] t/porting/test_bootstrap ....................................... FAILED--non-zero wait status: 512
[2018-07-12 01:08:34+0200] Elapsed: 850 sec
[2018-07-12 01:08:34+0200] u=11.65  s=2.92  cu=458.26  cs=44.31  scripts=2542  tests=1164906
[2018-07-12 01:08:34+0200] makefile:788: recipe for target '_test' failed
[2018-07-12 01:08:34+0200] 
[2018-07-12 01:08:34+0200] Error while reading test-results: 2
[2018-07-12 01:08:34+0200] 
[2018-07-12 01:08:34+0200] Extending failures with harness:
[2018-07-12 01:08:34+0200] 	../t/porting/manifest.t ../t/porting/test_bootstrap.t
# Failed test 9948 - File t/porting/pending-author.t exists at ../t/porting/manifest.t line 57
Can't open porting/pending-author.t: No such file or directory at ../t/porting/test_bootstrap.t line 35, <$fh> chunk 5907.
[2018-07-12 01:08:36+0200] ../t/porting/manifest.t ........ 
[2018-07-12 01:08:36+0200] Failed 1/10519 subtests 
[2018-07-12 01:08:36+0200] ../t/porting/test_bootstrap.t .. 
[2018-07-12 01:08:36+0200] Dubious, test returned 2 (wstat 512, 0x200)
[2018-07-12 01:08:36+0200] All 473 subtests passed 

[2018-07-12 01:08:36+0200] Test Summary Report
[2018-07-12 01:08:36+0200] -------------------
[2018-07-12 01:08:36+0200] ../t/porting/manifest.t      (Wstat: 0 Tests: 10519 Failed: 1)
[2018-07-12 01:08:36+0200]   Failed test:  9948
[2018-07-12 01:08:36+0200] ../t/porting/test_bootstrap.t (Wstat: 512 Tests: 473 Failed: 0)
[2018-07-12 01:08:36+0200]   Non-zero exit status: 2
[2018-07-12 01:08:36+0200] Files=2, Tests=10992,  2 wallclock secs ( 0.40 usr  0.00 sys +  1.79 cusr  0.04 csys =  2.23 CPU)
[2018-07-12 01:08:36+0200] Result: FAIL
[2018-07-12 01:08:36+0200] 
[2018-07-12 01:08:36+0200]     ../t/porting/manifest.t.....................................FAILED
[2018-07-12 01:08:36+0200]         9948
[2018-07-12 01:08:36+0200]     ../t/porting/test_bootstrap.t...............................FAILED
[2018-07-12 01:08:36+0200]         Non-zero exit status: 2

[2018-07-12 01:08:36+0200] TSTENV = locale:nl_NL.utf8	
# Will use Digest::MD5
recv() is deprecated on :utf8 handles. This will be a fatal error in Perl 5.30 at (eval 12) line 28.
Subroutine Math::BigInt::carp redefined at t/option_l.t line 16.
# parser guessed wrong encoding expected 'CP1252' got 'UTF-8'
# Failed test 9948 - File t/porting/pending-author.t exists at porting/manifest.t line 57
Can't open porting/pending-author.t: No such file or directory at porting/test_bootstrap.t line 35, <$fh> chunk 5907.
Failed 2 tests out of 2541, 99.92% okay.
### Since not all tests were successful, you may want to run some of
### them individually and examine any diagnostic messages they produce.
### See the INSTALL document's section on "make test".
### You have a good chance to get more information by running
###   ./perl harness
### in the 't' directory since most (>=80%) of the tests succeeded.
### You may have to set your dynamic library search path,
### LD_LIBRARY_PATH, to point to the build directory:
###   setenv LD_LIBRARY_PATH `pwd`:$LD_LIBRARY_PATH; cd t; ./perl harness
###   LD_LIBRARY_PATH=`pwd`:$LD_LIBRARY_PATH; export LD_LIBRARY_PATH; cd t; ./perl harness
###   export LD_LIBRARY_PATH=`pwd`:$LD_LIBRARY_PATH; cd t; ./perl harness
### for csh-style shells, like tcsh; or for traditional/modern
### Bourne-style shells, like bash, ksh, and zsh, respectively.
make: *** [_test] Error 1
[2018-07-12 01:08:36+0200] ./runtests choose
[2018-07-12 01:23:04+0200] t/porting/manifest ............................................. FAILED at test 9948
[2018-07-12 01:23:19+0200] t/porting/test_bootstrap ....................................... FAILED--non-zero wait status: 512
[2018-07-12 01:23:22+0200] Elapsed: 886 sec
[2018-07-12 01:23:22+0200] u=11.78  s=2.98  cu=462.94  cs=45.47  scripts=2541  tests=1164776
[2018-07-12 01:23:22+0200] makefile:788: recipe for target '_test' failed
[2018-07-12 01:23:22+0200] 
[2018-07-12 01:23:22+0200] Error while reading test-results: 2
[2018-07-12 01:23:22+0200] 
[2018-07-12 01:23:22+0200] Extending failures with harness:
[2018-07-12 01:23:22+0200] 	../t/porting/manifest.t ../t/porting/test_bootstrap.t
# Failed test 9948 - File t/porting/pending-author.t exists at ../t/porting/manifest.t line 57
Can't open porting/pending-author.t: No such file or directory at ../t/porting/test_bootstrap.t line 35, <$fh> chunk 5907.
[2018-07-12 01:23:24+0200] ../t/porting/manifest.t ........ 
[2018-07-12 01:23:24+0200] Failed 1/10519 subtests 
[2018-07-12 01:23:24+0200] ../t/porting/test_bootstrap.t .. 
[2018-07-12 01:23:24+0200] Dubious, test returned 2 (wstat 512, 0x200)
[2018-07-12 01:23:24+0200] All 473 subtests passed 

[2018-07-12 01:23:24+0200] Test Summary Report
[2018-07-12 01:23:24+0200] -------------------
[2018-07-12 01:23:24+0200] ../t/porting/manifest.t      (Wstat: 0 Tests: 10519 Failed: 1)
[2018-07-12 01:23:24+0200]   Failed test:  9948
[2018-07-12 01:23:24+0200] ../t/porting/test_bootstrap.t (Wstat: 512 Tests: 473 Failed: 0)
[2018-07-12 01:23:24+0200]   Non-zero exit status: 2
[2018-07-12 01:23:24+0200] Files=2, Tests=10992,  2 wallclock secs ( 0.39 usr  0.01 sys +  1.67 cusr  0.03 csys =  2.10 CPU)
[2018-07-12 01:23:24+0200] Result: FAIL
[2018-07-12 01:23:24+0200] 
[2018-07-12 01:23:24+0200]     ../t/porting/manifest.t.....................................FAILED
[2018-07-12 01:23:24+0200]         9948
[2018-07-12 01:23:24+0200]     ../t/porting/test_bootstrap.t...............................FAILED
[2018-07-12 01:23:24+0200]         Non-zero exit status: 2

[2018-07-12 01:23:24+0200] Unskip tests from '/home/abeltje/Test-Smoke/etc/blead.skiptests'
[2018-07-12 01:23:24+0200] 	t/porting/pending-author.t: ok
[2018-07-12 01:23:24+0200] 
[2018-07-12 01:23:24+0200] Configuration: -Dusedevel -Dcc='ccache gcc' -Duseithreads -DDEBUGGING
[2018-07-12 01:23:24+0200] ------------------------------------------------------------------------------
[2018-07-12 01:23:24+0200] make distclean ...
[2018-07-12 01:23:34+0200] 
[2018-07-12 01:23:34+0200] Copy Policy.sh ...
[2018-07-12 01:23:34+0200] 
[2018-07-12 01:23:34+0200] Configure ...
[2018-07-12 01:24:22+0200] 
[2018-07-12 01:24:22+0200] make ...
=cut missing? numeric.c:1087:*/
Unable to place to_utf8_upper!
Unable to place to_utf8_title!
Unable to place to_utf8_lower!
Unable to place to_utf8_fold!
no docs for _utf8n_to_uvchr_msgs_helper
Warning (mostly harmless): No library found for -lposix
Warning (mostly harmless): No library found for -lcposix
Making header files for XS...
[2018-07-12 01:27:38+0200] Skip tests from '/home/abeltje/Test-Smoke/etc/blead.skiptests'
[2018-07-12 01:27:38+0200] 	t/porting/pending-author.t: ok
[2018-07-12 01:27:38+0200] 
[2018-07-12 01:27:38+0200]  Tests start here:
[2018-07-12 01:27:38+0200] TSTENV = stdio	
# Will use Digest::MD5
Subroutine Math::BigInt::carp redefined at t/option_l.t line 16.
# parser guessed wrong encoding expected 'CP1252' got 'UTF-8'
# Failed test 9948 - File t/porting/pending-author.t exists at porting/manifest.t line 57
Can't open porting/pending-author.t: No such file or directory at porting/test_bootstrap.t line 35, <$fh> chunk 5907.
Failed 2 tests out of 2541, 99.92% okay.
### Since not all tests were successful, you may want to run some of
### them individually and examine any diagnostic messages they produce.
### See the INSTALL document's section on "make test".
### You have a good chance to get more information by running
###   ./perl harness
### in the 't' directory since most (>=80%) of the tests succeeded.
### You may have to set your dynamic library search path,
### LD_LIBRARY_PATH, to point to the build directory:
###   setenv LD_LIBRARY_PATH `pwd`:$LD_LIBRARY_PATH; cd t; ./perl harness
###   LD_LIBRARY_PATH=`pwd`:$LD_LIBRARY_PATH; export LD_LIBRARY_PATH; cd t; ./perl harness
###   export LD_LIBRARY_PATH=`pwd`:$LD_LIBRARY_PATH; cd t; ./perl harness
### for csh-style shells, like tcsh; or for traditional/modern
### Bourne-style shells, like bash, ksh, and zsh, respectively.
make: *** [_test] Error 1
[2018-07-12 01:27:38+0200] ./runtests choose
[2018-07-12 01:46:53+0200] t/porting/manifest ............................................. FAILED at test 9948
[2018-07-12 01:47:12+0200] t/porting/test_bootstrap ....................................... FAILED--non-zero wait status: 512
[2018-07-12 01:47:17+0200] Elapsed: 1179 sec
[2018-07-12 01:47:17+0200] u=15.42  s=3.09  cu=613.50  cs=167.67  scripts=2541  tests=1164769
[2018-07-12 01:47:17+0200] makefile:788: recipe for target '_test' failed
[2018-07-12 01:47:17+0200] 
[2018-07-12 01:47:17+0200] Error while reading test-results: 2
[2018-07-12 01:47:17+0200] 
[2018-07-12 01:47:17+0200] Extending failures with harness:
[2018-07-12 01:47:17+0200] 	../t/porting/manifest.t ../t/porting/test_bootstrap.t
# Failed test 9948 - File t/porting/pending-author.t exists at ../t/porting/manifest.t line 57
Can't open porting/pending-author.t: No such file or directory at ../t/porting/test_bootstrap.t line 35, <$fh> chunk 5907.
[2018-07-12 01:47:21+0200] ../t/porting/manifest.t ........ 
[2018-07-12 01:47:21+0200] Failed 1/10519 subtests 
[2018-07-12 01:47:21+0200] ../t/porting/test_bootstrap.t .. 
[2018-07-12 01:47:21+0200] Dubious, test returned 2 (wstat 512, 0x200)
[2018-07-12 01:47:21+0200] All 473 subtests passed 

[2018-07-12 01:47:21+0200] Test Summary Report
[2018-07-12 01:47:21+0200] -------------------
[2018-07-12 01:47:21+0200] ../t/porting/manifest.t      (Wstat: 0 Tests: 10519 Failed: 1)
[2018-07-12 01:47:21+0200]   Failed test:  9948
[2018-07-12 01:47:21+0200] ../t/porting/test_bootstrap.t (Wstat: 512 Tests: 473 Failed: 0)
[2018-07-12 01:47:21+0200]   Non-zero exit status: 2
[2018-07-12 01:47:21+0200] Files=2, Tests=10992,  4 wallclock secs ( 0.52 usr  0.01 sys +  2.42 cusr  0.05 csys =  3.00 CPU)
[2018-07-12 01:47:21+0200] Result: FAIL
[2018-07-12 01:47:21+0200] 
[2018-07-12 01:47:21+0200]     ../t/porting/manifest.t.....................................FAILED
[2018-07-12 01:47:21+0200]         9948
[2018-07-12 01:47:21+0200]     ../t/porting/test_bootstrap.t...............................FAILED
[2018-07-12 01:47:21+0200]         Non-zero exit status: 2

[2018-07-12 01:47:21+0200] TSTENV = perlio	
# Will use Digest::MD5
Subroutine Math::BigInt::carp redefined at t/option_l.t line 16.
# parser guessed wrong encoding expected 'CP1252' got 'UTF-8'
# Failed test 9948 - File t/porting/pending-author.t exists at porting/manifest.t line 57
Can't open porting/pending-author.t: No such file or directory at porting/test_bootstrap.t line 35, <$fh> chunk 5907.
Failed 2 tests out of 2543, 99.92% okay.
### Since not all tests were successful, you may want to run some of
### them individually and examine any diagnostic messages they produce.
### See the INSTALL document's section on "make test".
### You have a good chance to get more information by running
###   ./perl harness
### in the 't' directory since most (>=80%) of the tests succeeded.
### You may have to set your dynamic library search path,
### LD_LIBRARY_PATH, to point to the build directory:
###   setenv LD_LIBRARY_PATH `pwd`:$LD_LIBRARY_PATH; cd t; ./perl harness
###   LD_LIBRARY_PATH=`pwd`:$LD_LIBRARY_PATH; export LD_LIBRARY_PATH; cd t; ./perl harness
###   export LD_LIBRARY_PATH=`pwd`:$LD_LIBRARY_PATH; cd t; ./perl harness
### for csh-style shells, like tcsh; or for traditional/modern
### Bourne-style shells, like bash, ksh, and zsh, respectively.
make: *** [_test] Error 1
[2018-07-12 01:47:21+0200] ./runtests choose
[2018-07-12 02:03:01+0200] t/porting/manifest ............................................. FAILED at test 9948
[2018-07-12 02:03:20+0200] t/porting/test_bootstrap ....................................... FAILED--non-zero wait status: 512
[2018-07-12 02:03:24+0200] Elapsed: 963 sec
[2018-07-12 02:03:24+0200] u=14.42  s=3.14  cu=577.08  cs=49.38  scripts=2543  tests=1164798
[2018-07-12 02:03:24+0200] makefile:788: recipe for target '_test' failed
[2018-07-12 02:03:24+0200] 
[2018-07-12 02:03:24+0200] Error while reading test-results: 2
[2018-07-12 02:03:24+0200] 
[2018-07-12 02:03:24+0200] Extending failures with harness:
[2018-07-12 02:03:24+0200] 	../t/porting/manifest.t ../t/porting/test_bootstrap.t
# Failed test 9948 - File t/porting/pending-author.t exists at ../t/porting/manifest.t line 57
Can't open porting/pending-author.t: No such file or directory at ../t/porting/test_bootstrap.t line 35, <$fh> chunk 5907.
[2018-07-12 02:03:28+0200] ../t/porting/manifest.t ........ 
[2018-07-12 02:03:28+0200] Failed 1/10519 subtests 
[2018-07-12 02:03:28+0200] ../t/porting/test_bootstrap.t .. 
[2018-07-12 02:03:28+0200] Dubious, test returned 2 (wstat 512, 0x200)
[2018-07-12 02:03:28+0200] All 473 subtests passed 

[2018-07-12 02:03:28+0200] Test Summary Report
[2018-07-12 02:03:28+0200] -------------------
[2018-07-12 02:03:28+0200] ../t/porting/manifest.t      (Wstat: 0 Tests: 10519 Failed: 1)
[2018-07-12 02:03:28+0200]   Failed test:  9948
[2018-07-12 02:03:28+0200] ../t/porting/test_bootstrap.t (Wstat: 512 Tests: 473 Failed: 0)
[2018-07-12 02:03:28+0200]   Non-zero exit status: 2
[2018-07-12 02:03:28+0200] Files=2, Tests=10992,  4 wallclock secs ( 0.50 usr  0.01 sys +  2.71 cusr  0.04 csys =  3.26 CPU)
[2018-07-12 02:03:28+0200] Result: FAIL
[2018-07-12 02:03:28+0200] 
[2018-07-12 02:03:28+0200]     ../t/porting/manifest.t.....................................FAILED
[2018-07-12 02:03:28+0200]         9948
[2018-07-12 02:03:28+0200]     ../t/porting/test_bootstrap.t...............................FAILED
[2018-07-12 02:03:28+0200]         Non-zero exit status: 2

[2018-07-12 02:03:28+0200] TSTENV = locale:nl_NL.utf8	
# Will use Digest::MD5
recv() is deprecated on :utf8 handles. This will be a fatal error in Perl 5.30 at (eval 12) line 28.
Subroutine Math::BigInt::carp redefined at t/option_l.t line 16.
# parser guessed wrong encoding expected 'CP1252' got 'UTF-8'
# Failed test 9948 - File t/porting/pending-author.t exists at porting/manifest.t line 57
Can't open porting/pending-author.t: No such file or directory at porting/test_bootstrap.t line 35, <$fh> chunk 5907.
Failed 2 tests out of 2542, 99.92% okay.
### Since not all tests were successful, you may want to run some of
### them individually and examine any diagnostic messages they produce.
### See the INSTALL document's section on "make test".
### You have a good chance to get more information by running
###   ./perl harness
### in the 't' directory since most (>=80%) of the tests succeeded.
### You may have to set your dynamic library search path,
### LD_LIBRARY_PATH, to point to the build directory:
###   setenv LD_LIBRARY_PATH `pwd`:$LD_LIBRARY_PATH; cd t; ./perl harness
###   LD_LIBRARY_PATH=`pwd`:$LD_LIBRARY_PATH; export LD_LIBRARY_PATH; cd t; ./perl harness
###   export LD_LIBRARY_PATH=`pwd`:$LD_LIBRARY_PATH; cd t; ./perl harness
### for csh-style shells, like tcsh; or for traditional/modern
### Bourne-style shells, like bash, ksh, and zsh, respectively.
make: *** [_test] Error 1
[2018-07-12 02:03:28+0200] ./runtests choose
[2018-07-12 02:20:00+0200] t/porting/manifest ............................................. FAILED at test 9948
[2018-07-12 02:20:19+0200] t/porting/test_bootstrap ....................................... FAILED--non-zero wait status: 512
[2018-07-12 02:20:24+0200] Elapsed: 1016 sec
[2018-07-12 02:20:24+0200] u=14.81  s=3.24  cu=587.18  cs=48.95  scripts=2542  tests=1164762
[2018-07-12 02:20:24+0200] makefile:788: recipe for target '_test' failed
[2018-07-12 02:20:24+0200] 
[2018-07-12 02:20:24+0200] Error while reading test-results: 2
[2018-07-12 02:20:24+0200] 
[2018-07-12 02:20:24+0200] Extending failures with harness:
[2018-07-12 02:20:24+0200] 	../t/porting/manifest.t ../t/porting/test_bootstrap.t
# Failed test 9948 - File t/porting/pending-author.t exists at ../t/porting/manifest.t line 57
Can't open porting/pending-author.t: No such file or directory at ../t/porting/test_bootstrap.t line 35, <$fh> chunk 5907.
[2018-07-12 02:20:27+0200] ../t/porting/manifest.t ........ 
[2018-07-12 02:20:27+0200] Failed 1/10519 subtests 
[2018-07-12 02:20:27+0200] ../t/porting/test_bootstrap.t .. 
[2018-07-12 02:20:27+0200] Dubious, test returned 2 (wstat 512, 0x200)
[2018-07-12 02:20:27+0200] All 473 subtests passed 

[2018-07-12 02:20:27+0200] Test Summary Report
[2018-07-12 02:20:27+0200] -------------------
[2018-07-12 02:20:27+0200] ../t/porting/manifest.t      (Wstat: 0 Tests: 10519 Failed: 1)
[2018-07-12 02:20:27+0200]   Failed test:  9948
[2018-07-12 02:20:27+0200] ../t/porting/test_bootstrap.t (Wstat: 512 Tests: 473 Failed: 0)
[2018-07-12 02:20:27+0200]   Non-zero exit status: 2
[2018-07-12 02:20:27+0200] Files=2, Tests=10992,  3 wallclock secs ( 0.50 usr  0.00 sys +  2.51 cusr  0.03 csys =  3.04 CPU)
[2018-07-12 02:20:27+0200] Result: FAIL
[2018-07-12 02:20:27+0200] 
[2018-07-12 02:20:27+0200]     ../t/porting/manifest.t.....................................FAILED
[2018-07-12 02:20:27+0200]         9948
[2018-07-12 02:20:27+0200]     ../t/porting/test_bootstrap.t...............................FAILED
[2018-07-12 02:20:27+0200]         Non-zero exit status: 2

[2018-07-12 02:20:27+0200] Unskip tests from '/home/abeltje/Test-Smoke/etc/blead.skiptests'
[2018-07-12 02:20:27+0200] 	t/porting/pending-author.t: ok
[2018-07-12 02:20:27+0200] Finished smoking a13f1de4e34633a275aa79d4e7874c2796bc0417 v5.29.0-87-ga13f1de blead
[2018-07-12 02:20:27+0200] Reading smokeresult from /home/abeltje/Test-Smoke/perl-current/mktest.out
[2018-07-12 02:20:27+0200] Processing [-Dcc='ccache gcc']
[2018-07-12 02:20:27+0200] Processing [-DDEBUGGING -Dcc='ccache gcc']
[2018-07-12 02:20:27+0200] Processing [-Dcc='ccache gcc' -Duseithreads]
[2018-07-12 02:20:27+0200] Processing [-DDEBUGGING -Dcc='ccache gcc' -Duseithreads]
[2018-07-12 02:20:27+0200] ==> Starting reporter
[2018-07-12 02:20:27+0200] Writing report to '/home/abeltje/Test-Smoke/perl-current/mktest.rpt'
-- 
Report generated by Test::Smoke::Gateway v0.09_01