Show report
Skipping synctree
[2018-01-11 22:05:06+0100] Reading build configurations from /pro/3gl/CPAN/smoke/p59.cfg
[2018-01-11 22:05:06+0100] Reading 'Policy.sh' from ../Policy.sh (v=1)
[2018-01-11 22:05:06+0100] Running test suite only with 'harness'.
[2018-01-11 22:05:06+0100] make distclean ...
[2018-01-11 22:05:06+0100] Smoking patch 018775a174982f890ed29ebb03f10cfd2d6edb6b v5.27.7-128-g018775a174
[2018-01-11 22:05:06+0100] Smoking branch blead
[2018-01-11 22:05:06+0100] 
[2018-01-11 22:05:06+0100] Configuration: -Dusedevel
[2018-01-11 22:05:06+0100] ------------------------------------------------------------------------------
[2018-01-11 22:05:06+0100] make distclean ...
[2018-01-11 22:05:06+0100] 
[2018-01-11 22:05:06+0100] Copy Policy.sh ...
[2018-01-11 22:05:06+0100] 
[2018-01-11 22:05:06+0100] Configure ...
5.27.8 <=> 5.026000
===== PROCURA Policy for linux/ccache cc ========================
[2018-01-11 22:06:02+0100] 
[2018-01-11 22:06:02+0100] make ...
locale.c:205:1: warning: ‘S_category_name’ defined but not used [-Wunused-function]
 S_category_name(const int category)
 ^
no docs for isSCRIPT_RUN
magic: PERL_MAGIC_qr already provided by misc
magic: PERL_MAGIC_qr already provided by misc
Warning (mostly harmless): No library found for -lposix
Warning (mostly harmless): No library found for -lcposix
Socket.xs: In function ‘XS_Socket_pack_sockaddr_un’:
Socket.xs:830:11: warning: format ‘%d’ expects argument of type ‘int’, but argument 2 has type ‘STRLEN’ [-Wformat=]
           " (%d) and will be truncated", len, sizeof(sun_ad.sun_path));
           ^
Socket.xs:830:11: warning: format ‘%d’ expects argument of type ‘int’, but argument 3 has type ‘long unsigned int’ [-Wformat=]
Making header files for XS...
Cannot open(/pro/3gl/CPAN/smoke/p59.skip): No such file or directory at /pro/3gl/CPAN/smoke/lib/Test/Smoke.pm line 194.
[2018-01-11 22:09:54+0100] 
[2018-01-11 22:09:54+0100]  Tests start here:
[2018-01-11 22:09:54+0100] TSTENV = stdio	
No saved state, selection will be empty
# parser guessed wrong encoding expected 'CP1252' got 'UTF-8'
[2018-01-11 22:14:05+0100] 
[2018-01-11 22:14:05+0100] All tests successful.
[2018-01-11 22:14:05+0100] Archived results...
[2018-01-11 22:14:05+0100] TSTENV = perlio	
# parser guessed wrong encoding expected 'CP1252' got 'UTF-8'
[2018-01-11 22:18:00+0100] 
[2018-01-11 22:18:00+0100] All tests successful.
[2018-01-11 22:18:00+0100] Archived results...
[2018-01-11 22:18:00+0100] TSTENV = locale:en_US.utf8	
Can't "goto" into a binary or list expression at op/goto.t line 859.
# Looks like you planned 121 tests but ran 120.
# parser guessed wrong encoding expected 'CP1252' got 'UTF-8'
recv() is deprecated on :utf8 handles. This will be a fatal error in Perl 5.30 at (eval 10) line 28.
make: *** [test_harness] Error 1

error while running harness target 'test_harness': 2 at /pro/3gl/CPAN/smoke/lib/Test/Smoke.pm line 194.
[2018-01-11 22:21:58+0100] 
[2018-01-11 22:21:58+0100] ../t/op/goto.t..............................................FAILED
[2018-01-11 22:21:58+0100]     Non-zero exit status: 255
[2018-01-11 22:21:58+0100] ../t/op/goto.t..............................................FAILED
[2018-01-11 22:21:58+0100]     Bad plan.  You planned 121 tests but ran 120.
[2018-01-11 22:21:58+0100] ../lib/B/Deparse.t..........................................PASSED
[2018-01-11 22:21:58+0100]     2
[2018-01-11 22:21:58+0100] Archived results...
Cannot open(/pro/3gl/CPAN/smoke/p59.skip): No such file or directory at /pro/3gl/CPAN/smoke/lib/Test/Smoke.pm line 194.
[2018-01-11 22:21:58+0100] 
[2018-01-11 22:21:58+0100] Configuration: -Dusedevel -DDEBUGGING
[2018-01-11 22:21:58+0100] ------------------------------------------------------------------------------
[2018-01-11 22:21:58+0100] make distclean ...
[2018-01-11 22:22:17+0100] 
[2018-01-11 22:22:17+0100] Copy Policy.sh ...
[2018-01-11 22:22:17+0100] 
[2018-01-11 22:22:17+0100] Configure ...
5.27.8 <=> 5.026000
===== PROCURA Policy for linux/ccache cc ========================
[2018-01-11 22:23:16+0100] 
[2018-01-11 22:23:16+0100] make ...
no docs for isSCRIPT_RUN
magic: PERL_MAGIC_qr already provided by misc
magic: PERL_MAGIC_qr already provided by misc
Warning (mostly harmless): No library found for -lposix
Warning (mostly harmless): No library found for -lcposix
Socket.xs: In function ‘XS_Socket_pack_sockaddr_un’:
Socket.xs:830:11: warning: format ‘%d’ expects argument of type ‘int’, but argument 2 has type ‘STRLEN’ [-Wformat=]
           " (%d) and will be truncated", len, sizeof(sun_ad.sun_path));
           ^
Socket.xs:830:11: warning: format ‘%d’ expects argument of type ‘int’, but argument 3 has type ‘long unsigned int’ [-Wformat=]
Making header files for XS...
Cannot open(/pro/3gl/CPAN/smoke/p59.skip): No such file or directory at /pro/3gl/CPAN/smoke/lib/Test/Smoke.pm line 194.
[2018-01-11 22:28:36+0100] 
[2018-01-11 22:28:36+0100]  Tests start here:
[2018-01-11 22:28:36+0100] TSTENV = stdio	
No saved state, selection will be empty
# parser guessed wrong encoding expected 'CP1252' got 'UTF-8'
[2018-01-11 22:33:34+0100] 
[2018-01-11 22:33:34+0100] All tests successful.
[2018-01-11 22:33:34+0100] Archived results...
[2018-01-11 22:33:34+0100] TSTENV = perlio	
# parser guessed wrong encoding expected 'CP1252' got 'UTF-8'
[2018-01-11 22:38:13+0100] 
[2018-01-11 22:38:13+0100] All tests successful.
[2018-01-11 22:38:13+0100] Archived results...
[2018-01-11 22:38:13+0100] TSTENV = locale:en_US.utf8	
Can't "goto" into a binary or list expression at op/goto.t line 859.
# Looks like you planned 121 tests but ran 120.
# parser guessed wrong encoding expected 'CP1252' got 'UTF-8'
recv() is deprecated on :utf8 handles. This will be a fatal error in Perl 5.30 at (eval 10) line 28.
make: *** [test_harness] Error 1

error while running harness target 'test_harness': 2 at /pro/3gl/CPAN/smoke/lib/Test/Smoke.pm line 194.
[2018-01-11 22:42:50+0100] 
[2018-01-11 22:42:50+0100] ../t/op/goto.t..............................................FAILED
[2018-01-11 22:42:50+0100]     Non-zero exit status: 255
[2018-01-11 22:42:50+0100] ../t/op/goto.t..............................................FAILED
[2018-01-11 22:42:50+0100]     Bad plan.  You planned 121 tests but ran 120.
[2018-01-11 22:42:50+0100] ../lib/B/Deparse.t..........................................PASSED
[2018-01-11 22:42:50+0100]     2
[2018-01-11 22:42:50+0100] Archived results...
Cannot open(/pro/3gl/CPAN/smoke/p59.skip): No such file or directory at /pro/3gl/CPAN/smoke/lib/Test/Smoke.pm line 194.
[2018-01-11 22:42:50+0100] 
[2018-01-11 22:42:50+0100] Configuration: -Dusedevel -Duse64bitall -Duselongdouble
[2018-01-11 22:42:50+0100] ------------------------------------------------------------------------------
[2018-01-11 22:42:50+0100] make distclean ...
[2018-01-11 22:43:13+0100] 
[2018-01-11 22:43:13+0100] Copy Policy.sh ...
[2018-01-11 22:43:13+0100] 
[2018-01-11 22:43:13+0100] Configure ...
5.27.8 <=> 5.026000
===== PROCURA Policy for linux/ccache cc ========================
[2018-01-11 22:44:08+0100] 
[2018-01-11 22:44:08+0100] make ...
locale.c:205:1: warning: ‘S_category_name’ defined but not used [-Wunused-function]
 S_category_name(const int category)
 ^
no docs for isSCRIPT_RUN
magic: PERL_MAGIC_qr already provided by misc
magic: PERL_MAGIC_qr already provided by misc
Warning (mostly harmless): No library found for -lposix
Warning (mostly harmless): No library found for -lcposix
Socket.xs: In function ‘XS_Socket_pack_sockaddr_un’:
Socket.xs:830:11: warning: format ‘%d’ expects argument of type ‘int’, but argument 2 has type ‘STRLEN’ [-Wformat=]
           " (%d) and will be truncated", len, sizeof(sun_ad.sun_path));
           ^
Socket.xs:830:11: warning: format ‘%d’ expects argument of type ‘int’, but argument 3 has type ‘long unsigned int’ [-Wformat=]
Making header files for XS...
Cannot open(/pro/3gl/CPAN/smoke/p59.skip): No such file or directory at /pro/3gl/CPAN/smoke/lib/Test/Smoke.pm line 194.
[2018-01-11 22:48:00+0100] 
[2018-01-11 22:48:00+0100]  Tests start here:
[2018-01-11 22:48:00+0100] TSTENV = stdio	
No saved state, selection will be empty
# parser guessed wrong encoding expected 'CP1252' got 'UTF-8'
[2018-01-11 22:52:12+0100] 
[2018-01-11 22:52:12+0100] All tests successful.
[2018-01-11 22:52:12+0100] Archived results...
[2018-01-11 22:52:12+0100] TSTENV = perlio	
# parser guessed wrong encoding expected 'CP1252' got 'UTF-8'
[2018-01-11 22:56:07+0100] 
[2018-01-11 22:56:07+0100] All tests successful.
[2018-01-11 22:56:07+0100] Archived results...
[2018-01-11 22:56:07+0100] TSTENV = locale:en_US.utf8	
Can't "goto" into a binary or list expression at op/goto.t line 859.
# Looks like you planned 121 tests but ran 120.
# parser guessed wrong encoding expected 'CP1252' got 'UTF-8'
recv() is deprecated on :utf8 handles. This will be a fatal error in Perl 5.30 at (eval 10) line 28.
make: *** [test_harness] Error 1

error while running harness target 'test_harness': 2 at /pro/3gl/CPAN/smoke/lib/Test/Smoke.pm line 194.
[2018-01-11 23:00:06+0100] 
[2018-01-11 23:00:06+0100] ../t/op/goto.t..............................................FAILED
[2018-01-11 23:00:06+0100]     Non-zero exit status: 255
[2018-01-11 23:00:06+0100] ../t/op/goto.t..............................................FAILED
[2018-01-11 23:00:06+0100]     Bad plan.  You planned 121 tests but ran 120.
[2018-01-11 23:00:06+0100] ../lib/B/Deparse.t..........................................PASSED
[2018-01-11 23:00:06+0100]     2
[2018-01-11 23:00:06+0100] Archived results...
Cannot open(/pro/3gl/CPAN/smoke/p59.skip): No such file or directory at /pro/3gl/CPAN/smoke/lib/Test/Smoke.pm line 194.
[2018-01-11 23:00:06+0100] 
[2018-01-11 23:00:06+0100] Configuration: -Dusedevel -Duse64bitall -Duselongdouble -DDEBUGGING
[2018-01-11 23:00:06+0100] ------------------------------------------------------------------------------
[2018-01-11 23:00:06+0100] make distclean ...
[2018-01-11 23:00:25+0100] 
[2018-01-11 23:00:25+0100] Copy Policy.sh ...
[2018-01-11 23:00:25+0100] 
[2018-01-11 23:00:25+0100] Configure ...
5.27.8 <=> 5.026000
===== PROCURA Policy for linux/ccache cc ========================
[2018-01-11 23:01:21+0100] 
[2018-01-11 23:01:21+0100] make ...
no docs for isSCRIPT_RUN
magic: PERL_MAGIC_qr already provided by misc
magic: PERL_MAGIC_qr already provided by misc
Warning (mostly harmless): No library found for -lposix
Warning (mostly harmless): No library found for -lcposix
Socket.xs: In function ‘XS_Socket_pack_sockaddr_un’:
Socket.xs:830:11: warning: format ‘%d’ expects argument of type ‘int’, but argument 2 has type ‘STRLEN’ [-Wformat=]
           " (%d) and will be truncated", len, sizeof(sun_ad.sun_path));
           ^
Socket.xs:830:11: warning: format ‘%d’ expects argument of type ‘int’, but argument 3 has type ‘long unsigned int’ [-Wformat=]
Making header files for XS...
Cannot open(/pro/3gl/CPAN/smoke/p59.skip): No such file or directory at /pro/3gl/CPAN/smoke/lib/Test/Smoke.pm line 194.
[2018-01-11 23:06:43+0100] 
[2018-01-11 23:06:43+0100]  Tests start here:
[2018-01-11 23:06:43+0100] TSTENV = stdio	
No saved state, selection will be empty
# parser guessed wrong encoding expected 'CP1252' got 'UTF-8'
[2018-01-11 23:11:42+0100] 
[2018-01-11 23:11:42+0100] All tests successful.
[2018-01-11 23:11:42+0100] Archived results...
[2018-01-11 23:11:42+0100] TSTENV = perlio	
# parser guessed wrong encoding expected 'CP1252' got 'UTF-8'
[2018-01-11 23:16:20+0100] 
[2018-01-11 23:16:20+0100] All tests successful.
[2018-01-11 23:16:20+0100] Archived results...
[2018-01-11 23:16:20+0100] TSTENV = locale:en_US.utf8	
Can't "goto" into a binary or list expression at op/goto.t line 859.
# Looks like you planned 121 tests but ran 120.
# parser guessed wrong encoding expected 'CP1252' got 'UTF-8'
recv() is deprecated on :utf8 handles. This will be a fatal error in Perl 5.30 at (eval 10) line 28.
make: *** [test_harness] Error 1

error while running harness target 'test_harness': 2 at /pro/3gl/CPAN/smoke/lib/Test/Smoke.pm line 194.
[2018-01-11 23:21:01+0100] 
[2018-01-11 23:21:01+0100] ../t/op/goto.t..............................................FAILED
[2018-01-11 23:21:01+0100]     Non-zero exit status: 255
[2018-01-11 23:21:01+0100] ../t/op/goto.t..............................................FAILED
[2018-01-11 23:21:01+0100]     Bad plan.  You planned 121 tests but ran 120.
[2018-01-11 23:21:01+0100] ../lib/B/Deparse.t..........................................PASSED
[2018-01-11 23:21:01+0100]     2
[2018-01-11 23:21:01+0100] Archived results...
Cannot open(/pro/3gl/CPAN/smoke/p59.skip): No such file or directory at /pro/3gl/CPAN/smoke/lib/Test/Smoke.pm line 194.
[2018-01-11 23:21:01+0100] 
[2018-01-11 23:21:01+0100] Configuration: -Dusedevel -Duseithreads
[2018-01-11 23:21:01+0100] ------------------------------------------------------------------------------
[2018-01-11 23:21:01+0100] make distclean ...
[2018-01-11 23:21:24+0100] 
[2018-01-11 23:21:24+0100] Copy Policy.sh ...
[2018-01-11 23:21:24+0100] 
[2018-01-11 23:21:24+0100] Configure ...
5.27.8 <=> 5.026000
===== PROCURA Policy for linux/ccache cc ========================
[2018-01-11 23:22:26+0100] 
[2018-01-11 23:22:26+0100] make ...
locale.c:205:1: warning: ‘S_category_name’ defined but not used [-Wunused-function]
 S_category_name(const int category)
 ^
no docs for isSCRIPT_RUN
magic: PERL_MAGIC_qr already provided by misc
magic: PERL_MAGIC_qr already provided by misc
Warning (mostly harmless): No library found for -lposix
Warning (mostly harmless): No library found for -lcposix
Socket.xs: In function ‘XS_Socket_pack_sockaddr_un’:
Socket.xs:830:11: warning: format ‘%d’ expects argument of type ‘int’, but argument 2 has type ‘STRLEN’ [-Wformat=]
           " (%d) and will be truncated", len, sizeof(sun_ad.sun_path));
           ^
Socket.xs:830:11: warning: format ‘%d’ expects argument of type ‘int’, but argument 3 has type ‘long unsigned int’ [-Wformat=]
Making header files for XS...
Cannot open(/pro/3gl/CPAN/smoke/p59.skip): No such file or directory at /pro/3gl/CPAN/smoke/lib/Test/Smoke.pm line 194.
[2018-01-11 23:26:26+0100] 
[2018-01-11 23:26:26+0100]  Tests start here:
[2018-01-11 23:26:26+0100] TSTENV = stdio	
No saved state, selection will be empty
# parser guessed wrong encoding expected 'CP1252' got 'UTF-8'
[2018-01-11 23:31:12+0100] 
[2018-01-11 23:31:12+0100] All tests successful.
[2018-01-11 23:31:12+0100] Archived results...
[2018-01-11 23:31:12+0100] TSTENV = perlio	
# parser guessed wrong encoding expected 'CP1252' got 'UTF-8'
[2018-01-11 23:35:39+0100] 
[2018-01-11 23:35:39+0100] All tests successful.
[2018-01-11 23:35:39+0100] Archived results...
[2018-01-11 23:35:39+0100] TSTENV = locale:en_US.utf8	
Can't "goto" into a binary or list expression at op/goto.t line 859.
# Looks like you planned 121 tests but ran 120.
# parser guessed wrong encoding expected 'CP1252' got 'UTF-8'
recv() is deprecated on :utf8 handles. This will be a fatal error in Perl 5.30 at (eval 10) line 28.
make: *** [test_harness] Error 1

error while running harness target 'test_harness': 2 at /pro/3gl/CPAN/smoke/lib/Test/Smoke.pm line 194.
[2018-01-11 23:40:08+0100] 
[2018-01-11 23:40:08+0100] ../t/op/goto.t..............................................FAILED
[2018-01-11 23:40:08+0100]     Non-zero exit status: 255
[2018-01-11 23:40:08+0100] ../t/op/goto.t..............................................FAILED
[2018-01-11 23:40:08+0100]     Bad plan.  You planned 121 tests but ran 120.
[2018-01-11 23:40:08+0100] ../lib/B/Deparse.t..........................................PASSED
[2018-01-11 23:40:08+0100]     2
[2018-01-11 23:40:08+0100] Archived results...
Cannot open(/pro/3gl/CPAN/smoke/p59.skip): No such file or directory at /pro/3gl/CPAN/smoke/lib/Test/Smoke.pm line 194.
[2018-01-11 23:40:08+0100] 
[2018-01-11 23:40:08+0100] Configuration: -Dusedevel -Duseithreads -DDEBUGGING
[2018-01-11 23:40:08+0100] ------------------------------------------------------------------------------
[2018-01-11 23:40:08+0100] make distclean ...
[2018-01-11 23:40:28+0100] 
[2018-01-11 23:40:28+0100] Copy Policy.sh ...
[2018-01-11 23:40:28+0100] 
[2018-01-11 23:40:28+0100] Configure ...
5.27.8 <=> 5.026000
===== PROCURA Policy for linux/ccache cc ========================
[2018-01-11 23:41:33+0100] 
[2018-01-11 23:41:33+0100] make ...
no docs for isSCRIPT_RUN
magic: PERL_MAGIC_qr already provided by misc
magic: PERL_MAGIC_qr already provided by misc
Warning (mostly harmless): No library found for -lposix
Warning (mostly harmless): No library found for -lcposix
Socket.xs: In function ‘XS_Socket_pack_sockaddr_un’:
Socket.xs:830:11: warning: format ‘%d’ expects argument of type ‘int’, but argument 2 has type ‘STRLEN’ [-Wformat=]
           " (%d) and will be truncated", len, sizeof(sun_ad.sun_path));
           ^
Socket.xs:830:11: warning: format ‘%d’ expects argument of type ‘int’, but argument 3 has type ‘long unsigned int’ [-Wformat=]
Making header files for XS...
Cannot open(/pro/3gl/CPAN/smoke/p59.skip): No such file or directory at /pro/3gl/CPAN/smoke/lib/Test/Smoke.pm line 194.
[2018-01-11 23:47:15+0100] 
[2018-01-11 23:47:15+0100]  Tests start here:
[2018-01-11 23:47:15+0100] TSTENV = stdio	
No saved state, selection will be empty
# parser guessed wrong encoding expected 'CP1252' got 'UTF-8'
[2018-01-11 23:52:57+0100] 
[2018-01-11 23:52:57+0100] All tests successful.
[2018-01-11 23:52:57+0100] Archived results...
[2018-01-11 23:52:57+0100] TSTENV = perlio	
# parser guessed wrong encoding expected 'CP1252' got 'UTF-8'
[2018-01-11 23:58:15+0100] 
[2018-01-11 23:58:15+0100] All tests successful.
[2018-01-11 23:58:15+0100] Archived results...
[2018-01-11 23:58:15+0100] TSTENV = locale:en_US.utf8	
Can't "goto" into a binary or list expression at op/goto.t line 859.
# Looks like you planned 121 tests but ran 120.
# parser guessed wrong encoding expected 'CP1252' got 'UTF-8'
recv() is deprecated on :utf8 handles. This will be a fatal error in Perl 5.30 at (eval 10) line 28.
make: *** [test_harness] Error 1

error while running harness target 'test_harness': 2 at /pro/3gl/CPAN/smoke/lib/Test/Smoke.pm line 194.
[2018-01-12 00:03:38+0100] 
[2018-01-12 00:03:38+0100] ../t/op/goto.t..............................................FAILED
[2018-01-12 00:03:38+0100]     Non-zero exit status: 255
[2018-01-12 00:03:38+0100] ../t/op/goto.t..............................................FAILED
[2018-01-12 00:03:38+0100]     Bad plan.  You planned 121 tests but ran 120.
[2018-01-12 00:03:38+0100] ../lib/B/Deparse.t..........................................PASSED
[2018-01-12 00:03:38+0100]     2
[2018-01-12 00:03:38+0100] Archived results...
Cannot open(/pro/3gl/CPAN/smoke/p59.skip): No such file or directory at /pro/3gl/CPAN/smoke/lib/Test/Smoke.pm line 194.
[2018-01-12 00:03:38+0100] 
[2018-01-12 00:03:38+0100] Configuration: -Dusedevel -Duseithreads -Duse64bitall -Duselongdouble
[2018-01-12 00:03:38+0100] ------------------------------------------------------------------------------
[2018-01-12 00:03:38+0100] make distclean ...
[2018-01-12 00:04:03+0100] 
[2018-01-12 00:04:03+0100] Copy Policy.sh ...
[2018-01-12 00:04:03+0100] 
[2018-01-12 00:04:03+0100] Configure ...
5.27.8 <=> 5.026000
===== PROCURA Policy for linux/ccache cc ========================
[2018-01-12 00:05:03+0100] 
[2018-01-12 00:05:03+0100] make ...
locale.c:205:1: warning: ‘S_category_name’ defined but not used [-Wunused-function]
 S_category_name(const int category)
 ^
no docs for isSCRIPT_RUN
magic: PERL_MAGIC_qr already provided by misc
magic: PERL_MAGIC_qr already provided by misc
Warning (mostly harmless): No library found for -lposix
Warning (mostly harmless): No library found for -lcposix
Socket.xs: In function ‘XS_Socket_pack_sockaddr_un’:
Socket.xs:830:11: warning: format ‘%d’ expects argument of type ‘int’, but argument 2 has type ‘STRLEN’ [-Wformat=]
           " (%d) and will be truncated", len, sizeof(sun_ad.sun_path));
           ^
Socket.xs:830:11: warning: format ‘%d’ expects argument of type ‘int’, but argument 3 has type ‘long unsigned int’ [-Wformat=]
Making header files for XS...
Cannot open(/pro/3gl/CPAN/smoke/p59.skip): No such file or directory at /pro/3gl/CPAN/smoke/lib/Test/Smoke.pm line 194.
[2018-01-12 00:09:08+0100] 
[2018-01-12 00:09:08+0100]  Tests start here:
[2018-01-12 00:09:08+0100] TSTENV = stdio	
No saved state, selection will be empty
# parser guessed wrong encoding expected 'CP1252' got 'UTF-8'
[2018-01-12 00:13:55+0100] 
[2018-01-12 00:13:55+0100] All tests successful.
[2018-01-12 00:13:55+0100] Archived results...
[2018-01-12 00:13:55+0100] TSTENV = perlio	
# parser guessed wrong encoding expected 'CP1252' got 'UTF-8'
[2018-01-12 00:18:24+0100] 
[2018-01-12 00:18:24+0100] All tests successful.
[2018-01-12 00:18:24+0100] Archived results...
[2018-01-12 00:18:24+0100] TSTENV = locale:en_US.utf8	
Can't "goto" into a binary or list expression at op/goto.t line 859.
# Looks like you planned 121 tests but ran 120.
# parser guessed wrong encoding expected 'CP1252' got 'UTF-8'
recv() is deprecated on :utf8 handles. This will be a fatal error in Perl 5.30 at (eval 10) line 28.
make: *** [test_harness] Error 1

error while running harness target 'test_harness': 2 at /pro/3gl/CPAN/smoke/lib/Test/Smoke.pm line 194.
[2018-01-12 00:22:52+0100] 
[2018-01-12 00:22:52+0100] ../t/op/goto.t..............................................FAILED
[2018-01-12 00:22:52+0100]     Non-zero exit status: 255
[2018-01-12 00:22:52+0100] ../t/op/goto.t..............................................FAILED
[2018-01-12 00:22:52+0100]     Bad plan.  You planned 121 tests but ran 120.
[2018-01-12 00:22:52+0100] ../lib/B/Deparse.t..........................................PASSED
[2018-01-12 00:22:52+0100]     2
[2018-01-12 00:22:52+0100] Archived results...
Cannot open(/pro/3gl/CPAN/smoke/p59.skip): No such file or directory at /pro/3gl/CPAN/smoke/lib/Test/Smoke.pm line 194.
[2018-01-12 00:22:52+0100] 
[2018-01-12 00:22:52+0100] Configuration: -Dusedevel -Duseithreads -Duse64bitall -Duselongdouble -DDEBUGGING
[2018-01-12 00:22:52+0100] ------------------------------------------------------------------------------
[2018-01-12 00:22:52+0100] make distclean ...
[2018-01-12 00:23:13+0100] 
[2018-01-12 00:23:13+0100] Copy Policy.sh ...
[2018-01-12 00:23:13+0100] 
[2018-01-12 00:23:13+0100] Configure ...
5.27.8 <=> 5.026000
===== PROCURA Policy for linux/ccache cc ========================
[2018-01-12 00:24:14+0100] 
[2018-01-12 00:24:14+0100] make ...
no docs for isSCRIPT_RUN
magic: PERL_MAGIC_qr already provided by misc
magic: PERL_MAGIC_qr already provided by misc
Warning (mostly harmless): No library found for -lposix
Warning (mostly harmless): No library found for -lcposix
Socket.xs: In function ‘XS_Socket_pack_sockaddr_un’:
Socket.xs:830:11: warning: format ‘%d’ expects argument of type ‘int’, but argument 2 has type ‘STRLEN’ [-Wformat=]
           " (%d) and will be truncated", len, sizeof(sun_ad.sun_path));
           ^
Socket.xs:830:11: warning: format ‘%d’ expects argument of type ‘int’, but argument 3 has type ‘long unsigned int’ [-Wformat=]
Making header files for XS...
Cannot open(/pro/3gl/CPAN/smoke/p59.skip): No such file or directory at /pro/3gl/CPAN/smoke/lib/Test/Smoke.pm line 194.
[2018-01-12 00:29:58+0100] 
[2018-01-12 00:29:58+0100]  Tests start here:
[2018-01-12 00:29:58+0100] TSTENV = stdio	
No saved state, selection will be empty
# parser guessed wrong encoding expected 'CP1252' got 'UTF-8'
[2018-01-12 00:35:44+0100] 
[2018-01-12 00:35:44+0100] All tests successful.
[2018-01-12 00:35:44+0100] Archived results...
[2018-01-12 00:35:44+0100] TSTENV = perlio	
# parser guessed wrong encoding expected 'CP1252' got 'UTF-8'
[2018-01-12 00:41:09+0100] 
[2018-01-12 00:41:09+0100] All tests successful.
[2018-01-12 00:41:09+0100] Archived results...
[2018-01-12 00:41:09+0100] TSTENV = locale:en_US.utf8	
Can't "goto" into a binary or list expression at op/goto.t line 859.
# Looks like you planned 121 tests but ran 120.
# parser guessed wrong encoding expected 'CP1252' got 'UTF-8'
recv() is deprecated on :utf8 handles. This will be a fatal error in Perl 5.30 at (eval 10) line 28.
make: *** [test_harness] Error 1

error while running harness target 'test_harness': 2 at /pro/3gl/CPAN/smoke/lib/Test/Smoke.pm line 194.
[2018-01-12 00:46:32+0100] 
[2018-01-12 00:46:32+0100] ../t/op/goto.t..............................................FAILED
[2018-01-12 00:46:32+0100]     Non-zero exit status: 255
[2018-01-12 00:46:32+0100] ../t/op/goto.t..............................................FAILED
[2018-01-12 00:46:32+0100]     Bad plan.  You planned 121 tests but ran 120.
[2018-01-12 00:46:32+0100] ../lib/B/Deparse.t..........................................PASSED
[2018-01-12 00:46:32+0100]     2
[2018-01-12 00:46:32+0100] Archived results...
Cannot open(/pro/3gl/CPAN/smoke/p59.skip): No such file or directory at /pro/3gl/CPAN/smoke/lib/Test/Smoke.pm line 194.
[2018-01-12 00:46:32+0100] Finished smoking 018775a174982f890ed29ebb03f10cfd2d6edb6b v5.27.7-128-g018775a174 blead
[2018-01-12 00:46:32+0100] Reading smokeresult from /pro/3gl/CPAN/perl-current/mktest.out
[2018-01-12 00:46:32+0100] Processing []
[2018-01-12 00:46:32+0100] Processing [-DDEBUGGING]
[2018-01-12 00:46:32+0100] Processing [-Duse64bitall -Duselongdouble]
[2018-01-12 00:46:32+0100] Processing [-DDEBUGGING -Duse64bitall -Duselongdouble]
[2018-01-12 00:46:32+0100] Processing [-Duseithreads]
[2018-01-12 00:46:32+0100] Processing [-DDEBUGGING -Duseithreads]
[2018-01-12 00:46:32+0100] Processing [-Duseithreads -Duse64bitall -Duselongdouble]
[2018-01-12 00:46:32+0100] Processing [-DDEBUGGING -Duseithreads -Duse64bitall -Duselongdouble]
[2018-01-12 00:46:32+0100] Writing report to '/pro/3gl/CPAN/perl-current/mktest.rpt'
[2018-01-12 00:46:32+0100] Locally applied patches from '/pro/3gl/CPAN/perl-current/patchlevel.h'
[2018-01-12 00:46:32+0100] Patches: 'uncommitted-changes;SMOKE018775a174982f890ed29ebb03f10cfd2d6edb6b'
[2018-01-12 00:46:32+0100] Looking for cc messages: 'gcc'
-- 
Report generated by Test::Smoke::Gateway v0.09