Show report
[2020-07-30 08:11:57-0400] ==> Starting synctree
[2020-07-30 08:11:57-0400] qx[/usr/local/bin/git clone file:///home/core/smoke/git /home/core/smoke/git-perl 2>&1]
[2020-07-30 08:14:15-0400] qx[/usr/local/bin/git remote update --prune 2>&1]
[2020-07-30 08:14:15-0400] qx[/usr/local/bin/git checkout smoke-me/jkeenan/dire-wolf
[2020-07-30 08:14:15-0400]  2>&1]
Already on 'smoke-me/jkeenan/dire-wolf'
[2020-07-30 08:14:15-0400] qx[/usr/local/bin/git reset --hard origin/smoke-me/jkeenan/dire-wolf
[2020-07-30 08:14:15-0400]  2>&1]
[2020-07-30 08:14:16-0400] qx[/usr/local/bin/git clone /home/core/smoke/git-perl /home/core/smoke/perl-current 2>&1]
[2020-07-30 08:14:21-0400] qx[/usr/local/bin/git clean -dfx 2>&1]
[2020-07-30 08:14:21-0400] qx[/usr/local/bin/git fetch origin 2>&1]
[2020-07-30 08:14:21-0400] qx[/usr/local/bin/git checkout smoke-me/jkeenan/dire-wolf
[2020-07-30 08:14:21-0400]  2>&1]
Already on 'smoke-me/jkeenan/dire-wolf'
[2020-07-30 08:14:21-0400] qx[/usr/local/bin/git reset --hard origin/smoke-me/jkeenan/dire-wolf
[2020-07-30 08:14:21-0400]  2>&1]
[2020-07-30 08:14:21-0400] qx[/home/core/bin/perl-5.26.1/bin/perl5.26.1 Porting/make_dot_patch.pl > .patch]
[2020-07-30 08:14:21-0400] /home/core/smoke/perl-current is now up to patchlevel bd88bd2a72478af4411aa8a4868c294e649d0e00
[2020-07-30 08:14:21-0400] ==> Starting runsmoke
[2020-07-30 08:14:21-0400] [./tssmokeperl.pl] chdir(/home/core/smoke/perl-current)
[2020-07-30 08:14:21-0400] qx[/home/core/bin/perl-5.26.1/bin/perl5.26.1 -e "require q[/home/core/smoke/perl-current/cpan/Test-Harness/lib/Test/Harness.pm];print Test::Harness->VERSION" 2>&1]
[2020-07-30 08:14:21-0400] Found: Test::Harness version 3.42.
[2020-07-30 08:14:21-0400] Reading build configurations from /home/core/smoke/TestSmoke/perlcurrent.cfg
[2020-07-30 08:14:21-0400] Reading 'Policy.sh' from default content (v=1)
[2020-07-30 08:14:21-0400] Running smoke tests without $ENV{PERLIO}
[2020-07-30 08:14:21-0400] Running test suite only with 'harness'
[2020-07-30 08:14:21-0400] make distclean ...
[2020-07-30 08:14:21-0400] Smoking patch bd88bd2a72478af4411aa8a4868c294e649d0e00 v5.32.0-64-gbd88bd2a72
[2020-07-30 08:14:21-0400] Smoking branch smoke-me/jkeenan/dire-wolf
[2020-07-30 08:14:22-0400] Locally applied patches from '/home/core/smoke/perl-current/patchlevel.h'
[2020-07-30 08:14:22-0400] Patches: 'uncommitted-changes'
[2020-07-30 08:14:22-0400] Adding 'SMOKEbd88bd2a72478af4411aa8a4868c294e649d0e00' to the registered patches.
[2020-07-30 08:14:22-0400] 
[2020-07-30 08:14:22-0400] Configuration: -Dusedevel -Dcc=gcc
[2020-07-30 08:14:22-0400] ------------------------------------------------------------------------------
[2020-07-30 08:14:22-0400] make distclean ...
[2020-07-30 08:14:22-0400] 
[2020-07-30 08:14:22-0400] Copy Policy.sh ...
[2020-07-30 08:14:22-0400] 
[2020-07-30 08:14:22-0400] Configure ...
[2020-07-30 08:15:36-0400] 
[2020-07-30 08:15:36-0400] make ...
In file included from sv.c:32:
sv.c: In function 'Perl_sv_vcatpvfn_flags':
config.h:909:39: warning: '%.*g' directive writing between 1 and 133 bytes into a region of size 127 [-Wformat-overflow=]
 #define Gconvert(x,n,t,b) sprintf((b),"%.*g",(n),(x))
                                       ^~~~~~
perl.h:6834:13: note: in definition of macro 'WITH_LC_NUMERIC_SET_TO_NEEDED_IN'
             block;                                                          \
             ^~~~~
sv.c:48:5: note: in expansion of macro 'PERL_UNUSED_RESULT'
     PERL_UNUSED_RESULT(Gconvert((NV)(nv), (int)ndig, 0, buffer))
     ^~~~~~~~~~~~~~~~~~
sv.c:48:24: note: in expansion of macro 'Gconvert'
     PERL_UNUSED_RESULT(Gconvert((NV)(nv), (int)ndig, 0, buffer))
                        ^~~~~~~~
sv.c:13128:21: note: in expansion of macro 'SNPRINTF_G'
                     SNPRINTF_G(fv, ebuf, sizeof(ebuf), precis)
                     ^~~~~~~~~~
config.h:909:39: note: assuming directive output of 132 bytes
 #define Gconvert(x,n,t,b) sprintf((b),"%.*g",(n),(x))
                                       ^~~~~~
perl.h:6834:13: note: in definition of macro 'WITH_LC_NUMERIC_SET_TO_NEEDED_IN'
             block;                                                          \
             ^~~~~
sv.c:48:5: note: in expansion of macro 'PERL_UNUSED_RESULT'
     PERL_UNUSED_RESULT(Gconvert((NV)(nv), (int)ndig, 0, buffer))
     ^~~~~~~~~~~~~~~~~~
sv.c:48:24: note: in expansion of macro 'Gconvert'
     PERL_UNUSED_RESULT(Gconvert((NV)(nv), (int)ndig, 0, buffer))
                        ^~~~~~~~
sv.c:13128:21: note: in expansion of macro 'SNPRINTF_G'
                     SNPRINTF_G(fv, ebuf, sizeof(ebuf), precis)
                     ^~~~~~~~~~
config.h:909:27: note: 'sprintf' output between 2 and 134 bytes into a destination of size 127
 #define Gconvert(x,n,t,b) sprintf((b),"%.*g",(n),(x))
perl.h:6834:13: note: in definition of macro 'WITH_LC_NUMERIC_SET_TO_NEEDED_IN'
             block;                                                          \
             ^~~~~
sv.c:48:5: note: in expansion of macro 'PERL_UNUSED_RESULT'
     PERL_UNUSED_RESULT(Gconvert((NV)(nv), (int)ndig, 0, buffer))
     ^~~~~~~~~~~~~~~~~~
sv.c:48:24: note: in expansion of macro 'Gconvert'
     PERL_UNUSED_RESULT(Gconvert((NV)(nv), (int)ndig, 0, buffer))
                        ^~~~~~~~
sv.c:13128:21: note: in expansion of macro 'SNPRINTF_G'
                     SNPRINTF_G(fv, ebuf, sizeof(ebuf), precis)
                     ^~~~~~~~~~
config.h:909:39: warning: '%.*g' directive writing between 1 and 133 bytes into a region of size 127 [-Wformat-overflow=]
 #define Gconvert(x,n,t,b) sprintf((b),"%.*g",(n),(x))
                                       ^~~~~~
perl.h:6834:13: note: in definition of macro 'WITH_LC_NUMERIC_SET_TO_NEEDED_IN'
             block;                                                          \
             ^~~~~
sv.c:48:5: note: in expansion of macro 'PERL_UNUSED_RESULT'
     PERL_UNUSED_RESULT(Gconvert((NV)(nv), (int)ndig, 0, buffer))
     ^~~~~~~~~~~~~~~~~~
sv.c:48:24: note: in expansion of macro 'Gconvert'
     PERL_UNUSED_RESULT(Gconvert((NV)(nv), (int)ndig, 0, buffer))
                        ^~~~~~~~
sv.c:13128:21: note: in expansion of macro 'SNPRINTF_G'
                     SNPRINTF_G(fv, ebuf, sizeof(ebuf), precis)
                     ^~~~~~~~~~
config.h:909:39: note: assuming directive output of 132 bytes
 #define Gconvert(x,n,t,b) sprintf((b),"%.*g",(n),(x))
                                       ^~~~~~
perl.h:6834:13: note: in definition of macro 'WITH_LC_NUMERIC_SET_TO_NEEDED_IN'
             block;                                                          \
             ^~~~~
sv.c:48:5: note: in expansion of macro 'PERL_UNUSED_RESULT'
     PERL_UNUSED_RESULT(Gconvert((NV)(nv), (int)ndig, 0, buffer))
     ^~~~~~~~~~~~~~~~~~
sv.c:48:24: note: in expansion of macro 'Gconvert'
     PERL_UNUSED_RESULT(Gconvert((NV)(nv), (int)ndig, 0, buffer))
                        ^~~~~~~~
sv.c:13128:21: note: in expansion of macro 'SNPRINTF_G'
                     SNPRINTF_G(fv, ebuf, sizeof(ebuf), precis)
                     ^~~~~~~~~~
config.h:909:27: note: 'sprintf' output between 2 and 134 bytes into a destination of size 127
 #define Gconvert(x,n,t,b) sprintf((b),"%.*g",(n),(x))
perl.h:6834:13: note: in definition of macro 'WITH_LC_NUMERIC_SET_TO_NEEDED_IN'
             block;                                                          \
             ^~~~~
sv.c:48:5: note: in expansion of macro 'PERL_UNUSED_RESULT'
     PERL_UNUSED_RESULT(Gconvert((NV)(nv), (int)ndig, 0, buffer))
     ^~~~~~~~~~~~~~~~~~
sv.c:48:24: note: in expansion of macro 'Gconvert'
     PERL_UNUSED_RESULT(Gconvert((NV)(nv), (int)ndig, 0, buffer))
                        ^~~~~~~~
sv.c:13128:21: note: in expansion of macro 'SNPRINTF_G'
                     SNPRINTF_G(fv, ebuf, sizeof(ebuf), precis)
                     ^~~~~~~~~~
Warning (mostly harmless): No library found for -ldb
DB_File.xs: In function 'ParseOpenInfo':
DB_File.xs:476:44: warning: suggest braces around empty body in an 'if' statement [-Wempty-body]
         if (RETVAL->dbp) err_close(RETVAL) ;                           \
                                            ^
DB_File.xs:1044:13: note: in expansion of macro 'croak_and_free'
             croak_and_free("type parameter is not a reference") ;
             ^~~~~~~~~~~~~~
DB_File.xs:476:44: warning: suggest braces around empty body in an 'if' statement [-Wempty-body]
         if (RETVAL->dbp) err_close(RETVAL) ;                           \
                                            ^
DB_File.xs:1050:13: note: in expansion of macro 'croak_and_free'
             croak_and_free("internal error") ;
             ^~~~~~~~~~~~~~
DB_File.xs:476:44: warning: suggest braces around empty body in an 'if' statement [-Wempty-body]
         if (RETVAL->dbp) err_close(RETVAL) ;                           \
                                            ^
DB_File.xs:1056:17: note: in expansion of macro 'croak_and_free'
                 croak_and_free("DB_File can only tie an associative array to a DB_HASH database") ;
                 ^~~~~~~~~~~~~~
DB_File.xs:476:44: warning: suggest braces around empty body in an 'if' statement [-Wempty-body]
         if (RETVAL->dbp) err_close(RETVAL) ;                           \
                                            ^
DB_File.xs:1091:17: note: in expansion of macro 'croak_and_free'
                 croak_and_free("DB_File can only tie an associative array to a DB_BTREE database");
                 ^~~~~~~~~~~~~~
DB_File.xs:476:44: warning: suggest braces around empty body in an 'if' statement [-Wempty-body]
         if (RETVAL->dbp) err_close(RETVAL) ;                           \
                                            ^
DB_File.xs:1140:17: note: in expansion of macro 'croak_and_free'
                 croak_and_free("DB_File can only tie an array to a DB_RECNO database");
                 ^~~~~~~~~~~~~~
DB_File.xs:476:44: warning: suggest braces around empty body in an 'if' statement [-Wempty-body]
         if (RETVAL->dbp) err_close(RETVAL) ;                           \
                                            ^
DB_File.xs:1229:13: note: in expansion of macro 'croak_and_free'
             croak_and_free("type is not of type DB_File::HASHINFO, DB_File::BTREEINFO or DB_File::RECNOINFO");
             ^~~~~~~~~~~~~~
Warning (mostly harmless): No library found for -lndbm
Warning (mostly harmless): No library found for -ldbm
Warning (mostly harmless): No library found for -lucb
Warning (mostly harmless): No library found for -lposix
Warning (mostly harmless): No library found for -lcposix
Socket.c: In function 'XS_Socket_pack_ip_mreq_source':
Socket.c:1673:7: warning: variable 'interface' set but not used [-Wunused-but-set-variable]
  SV * interface;
       ^~~~~~~~~
Making header files for XS...
In file included from APItest.xs:10:
APItest.c: In function 'XS_XS__APItest__Magic_test_Gconvert':
../../config.h:909:39: warning: '%.*g' directive writing between 1 and 106 bytes into a region of size 100 [-Wformat-overflow=]
 #define Gconvert(x,n,t,b) sprintf((b),"%.*g",(n),(x))
                                       ^~~~~~
../../perl.h:496:67: note: in definition of macro 'PERL_UNUSED_RESULT'
 #    define PERL_UNUSED_RESULT(v) STMT_START { __typeof__(v) z = (v); (void)sizeof(z); } STMT_END
                                                                   ^
APItest.xs:6801:28: note: in expansion of macro 'Gconvert'
         PERL_UNUSED_RESULT(Gconvert(SvNV(number), len,
                            ^~~~~~~~
../../config.h:909:39: note: assuming directive output of 105 bytes
 #define Gconvert(x,n,t,b) sprintf((b),"%.*g",(n),(x))
                                       ^~~~~~
../../perl.h:496:67: note: in definition of macro 'PERL_UNUSED_RESULT'
 #    define PERL_UNUSED_RESULT(v) STMT_START { __typeof__(v) z = (v); (void)sizeof(z); } STMT_END
                                                                   ^
APItest.xs:6801:28: note: in expansion of macro 'Gconvert'
         PERL_UNUSED_RESULT(Gconvert(SvNV(number), len,
                            ^~~~~~~~
../../config.h:909:27: note: 'sprintf' output between 2 and 107 bytes into a destination of size 100
 #define Gconvert(x,n,t,b) sprintf((b),"%.*g",(n),(x))
../../perl.h:496:67: note: in definition of macro 'PERL_UNUSED_RESULT'
 #    define PERL_UNUSED_RESULT(v) STMT_START { __typeof__(v) z = (v); (void)sizeof(z); } STMT_END
                                                                   ^
APItest.xs:6801:28: note: in expansion of macro 'Gconvert'
         PERL_UNUSED_RESULT(Gconvert(SvNV(number), len,
                            ^~~~~~~~
[2020-07-30 08:22:00-0400] Skip tests from '/home/core/smoke/TestSmoke/smokecurrent.skiptests'
[2020-07-30 08:22:00-0400] 
[2020-07-30 08:22:00-0400]  Tests start here:
[2020-07-30 08:22:00-0400] TSTENV = stdio	
# Failed test 30 - atime: default case at io/fs.t line 529
# Failed test 31 - mtime: default case at io/fs.t line 530
# Failed test 36 - atime: default case at io/fs.t line 529
# Failed test 37 - mtime: default case at io/fs.t line 530
# Will use Digest::MD5

#   Failed test 'atime set correctly'
#   at t/utime.t line 150.
#          got: '2.222222'
#     expected: '1.111111111'

#   Failed test 'mtime set correctly'
#   at t/utime.t line 152.
#          got: '2.222222'
#     expected: '2.222222222'

#   Failed test 'atime set correctly'
#   at t/utime.t line 162.
#          got: '2.222222'
#     expected: '1.111111111'

#   Failed test 'mtime set correctly'
#   at t/utime.t line 164.
#          got: '2.222222'
#     expected: '2.222222222'

#   Failed test 'File 1 atime set correctly'
#   at t/utime.t line 189.
#          got: '2.222222'
#     expected: '1.111111111'

#   Failed test 'File 1 mtime set correctly'
#   at t/utime.t line 191.
#          got: '2.222222'
#     expected: '2.222222222'

#   Failed test 'File 2 atime set correctly'
#   at t/utime.t line 197.
#          got: '2.222222'
#     expected: '1.111111111'

#   Failed test 'File 2 mtime set correctly'
#   at t/utime.t line 199.
#          got: '2.222222'
#     expected: '2.222222222'
# Looks like you failed 8 tests of 22.

#   Failed test 'and set errno to ENOTTY'
#   at t/termios.t line 74.
#          got: 45
#     expected: 25

#   Failed test 'and set errno to ENOTTY'
#   at t/termios.t line 79.
#          got: 45
#     expected: 25

#   Failed test 'and set errno to ENOTTY'
#   at t/termios.t line 163.
#          got: 45
#     expected: 25

#   Failed test 'and set errno to ENOTTY'
#   at t/termios.t line 167.
#          got: 45
#     expected: 25

#   Failed test 'and set errno to ENOTTY'
#   at t/termios.t line 172.
#          got: 45
#     expected: 25

#   Failed test 'and set errno to ENOTTY'
#   at t/termios.t line 177.
#          got: 45
#     expected: 25
# Looks like you failed 6 tests of 1595.

error while running harness target 'test_harness': 1 at /home/core/smoke/TestSmoke/Test/Smoke/App/RunSmoke.pm line 118.
[2020-07-30 08:46:36-0400] 
[2020-07-30 08:46:36-0400] ../t/io/fs.t................................................FAILED
[2020-07-30 08:46:36-0400]     30-31, 36-37
[2020-07-30 08:46:36-0400] ../dist/Time-HiRes/t/utime.t................................FAILED
[2020-07-30 08:46:36-0400]     2-3, 5-6, 12-15
[2020-07-30 08:46:36-0400] ../dist/Time-HiRes/t/utime.t................................FAILED
[2020-07-30 08:46:36-0400]     Non-zero exit status: 8
[2020-07-30 08:46:36-0400] ../ext/POSIX/t/termios.t....................................FAILED
[2020-07-30 08:46:36-0400]     74, 76, 1589, 1591, 1593, 1595
[2020-07-30 08:46:36-0400] ../ext/POSIX/t/termios.t....................................FAILED
[2020-07-30 08:46:36-0400]     Non-zero exit status: 6
[2020-07-30 08:46:36-0400] Archived results...
[2020-07-30 08:46:36-0400] Unskip tests from '/home/core/smoke/TestSmoke/smokecurrent.skiptests'
[2020-07-30 08:46:36-0400] 
[2020-07-30 08:46:36-0400] Configuration: -Dusedevel -Dcc=gcc -DDEBUGGING
[2020-07-30 08:46:36-0400] ------------------------------------------------------------------------------
[2020-07-30 08:46:36-0400] make distclean ...
[2020-07-30 08:46:58-0400] 
[2020-07-30 08:46:58-0400] Copy Policy.sh ...
[2020-07-30 08:46:58-0400] 
[2020-07-30 08:46:58-0400] Configure ...
[2020-07-30 08:48:17-0400] 
[2020-07-30 08:48:17-0400] make ...
In file included from sv.c:32:
sv.c: In function 'Perl_sv_vcatpvfn_flags':
config.h:909:39: warning: '%.*g' directive writing between 1 and 133 bytes into a region of size 127 [-Wformat-overflow=]
 #define Gconvert(x,n,t,b) sprintf((b),"%.*g",(n),(x))
                                       ^~~~~~
perl.h:6834:13: note: in definition of macro 'WITH_LC_NUMERIC_SET_TO_NEEDED_IN'
             block;                                                          \
             ^~~~~
sv.c:48:5: note: in expansion of macro 'PERL_UNUSED_RESULT'
     PERL_UNUSED_RESULT(Gconvert((NV)(nv), (int)ndig, 0, buffer))
     ^~~~~~~~~~~~~~~~~~
sv.c:48:24: note: in expansion of macro 'Gconvert'
     PERL_UNUSED_RESULT(Gconvert((NV)(nv), (int)ndig, 0, buffer))
                        ^~~~~~~~
sv.c:13128:21: note: in expansion of macro 'SNPRINTF_G'
                     SNPRINTF_G(fv, ebuf, sizeof(ebuf), precis)
                     ^~~~~~~~~~
config.h:909:39: note: assuming directive output of 132 bytes
 #define Gconvert(x,n,t,b) sprintf((b),"%.*g",(n),(x))
                                       ^~~~~~
perl.h:6834:13: note: in definition of macro 'WITH_LC_NUMERIC_SET_TO_NEEDED_IN'
             block;                                                          \
             ^~~~~
sv.c:48:5: note: in expansion of macro 'PERL_UNUSED_RESULT'
     PERL_UNUSED_RESULT(Gconvert((NV)(nv), (int)ndig, 0, buffer))
     ^~~~~~~~~~~~~~~~~~
sv.c:48:24: note: in expansion of macro 'Gconvert'
     PERL_UNUSED_RESULT(Gconvert((NV)(nv), (int)ndig, 0, buffer))
                        ^~~~~~~~
sv.c:13128:21: note: in expansion of macro 'SNPRINTF_G'
                     SNPRINTF_G(fv, ebuf, sizeof(ebuf), precis)
                     ^~~~~~~~~~
config.h:909:27: note: 'sprintf' output between 2 and 134 bytes into a destination of size 127
 #define Gconvert(x,n,t,b) sprintf((b),"%.*g",(n),(x))
perl.h:6834:13: note: in definition of macro 'WITH_LC_NUMERIC_SET_TO_NEEDED_IN'
             block;                                                          \
             ^~~~~
sv.c:48:5: note: in expansion of macro 'PERL_UNUSED_RESULT'
     PERL_UNUSED_RESULT(Gconvert((NV)(nv), (int)ndig, 0, buffer))
     ^~~~~~~~~~~~~~~~~~
sv.c:48:24: note: in expansion of macro 'Gconvert'
     PERL_UNUSED_RESULT(Gconvert((NV)(nv), (int)ndig, 0, buffer))
                        ^~~~~~~~
sv.c:13128:21: note: in expansion of macro 'SNPRINTF_G'
                     SNPRINTF_G(fv, ebuf, sizeof(ebuf), precis)
                     ^~~~~~~~~~
config.h:909:39: warning: '%.*g' directive writing between 1 and 133 bytes into a region of size 127 [-Wformat-overflow=]
 #define Gconvert(x,n,t,b) sprintf((b),"%.*g",(n),(x))
                                       ^~~~~~
perl.h:6834:13: note: in definition of macro 'WITH_LC_NUMERIC_SET_TO_NEEDED_IN'
             block;                                                          \
             ^~~~~
sv.c:48:5: note: in expansion of macro 'PERL_UNUSED_RESULT'
     PERL_UNUSED_RESULT(Gconvert((NV)(nv), (int)ndig, 0, buffer))
     ^~~~~~~~~~~~~~~~~~
sv.c:48:24: note: in expansion of macro 'Gconvert'
     PERL_UNUSED_RESULT(Gconvert((NV)(nv), (int)ndig, 0, buffer))
                        ^~~~~~~~
sv.c:13128:21: note: in expansion of macro 'SNPRINTF_G'
                     SNPRINTF_G(fv, ebuf, sizeof(ebuf), precis)
                     ^~~~~~~~~~
config.h:909:39: note: assuming directive output of 132 bytes
 #define Gconvert(x,n,t,b) sprintf((b),"%.*g",(n),(x))
                                       ^~~~~~
perl.h:6834:13: note: in definition of macro 'WITH_LC_NUMERIC_SET_TO_NEEDED_IN'
             block;                                                          \
             ^~~~~
sv.c:48:5: note: in expansion of macro 'PERL_UNUSED_RESULT'
     PERL_UNUSED_RESULT(Gconvert((NV)(nv), (int)ndig, 0, buffer))
     ^~~~~~~~~~~~~~~~~~
sv.c:48:24: note: in expansion of macro 'Gconvert'
     PERL_UNUSED_RESULT(Gconvert((NV)(nv), (int)ndig, 0, buffer))
                        ^~~~~~~~
sv.c:13128:21: note: in expansion of macro 'SNPRINTF_G'
                     SNPRINTF_G(fv, ebuf, sizeof(ebuf), precis)
                     ^~~~~~~~~~
config.h:909:27: note: 'sprintf' output between 2 and 134 bytes into a destination of size 127
 #define Gconvert(x,n,t,b) sprintf((b),"%.*g",(n),(x))
perl.h:6834:13: note: in definition of macro 'WITH_LC_NUMERIC_SET_TO_NEEDED_IN'
             block;                                                          \
             ^~~~~
sv.c:48:5: note: in expansion of macro 'PERL_UNUSED_RESULT'
     PERL_UNUSED_RESULT(Gconvert((NV)(nv), (int)ndig, 0, buffer))
     ^~~~~~~~~~~~~~~~~~
sv.c:48:24: note: in expansion of macro 'Gconvert'
     PERL_UNUSED_RESULT(Gconvert((NV)(nv), (int)ndig, 0, buffer))
                        ^~~~~~~~
sv.c:13128:21: note: in expansion of macro 'SNPRINTF_G'
                     SNPRINTF_G(fv, ebuf, sizeof(ebuf), precis)
                     ^~~~~~~~~~
Warning (mostly harmless): No library found for -ldb
DB_File.xs: In function 'ParseOpenInfo':
DB_File.xs:476:44: warning: suggest braces around empty body in an 'if' statement [-Wempty-body]
         if (RETVAL->dbp) err_close(RETVAL) ;                           \
                                            ^
DB_File.xs:1044:13: note: in expansion of macro 'croak_and_free'
             croak_and_free("type parameter is not a reference") ;
             ^~~~~~~~~~~~~~
DB_File.xs:476:44: warning: suggest braces around empty body in an 'if' statement [-Wempty-body]
         if (RETVAL->dbp) err_close(RETVAL) ;                           \
                                            ^
DB_File.xs:1050:13: note: in expansion of macro 'croak_and_free'
             croak_and_free("internal error") ;
             ^~~~~~~~~~~~~~
DB_File.xs:476:44: warning: suggest braces around empty body in an 'if' statement [-Wempty-body]
         if (RETVAL->dbp) err_close(RETVAL) ;                           \
                                            ^
DB_File.xs:1056:17: note: in expansion of macro 'croak_and_free'
                 croak_and_free("DB_File can only tie an associative array to a DB_HASH database") ;
                 ^~~~~~~~~~~~~~
DB_File.xs:476:44: warning: suggest braces around empty body in an 'if' statement [-Wempty-body]
         if (RETVAL->dbp) err_close(RETVAL) ;                           \
                                            ^
DB_File.xs:1091:17: note: in expansion of macro 'croak_and_free'
                 croak_and_free("DB_File can only tie an associative array to a DB_BTREE database");
                 ^~~~~~~~~~~~~~
DB_File.xs:476:44: warning: suggest braces around empty body in an 'if' statement [-Wempty-body]
         if (RETVAL->dbp) err_close(RETVAL) ;                           \
                                            ^
DB_File.xs:1140:17: note: in expansion of macro 'croak_and_free'
                 croak_and_free("DB_File can only tie an array to a DB_RECNO database");
                 ^~~~~~~~~~~~~~
DB_File.xs:476:44: warning: suggest braces around empty body in an 'if' statement [-Wempty-body]
         if (RETVAL->dbp) err_close(RETVAL) ;                           \
                                            ^
DB_File.xs:1229:13: note: in expansion of macro 'croak_and_free'
             croak_and_free("type is not of type DB_File::HASHINFO, DB_File::BTREEINFO or DB_File::RECNOINFO");
             ^~~~~~~~~~~~~~
Warning (mostly harmless): No library found for -lndbm
Warning (mostly harmless): No library found for -ldbm
Warning (mostly harmless): No library found for -lucb
Warning (mostly harmless): No library found for -lposix
Warning (mostly harmless): No library found for -lcposix
Socket.c: In function 'XS_Socket_pack_ip_mreq_source':
Socket.c:1673:7: warning: variable 'interface' set but not used [-Wunused-but-set-variable]
  SV * interface;
       ^~~~~~~~~
Making header files for XS...
In file included from APItest.xs:10:
APItest.c: In function 'XS_XS__APItest__Magic_test_Gconvert':
../../config.h:909:39: warning: '%.*g' directive writing between 1 and 106 bytes into a region of size 100 [-Wformat-overflow=]
 #define Gconvert(x,n,t,b) sprintf((b),"%.*g",(n),(x))
                                       ^~~~~~
../../perl.h:496:67: note: in definition of macro 'PERL_UNUSED_RESULT'
 #    define PERL_UNUSED_RESULT(v) STMT_START { __typeof__(v) z = (v); (void)sizeof(z); } STMT_END
                                                                   ^
APItest.xs:6801:28: note: in expansion of macro 'Gconvert'
         PERL_UNUSED_RESULT(Gconvert(SvNV(number), len,
                            ^~~~~~~~
../../config.h:909:39: note: assuming directive output of 105 bytes
 #define Gconvert(x,n,t,b) sprintf((b),"%.*g",(n),(x))
                                       ^~~~~~
../../perl.h:496:67: note: in definition of macro 'PERL_UNUSED_RESULT'
 #    define PERL_UNUSED_RESULT(v) STMT_START { __typeof__(v) z = (v); (void)sizeof(z); } STMT_END
                                                                   ^
APItest.xs:6801:28: note: in expansion of macro 'Gconvert'
         PERL_UNUSED_RESULT(Gconvert(SvNV(number), len,
                            ^~~~~~~~
../../config.h:909:27: note: 'sprintf' output between 2 and 107 bytes into a destination of size 100
 #define Gconvert(x,n,t,b) sprintf((b),"%.*g",(n),(x))
../../perl.h:496:67: note: in definition of macro 'PERL_UNUSED_RESULT'
 #    define PERL_UNUSED_RESULT(v) STMT_START { __typeof__(v) z = (v); (void)sizeof(z); } STMT_END
                                                                   ^
APItest.xs:6801:28: note: in expansion of macro 'Gconvert'
         PERL_UNUSED_RESULT(Gconvert(SvNV(number), len,
                            ^~~~~~~~
[2020-07-30 08:58:04-0400] Skip tests from '/home/core/smoke/TestSmoke/smokecurrent.skiptests'
[2020-07-30 08:58:04-0400] 
[2020-07-30 08:58:04-0400]  Tests start here:
[2020-07-30 08:58:04-0400] TSTENV = stdio	
# Failed test 30 - atime: default case at io/fs.t line 529
# Failed test 31 - mtime: default case at io/fs.t line 530
# Failed test 36 - atime: default case at io/fs.t line 529
# Failed test 37 - mtime: default case at io/fs.t line 530
# Will use Digest::MD5

#   Failed test 'atime set correctly'
#   at t/utime.t line 150.
#          got: '2.222222'
#     expected: '1.111111111'

#   Failed test 'mtime set correctly'
#   at t/utime.t line 152.
#          got: '2.222222'
#     expected: '2.222222222'

#   Failed test 'atime set correctly'
#   at t/utime.t line 162.
#          got: '2.222222'
#     expected: '1.111111111'

#   Failed test 'mtime set correctly'
#   at t/utime.t line 164.
#          got: '2.222222'
#     expected: '2.222222222'

#   Failed test 'File 1 atime set correctly'
#   at t/utime.t line 189.
#          got: '2.222222'
#     expected: '1.111111111'

#   Failed test 'File 1 mtime set correctly'
#   at t/utime.t line 191.
#          got: '2.222222'
#     expected: '2.222222222'

#   Failed test 'File 2 atime set correctly'
#   at t/utime.t line 197.
#          got: '2.222222'
#     expected: '1.111111111'

#   Failed test 'File 2 mtime set correctly'
#   at t/utime.t line 199.
#          got: '2.222222'
#     expected: '2.222222222'
# Looks like you failed 8 tests of 22.

#   Failed test 'and set errno to ENOTTY'
#   at t/termios.t line 74.
#          got: 45
#     expected: 25

#   Failed test 'and set errno to ENOTTY'
#   at t/termios.t line 79.
#          got: 45
#     expected: 25

#   Failed test 'and set errno to ENOTTY'
#   at t/termios.t line 163.
#          got: 45
#     expected: 25

#   Failed test 'and set errno to ENOTTY'
#   at t/termios.t line 167.
#          got: 45
#     expected: 25

#   Failed test 'and set errno to ENOTTY'
#   at t/termios.t line 172.
#          got: 45
#     expected: 25

#   Failed test 'and set errno to ENOTTY'
#   at t/termios.t line 177.
#          got: 45
#     expected: 25
# Looks like you failed 6 tests of 1595.

error while running harness target 'test_harness': 1 at /home/core/smoke/TestSmoke/Test/Smoke/App/RunSmoke.pm line 118.
[2020-07-30 09:30:22-0400] 
[2020-07-30 09:30:22-0400] ../t/io/fs.t................................................FAILED
[2020-07-30 09:30:22-0400]     30-31, 36-37
[2020-07-30 09:30:22-0400] ../dist/Time-HiRes/t/utime.t................................FAILED
[2020-07-30 09:30:22-0400]     2-3, 5-6, 12-15
[2020-07-30 09:30:22-0400] ../dist/Time-HiRes/t/utime.t................................FAILED
[2020-07-30 09:30:22-0400]     Non-zero exit status: 8
[2020-07-30 09:30:22-0400] ../ext/POSIX/t/termios.t....................................FAILED
[2020-07-30 09:30:22-0400]     74, 76, 1589, 1591, 1593, 1595
[2020-07-30 09:30:22-0400] ../ext/POSIX/t/termios.t....................................FAILED
[2020-07-30 09:30:22-0400]     Non-zero exit status: 6
[2020-07-30 09:30:22-0400] Archived results...
[2020-07-30 09:30:22-0400] Unskip tests from '/home/core/smoke/TestSmoke/smokecurrent.skiptests'
[2020-07-30 09:30:22-0400] 
[2020-07-30 09:30:22-0400] Configuration: -Dusedevel -Dcc=gcc -Duse64bitall
[2020-07-30 09:30:22-0400] ------------------------------------------------------------------------------
[2020-07-30 09:30:22-0400] make distclean ...
[2020-07-30 09:30:49-0400] 
[2020-07-30 09:30:49-0400] Copy Policy.sh ...
[2020-07-30 09:30:49-0400] 
[2020-07-30 09:30:49-0400] Configure ...
[2020-07-30 09:32:03-0400] 
[2020-07-30 09:32:03-0400] make ...
In file included from sv.c:32:
sv.c: In function 'Perl_sv_vcatpvfn_flags':
config.h:909:39: warning: '%.*g' directive writing between 1 and 133 bytes into a region of size 127 [-Wformat-overflow=]
 #define Gconvert(x,n,t,b) sprintf((b),"%.*g",(n),(x))
                                       ^~~~~~
perl.h:6834:13: note: in definition of macro 'WITH_LC_NUMERIC_SET_TO_NEEDED_IN'
             block;                                                          \
             ^~~~~
sv.c:48:5: note: in expansion of macro 'PERL_UNUSED_RESULT'
     PERL_UNUSED_RESULT(Gconvert((NV)(nv), (int)ndig, 0, buffer))
     ^~~~~~~~~~~~~~~~~~
sv.c:48:24: note: in expansion of macro 'Gconvert'
     PERL_UNUSED_RESULT(Gconvert((NV)(nv), (int)ndig, 0, buffer))
                        ^~~~~~~~
sv.c:13128:21: note: in expansion of macro 'SNPRINTF_G'
                     SNPRINTF_G(fv, ebuf, sizeof(ebuf), precis)
                     ^~~~~~~~~~
config.h:909:39: note: assuming directive output of 132 bytes
 #define Gconvert(x,n,t,b) sprintf((b),"%.*g",(n),(x))
                                       ^~~~~~
perl.h:6834:13: note: in definition of macro 'WITH_LC_NUMERIC_SET_TO_NEEDED_IN'
             block;                                                          \
             ^~~~~
sv.c:48:5: note: in expansion of macro 'PERL_UNUSED_RESULT'
     PERL_UNUSED_RESULT(Gconvert((NV)(nv), (int)ndig, 0, buffer))
     ^~~~~~~~~~~~~~~~~~
sv.c:48:24: note: in expansion of macro 'Gconvert'
     PERL_UNUSED_RESULT(Gconvert((NV)(nv), (int)ndig, 0, buffer))
                        ^~~~~~~~
sv.c:13128:21: note: in expansion of macro 'SNPRINTF_G'
                     SNPRINTF_G(fv, ebuf, sizeof(ebuf), precis)
                     ^~~~~~~~~~
config.h:909:27: note: 'sprintf' output between 2 and 134 bytes into a destination of size 127
 #define Gconvert(x,n,t,b) sprintf((b),"%.*g",(n),(x))
perl.h:6834:13: note: in definition of macro 'WITH_LC_NUMERIC_SET_TO_NEEDED_IN'
             block;                                                          \
             ^~~~~
sv.c:48:5: note: in expansion of macro 'PERL_UNUSED_RESULT'
     PERL_UNUSED_RESULT(Gconvert((NV)(nv), (int)ndig, 0, buffer))
     ^~~~~~~~~~~~~~~~~~
sv.c:48:24: note: in expansion of macro 'Gconvert'
     PERL_UNUSED_RESULT(Gconvert((NV)(nv), (int)ndig, 0, buffer))
                        ^~~~~~~~
sv.c:13128:21: note: in expansion of macro 'SNPRINTF_G'
                     SNPRINTF_G(fv, ebuf, sizeof(ebuf), precis)
                     ^~~~~~~~~~
config.h:909:39: warning: '%.*g' directive writing between 1 and 133 bytes into a region of size 127 [-Wformat-overflow=]
 #define Gconvert(x,n,t,b) sprintf((b),"%.*g",(n),(x))
                                       ^~~~~~
perl.h:6834:13: note: in definition of macro 'WITH_LC_NUMERIC_SET_TO_NEEDED_IN'
             block;                                                          \
             ^~~~~
sv.c:48:5: note: in expansion of macro 'PERL_UNUSED_RESULT'
     PERL_UNUSED_RESULT(Gconvert((NV)(nv), (int)ndig, 0, buffer))
     ^~~~~~~~~~~~~~~~~~
sv.c:48:24: note: in expansion of macro 'Gconvert'
     PERL_UNUSED_RESULT(Gconvert((NV)(nv), (int)ndig, 0, buffer))
                        ^~~~~~~~
sv.c:13128:21: note: in expansion of macro 'SNPRINTF_G'
                     SNPRINTF_G(fv, ebuf, sizeof(ebuf), precis)
                     ^~~~~~~~~~
config.h:909:39: note: assuming directive output of 132 bytes
 #define Gconvert(x,n,t,b) sprintf((b),"%.*g",(n),(x))
                                       ^~~~~~
perl.h:6834:13: note: in definition of macro 'WITH_LC_NUMERIC_SET_TO_NEEDED_IN'
             block;                                                          \
             ^~~~~
sv.c:48:5: note: in expansion of macro 'PERL_UNUSED_RESULT'
     PERL_UNUSED_RESULT(Gconvert((NV)(nv), (int)ndig, 0, buffer))
     ^~~~~~~~~~~~~~~~~~
sv.c:48:24: note: in expansion of macro 'Gconvert'
     PERL_UNUSED_RESULT(Gconvert((NV)(nv), (int)ndig, 0, buffer))
                        ^~~~~~~~
sv.c:13128:21: note: in expansion of macro 'SNPRINTF_G'
                     SNPRINTF_G(fv, ebuf, sizeof(ebuf), precis)
                     ^~~~~~~~~~
config.h:909:27: note: 'sprintf' output between 2 and 134 bytes into a destination of size 127
 #define Gconvert(x,n,t,b) sprintf((b),"%.*g",(n),(x))
perl.h:6834:13: note: in definition of macro 'WITH_LC_NUMERIC_SET_TO_NEEDED_IN'
             block;                                                          \
             ^~~~~
sv.c:48:5: note: in expansion of macro 'PERL_UNUSED_RESULT'
     PERL_UNUSED_RESULT(Gconvert((NV)(nv), (int)ndig, 0, buffer))
     ^~~~~~~~~~~~~~~~~~
sv.c:48:24: note: in expansion of macro 'Gconvert'
     PERL_UNUSED_RESULT(Gconvert((NV)(nv), (int)ndig, 0, buffer))
                        ^~~~~~~~
sv.c:13128:21: note: in expansion of macro 'SNPRINTF_G'
                     SNPRINTF_G(fv, ebuf, sizeof(ebuf), precis)
                     ^~~~~~~~~~
Warning (mostly harmless): No library found for -ldb
DB_File.xs: In function 'ParseOpenInfo':
DB_File.xs:476:44: warning: suggest braces around empty body in an 'if' statement [-Wempty-body]
         if (RETVAL->dbp) err_close(RETVAL) ;                           \
                                            ^
DB_File.xs:1044:13: note: in expansion of macro 'croak_and_free'
             croak_and_free("type parameter is not a reference") ;
             ^~~~~~~~~~~~~~
DB_File.xs:476:44: warning: suggest braces around empty body in an 'if' statement [-Wempty-body]
         if (RETVAL->dbp) err_close(RETVAL) ;                           \
                                            ^
DB_File.xs:1050:13: note: in expansion of macro 'croak_and_free'
             croak_and_free("internal error") ;
             ^~~~~~~~~~~~~~
DB_File.xs:476:44: warning: suggest braces around empty body in an 'if' statement [-Wempty-body]
         if (RETVAL->dbp) err_close(RETVAL) ;                           \
                                            ^
DB_File.xs:1056:17: note: in expansion of macro 'croak_and_free'
                 croak_and_free("DB_File can only tie an associative array to a DB_HASH database") ;
                 ^~~~~~~~~~~~~~
DB_File.xs:476:44: warning: suggest braces around empty body in an 'if' statement [-Wempty-body]
         if (RETVAL->dbp) err_close(RETVAL) ;                           \
                                            ^
DB_File.xs:1091:17: note: in expansion of macro 'croak_and_free'
                 croak_and_free("DB_File can only tie an associative array to a DB_BTREE database");
                 ^~~~~~~~~~~~~~
DB_File.xs:476:44: warning: suggest braces around empty body in an 'if' statement [-Wempty-body]
         if (RETVAL->dbp) err_close(RETVAL) ;                           \
                                            ^
DB_File.xs:1140:17: note: in expansion of macro 'croak_and_free'
                 croak_and_free("DB_File can only tie an array to a DB_RECNO database");
                 ^~~~~~~~~~~~~~
DB_File.xs:476:44: warning: suggest braces around empty body in an 'if' statement [-Wempty-body]
         if (RETVAL->dbp) err_close(RETVAL) ;                           \
                                            ^
DB_File.xs:1229:13: note: in expansion of macro 'croak_and_free'
             croak_and_free("type is not of type DB_File::HASHINFO, DB_File::BTREEINFO or DB_File::RECNOINFO");
             ^~~~~~~~~~~~~~
Warning (mostly harmless): No library found for -lndbm
Warning (mostly harmless): No library found for -ldbm
Warning (mostly harmless): No library found for -lucb
Warning (mostly harmless): No library found for -lposix
Warning (mostly harmless): No library found for -lcposix
Socket.c: In function 'XS_Socket_pack_ip_mreq_source':
Socket.c:1673:7: warning: variable 'interface' set but not used [-Wunused-but-set-variable]
  SV * interface;
       ^~~~~~~~~
Making header files for XS...
In file included from APItest.xs:10:
APItest.c: In function 'XS_XS__APItest__Magic_test_Gconvert':
../../config.h:909:39: warning: '%.*g' directive writing between 1 and 106 bytes into a region of size 100 [-Wformat-overflow=]
 #define Gconvert(x,n,t,b) sprintf((b),"%.*g",(n),(x))
                                       ^~~~~~
../../perl.h:496:67: note: in definition of macro 'PERL_UNUSED_RESULT'
 #    define PERL_UNUSED_RESULT(v) STMT_START { __typeof__(v) z = (v); (void)sizeof(z); } STMT_END
                                                                   ^
APItest.xs:6801:28: note: in expansion of macro 'Gconvert'
         PERL_UNUSED_RESULT(Gconvert(SvNV(number), len,
                            ^~~~~~~~
../../config.h:909:39: note: assuming directive output of 105 bytes
 #define Gconvert(x,n,t,b) sprintf((b),"%.*g",(n),(x))
                                       ^~~~~~
../../perl.h:496:67: note: in definition of macro 'PERL_UNUSED_RESULT'
 #    define PERL_UNUSED_RESULT(v) STMT_START { __typeof__(v) z = (v); (void)sizeof(z); } STMT_END
                                                                   ^
APItest.xs:6801:28: note: in expansion of macro 'Gconvert'
         PERL_UNUSED_RESULT(Gconvert(SvNV(number), len,
                            ^~~~~~~~
../../config.h:909:27: note: 'sprintf' output between 2 and 107 bytes into a destination of size 100
 #define Gconvert(x,n,t,b) sprintf((b),"%.*g",(n),(x))
../../perl.h:496:67: note: in definition of macro 'PERL_UNUSED_RESULT'
 #    define PERL_UNUSED_RESULT(v) STMT_START { __typeof__(v) z = (v); (void)sizeof(z); } STMT_END
                                                                   ^
APItest.xs:6801:28: note: in expansion of macro 'Gconvert'
         PERL_UNUSED_RESULT(Gconvert(SvNV(number), len,
                            ^~~~~~~~
[2020-07-30 09:38:34-0400] Skip tests from '/home/core/smoke/TestSmoke/smokecurrent.skiptests'
[2020-07-30 09:38:34-0400] 
[2020-07-30 09:38:34-0400]  Tests start here:
[2020-07-30 09:38:34-0400] TSTENV = stdio	
# Failed test 30 - atime: default case at io/fs.t line 529
# Failed test 31 - mtime: default case at io/fs.t line 530
# Failed test 36 - atime: default case at io/fs.t line 529
# Failed test 37 - mtime: default case at io/fs.t line 530
# Will use Digest::MD5

#   Failed test 'atime set correctly'
#   at t/utime.t line 150.
#          got: '2.222222'
#     expected: '1.111111111'

#   Failed test 'mtime set correctly'
#   at t/utime.t line 152.
#          got: '2.222222'
#     expected: '2.222222222'

#   Failed test 'atime set correctly'
#   at t/utime.t line 162.
#          got: '2.222222'
#     expected: '1.111111111'

#   Failed test 'mtime set correctly'
#   at t/utime.t line 164.
#          got: '2.222222'
#     expected: '2.222222222'

#   Failed test 'File 1 atime set correctly'
#   at t/utime.t line 189.
#          got: '2.222222'
#     expected: '1.111111111'

#   Failed test 'File 1 mtime set correctly'
#   at t/utime.t line 191.
#          got: '2.222222'
#     expected: '2.222222222'

#   Failed test 'File 2 atime set correctly'
#   at t/utime.t line 197.
#          got: '2.222222'
#     expected: '1.111111111'

#   Failed test 'File 2 mtime set correctly'
#   at t/utime.t line 199.
#          got: '2.222222'
#     expected: '2.222222222'
# Looks like you failed 8 tests of 22.

#   Failed test 'and set errno to ENOTTY'
#   at t/termios.t line 74.
#          got: 45
#     expected: 25

#   Failed test 'and set errno to ENOTTY'
#   at t/termios.t line 79.
#          got: 45
#     expected: 25

#   Failed test 'and set errno to ENOTTY'
#   at t/termios.t line 163.
#          got: 45
#     expected: 25

#   Failed test 'and set errno to ENOTTY'
#   at t/termios.t line 167.
#          got: 45
#     expected: 25

#   Failed test 'and set errno to ENOTTY'
#   at t/termios.t line 172.
#          got: 45
#     expected: 25

#   Failed test 'and set errno to ENOTTY'
#   at t/termios.t line 177.
#          got: 45
#     expected: 25
# Looks like you failed 6 tests of 1595.

error while running harness target 'test_harness': 1 at /home/core/smoke/TestSmoke/Test/Smoke/App/RunSmoke.pm line 118.
[2020-07-30 10:03:26-0400] 
[2020-07-30 10:03:26-0400] ../t/io/fs.t................................................FAILED
[2020-07-30 10:03:26-0400]     30-31, 36-37
[2020-07-30 10:03:26-0400] ../dist/Time-HiRes/t/utime.t................................FAILED
[2020-07-30 10:03:26-0400]     2-3, 5-6, 12-15
[2020-07-30 10:03:26-0400] ../dist/Time-HiRes/t/utime.t................................FAILED
[2020-07-30 10:03:26-0400]     Non-zero exit status: 8
[2020-07-30 10:03:26-0400] ../ext/POSIX/t/termios.t....................................FAILED
[2020-07-30 10:03:26-0400]     74, 76, 1589, 1591, 1593, 1595
[2020-07-30 10:03:26-0400] ../ext/POSIX/t/termios.t....................................FAILED
[2020-07-30 10:03:26-0400]     Non-zero exit status: 6
[2020-07-30 10:03:26-0400] Archived results...
[2020-07-30 10:03:26-0400] Unskip tests from '/home/core/smoke/TestSmoke/smokecurrent.skiptests'
[2020-07-30 10:03:26-0400] 
[2020-07-30 10:03:26-0400] Configuration: -Dusedevel -Dcc=gcc -Duse64bitall -DDEBUGGING
[2020-07-30 10:03:26-0400] ------------------------------------------------------------------------------
[2020-07-30 10:03:26-0400] make distclean ...
[2020-07-30 10:03:48-0400] 
[2020-07-30 10:03:48-0400] Copy Policy.sh ...
[2020-07-30 10:03:48-0400] 
[2020-07-30 10:03:48-0400] Configure ...
[2020-07-30 10:05:09-0400] 
[2020-07-30 10:05:09-0400] make ...
In file included from sv.c:32:
sv.c: In function 'Perl_sv_vcatpvfn_flags':
config.h:909:39: warning: '%.*g' directive writing between 1 and 133 bytes into a region of size 127 [-Wformat-overflow=]
 #define Gconvert(x,n,t,b) sprintf((b),"%.*g",(n),(x))
                                       ^~~~~~
perl.h:6834:13: note: in definition of macro 'WITH_LC_NUMERIC_SET_TO_NEEDED_IN'
             block;                                                          \
             ^~~~~
sv.c:48:5: note: in expansion of macro 'PERL_UNUSED_RESULT'
     PERL_UNUSED_RESULT(Gconvert((NV)(nv), (int)ndig, 0, buffer))
     ^~~~~~~~~~~~~~~~~~
sv.c:48:24: note: in expansion of macro 'Gconvert'
     PERL_UNUSED_RESULT(Gconvert((NV)(nv), (int)ndig, 0, buffer))
                        ^~~~~~~~
sv.c:13128:21: note: in expansion of macro 'SNPRINTF_G'
                     SNPRINTF_G(fv, ebuf, sizeof(ebuf), precis)
                     ^~~~~~~~~~
config.h:909:39: note: assuming directive output of 132 bytes
 #define Gconvert(x,n,t,b) sprintf((b),"%.*g",(n),(x))
                                       ^~~~~~
perl.h:6834:13: note: in definition of macro 'WITH_LC_NUMERIC_SET_TO_NEEDED_IN'
             block;                                                          \
             ^~~~~
sv.c:48:5: note: in expansion of macro 'PERL_UNUSED_RESULT'
     PERL_UNUSED_RESULT(Gconvert((NV)(nv), (int)ndig, 0, buffer))
     ^~~~~~~~~~~~~~~~~~
sv.c:48:24: note: in expansion of macro 'Gconvert'
     PERL_UNUSED_RESULT(Gconvert((NV)(nv), (int)ndig, 0, buffer))
                        ^~~~~~~~
sv.c:13128:21: note: in expansion of macro 'SNPRINTF_G'
                     SNPRINTF_G(fv, ebuf, sizeof(ebuf), precis)
                     ^~~~~~~~~~
config.h:909:27: note: 'sprintf' output between 2 and 134 bytes into a destination of size 127
 #define Gconvert(x,n,t,b) sprintf((b),"%.*g",(n),(x))
perl.h:6834:13: note: in definition of macro 'WITH_LC_NUMERIC_SET_TO_NEEDED_IN'
             block;                                                          \
             ^~~~~
sv.c:48:5: note: in expansion of macro 'PERL_UNUSED_RESULT'
     PERL_UNUSED_RESULT(Gconvert((NV)(nv), (int)ndig, 0, buffer))
     ^~~~~~~~~~~~~~~~~~
sv.c:48:24: note: in expansion of macro 'Gconvert'
     PERL_UNUSED_RESULT(Gconvert((NV)(nv), (int)ndig, 0, buffer))
                        ^~~~~~~~
sv.c:13128:21: note: in expansion of macro 'SNPRINTF_G'
                     SNPRINTF_G(fv, ebuf, sizeof(ebuf), precis)
                     ^~~~~~~~~~
config.h:909:39: warning: '%.*g' directive writing between 1 and 133 bytes into a region of size 127 [-Wformat-overflow=]
 #define Gconvert(x,n,t,b) sprintf((b),"%.*g",(n),(x))
                                       ^~~~~~
perl.h:6834:13: note: in definition of macro 'WITH_LC_NUMERIC_SET_TO_NEEDED_IN'
             block;                                                          \
             ^~~~~
sv.c:48:5: note: in expansion of macro 'PERL_UNUSED_RESULT'
     PERL_UNUSED_RESULT(Gconvert((NV)(nv), (int)ndig, 0, buffer))
     ^~~~~~~~~~~~~~~~~~
sv.c:48:24: note: in expansion of macro 'Gconvert'
     PERL_UNUSED_RESULT(Gconvert((NV)(nv), (int)ndig, 0, buffer))
                        ^~~~~~~~
sv.c:13128:21: note: in expansion of macro 'SNPRINTF_G'
                     SNPRINTF_G(fv, ebuf, sizeof(ebuf), precis)
                     ^~~~~~~~~~
config.h:909:39: note: assuming directive output of 132 bytes
 #define Gconvert(x,n,t,b) sprintf((b),"%.*g",(n),(x))
                                       ^~~~~~
perl.h:6834:13: note: in definition of macro 'WITH_LC_NUMERIC_SET_TO_NEEDED_IN'
             block;                                                          \
             ^~~~~
sv.c:48:5: note: in expansion of macro 'PERL_UNUSED_RESULT'
     PERL_UNUSED_RESULT(Gconvert((NV)(nv), (int)ndig, 0, buffer))
     ^~~~~~~~~~~~~~~~~~
sv.c:48:24: note: in expansion of macro 'Gconvert'
     PERL_UNUSED_RESULT(Gconvert((NV)(nv), (int)ndig, 0, buffer))
                        ^~~~~~~~
sv.c:13128:21: note: in expansion of macro 'SNPRINTF_G'
                     SNPRINTF_G(fv, ebuf, sizeof(ebuf), precis)
                     ^~~~~~~~~~
config.h:909:27: note: 'sprintf' output between 2 and 134 bytes into a destination of size 127
 #define Gconvert(x,n,t,b) sprintf((b),"%.*g",(n),(x))
perl.h:6834:13: note: in definition of macro 'WITH_LC_NUMERIC_SET_TO_NEEDED_IN'
             block;                                                          \
             ^~~~~
sv.c:48:5: note: in expansion of macro 'PERL_UNUSED_RESULT'
     PERL_UNUSED_RESULT(Gconvert((NV)(nv), (int)ndig, 0, buffer))
     ^~~~~~~~~~~~~~~~~~
sv.c:48:24: note: in expansion of macro 'Gconvert'
     PERL_UNUSED_RESULT(Gconvert((NV)(nv), (int)ndig, 0, buffer))
                        ^~~~~~~~
sv.c:13128:21: note: in expansion of macro 'SNPRINTF_G'
                     SNPRINTF_G(fv, ebuf, sizeof(ebuf), precis)
                     ^~~~~~~~~~
Warning (mostly harmless): No library found for -ldb
DB_File.xs: In function 'ParseOpenInfo':
DB_File.xs:476:44: warning: suggest braces around empty body in an 'if' statement [-Wempty-body]
         if (RETVAL->dbp) err_close(RETVAL) ;                           \
                                            ^
DB_File.xs:1044:13: note: in expansion of macro 'croak_and_free'
             croak_and_free("type parameter is not a reference") ;
             ^~~~~~~~~~~~~~
DB_File.xs:476:44: warning: suggest braces around empty body in an 'if' statement [-Wempty-body]
         if (RETVAL->dbp) err_close(RETVAL) ;                           \
                                            ^
DB_File.xs:1050:13: note: in expansion of macro 'croak_and_free'
             croak_and_free("internal error") ;
             ^~~~~~~~~~~~~~
DB_File.xs:476:44: warning: suggest braces around empty body in an 'if' statement [-Wempty-body]
         if (RETVAL->dbp) err_close(RETVAL) ;                           \
                                            ^
DB_File.xs:1056:17: note: in expansion of macro 'croak_and_free'
                 croak_and_free("DB_File can only tie an associative array to a DB_HASH database") ;
                 ^~~~~~~~~~~~~~
DB_File.xs:476:44: warning: suggest braces around empty body in an 'if' statement [-Wempty-body]
         if (RETVAL->dbp) err_close(RETVAL) ;                           \
                                            ^
DB_File.xs:1091:17: note: in expansion of macro 'croak_and_free'
                 croak_and_free("DB_File can only tie an associative array to a DB_BTREE database");
                 ^~~~~~~~~~~~~~
DB_File.xs:476:44: warning: suggest braces around empty body in an 'if' statement [-Wempty-body]
         if (RETVAL->dbp) err_close(RETVAL) ;                           \
                                            ^
DB_File.xs:1140:17: note: in expansion of macro 'croak_and_free'
                 croak_and_free("DB_File can only tie an array to a DB_RECNO database");
                 ^~~~~~~~~~~~~~
DB_File.xs:476:44: warning: suggest braces around empty body in an 'if' statement [-Wempty-body]
         if (RETVAL->dbp) err_close(RETVAL) ;                           \
                                            ^
DB_File.xs:1229:13: note: in expansion of macro 'croak_and_free'
             croak_and_free("type is not of type DB_File::HASHINFO, DB_File::BTREEINFO or DB_File::RECNOINFO");
             ^~~~~~~~~~~~~~
Warning (mostly harmless): No library found for -lndbm
Warning (mostly harmless): No library found for -ldbm
Warning (mostly harmless): No library found for -lucb
Warning (mostly harmless): No library found for -lposix
Warning (mostly harmless): No library found for -lcposix
Socket.c: In function 'XS_Socket_pack_ip_mreq_source':
Socket.c:1673:7: warning: variable 'interface' set but not used [-Wunused-but-set-variable]
  SV * interface;
       ^~~~~~~~~
Making header files for XS...
In file included from APItest.xs:10:
APItest.c: In function 'XS_XS__APItest__Magic_test_Gconvert':
../../config.h:909:39: warning: '%.*g' directive writing between 1 and 106 bytes into a region of size 100 [-Wformat-overflow=]
 #define Gconvert(x,n,t,b) sprintf((b),"%.*g",(n),(x))
                                       ^~~~~~
../../perl.h:496:67: note: in definition of macro 'PERL_UNUSED_RESULT'
 #    define PERL_UNUSED_RESULT(v) STMT_START { __typeof__(v) z = (v); (void)sizeof(z); } STMT_END
                                                                   ^
APItest.xs:6801:28: note: in expansion of macro 'Gconvert'
         PERL_UNUSED_RESULT(Gconvert(SvNV(number), len,
                            ^~~~~~~~
../../config.h:909:39: note: assuming directive output of 105 bytes
 #define Gconvert(x,n,t,b) sprintf((b),"%.*g",(n),(x))
                                       ^~~~~~
../../perl.h:496:67: note: in definition of macro 'PERL_UNUSED_RESULT'
 #    define PERL_UNUSED_RESULT(v) STMT_START { __typeof__(v) z = (v); (void)sizeof(z); } STMT_END
                                                                   ^
APItest.xs:6801:28: note: in expansion of macro 'Gconvert'
         PERL_UNUSED_RESULT(Gconvert(SvNV(number), len,
                            ^~~~~~~~
../../config.h:909:27: note: 'sprintf' output between 2 and 107 bytes into a destination of size 100
 #define Gconvert(x,n,t,b) sprintf((b),"%.*g",(n),(x))
../../perl.h:496:67: note: in definition of macro 'PERL_UNUSED_RESULT'
 #    define PERL_UNUSED_RESULT(v) STMT_START { __typeof__(v) z = (v); (void)sizeof(z); } STMT_END
                                                                   ^
APItest.xs:6801:28: note: in expansion of macro 'Gconvert'
         PERL_UNUSED_RESULT(Gconvert(SvNV(number), len,
                            ^~~~~~~~
[2020-07-30 10:14:58-0400] Skip tests from '/home/core/smoke/TestSmoke/smokecurrent.skiptests'
[2020-07-30 10:14:58-0400] 
[2020-07-30 10:14:58-0400]  Tests start here:
[2020-07-30 10:14:58-0400] TSTENV = stdio	
# Failed test 30 - atime: default case at io/fs.t line 529
# Failed test 31 - mtime: default case at io/fs.t line 530
# Failed test 36 - atime: default case at io/fs.t line 529
# Failed test 37 - mtime: default case at io/fs.t line 530
# Will use Digest::MD5

#   Failed test 'atime set correctly'
#   at t/utime.t line 150.
#          got: '2.222222'
#     expected: '1.111111111'

#   Failed test 'mtime set correctly'
#   at t/utime.t line 152.
#          got: '2.222222'
#     expected: '2.222222222'

#   Failed test 'atime set correctly'
#   at t/utime.t line 162.
#          got: '2.222222'
#     expected: '1.111111111'

#   Failed test 'mtime set correctly'
#   at t/utime.t line 164.
#          got: '2.222222'
#     expected: '2.222222222'

#   Failed test 'File 1 atime set correctly'
#   at t/utime.t line 189.
#          got: '2.222222'
#     expected: '1.111111111'

#   Failed test 'File 1 mtime set correctly'
#   at t/utime.t line 191.
#          got: '2.222222'
#     expected: '2.222222222'

#   Failed test 'File 2 atime set correctly'
#   at t/utime.t line 197.
#          got: '2.222222'
#     expected: '1.111111111'

#   Failed test 'File 2 mtime set correctly'
#   at t/utime.t line 199.
#          got: '2.222222'
#     expected: '2.222222222'
# Looks like you failed 8 tests of 22.

#   Failed test 'and set errno to ENOTTY'
#   at t/termios.t line 74.
#          got: 45
#     expected: 25

#   Failed test 'and set errno to ENOTTY'
#   at t/termios.t line 79.
#          got: 45
#     expected: 25

#   Failed test 'and set errno to ENOTTY'
#   at t/termios.t line 163.
#          got: 45
#     expected: 25

#   Failed test 'and set errno to ENOTTY'
#   at t/termios.t line 167.
#          got: 45
#     expected: 25

#   Failed test 'and set errno to ENOTTY'
#   at t/termios.t line 172.
#          got: 45
#     expected: 25

#   Failed test 'and set errno to ENOTTY'
#   at t/termios.t line 177.
#          got: 45
#     expected: 25
# Looks like you failed 6 tests of 1595.

error while running harness target 'test_harness': 1 at /home/core/smoke/TestSmoke/Test/Smoke/App/RunSmoke.pm line 118.
[2020-07-30 10:47:21-0400] 
[2020-07-30 10:47:21-0400] ../t/io/fs.t................................................FAILED
[2020-07-30 10:47:21-0400]     30-31, 36-37
[2020-07-30 10:47:21-0400] ../dist/Time-HiRes/t/utime.t................................FAILED
[2020-07-30 10:47:21-0400]     2-3, 5-6, 12-15
[2020-07-30 10:47:21-0400] ../dist/Time-HiRes/t/utime.t................................FAILED
[2020-07-30 10:47:21-0400]     Non-zero exit status: 8
[2020-07-30 10:47:21-0400] ../ext/POSIX/t/termios.t....................................FAILED
[2020-07-30 10:47:21-0400]     74, 76, 1589, 1591, 1593, 1595
[2020-07-30 10:47:21-0400] ../ext/POSIX/t/termios.t....................................FAILED
[2020-07-30 10:47:21-0400]     Non-zero exit status: 6
[2020-07-30 10:47:21-0400] Archived results...
[2020-07-30 10:47:21-0400] Unskip tests from '/home/core/smoke/TestSmoke/smokecurrent.skiptests'
[2020-07-30 10:47:21-0400] 
[2020-07-30 10:47:21-0400] Configuration: -Dusedevel -Dcc=gcc -Duselongdouble
[2020-07-30 10:47:21-0400] ------------------------------------------------------------------------------
[2020-07-30 10:47:21-0400] make distclean ...
[2020-07-30 10:47:47-0400] 
[2020-07-30 10:47:47-0400] Copy Policy.sh ...
[2020-07-30 10:47:47-0400] 
[2020-07-30 10:47:47-0400] Configure ...
[2020-07-30 10:49:03-0400] 
[2020-07-30 10:49:03-0400] make ...
In file included from sv.c:32:
sv.c: In function 'Perl_sv_vcatpvfn_flags':
config.h:909:39: warning: '%.*Lg' directive writing between 1 and 137 bytes into a region of size 130 [-Wformat-overflow=]
 #define Gconvert(x,n,t,b) sprintf((b),"%.*""Lg",(n),(x))
                                       ^~~~~
perl.h:6834:13: note: in definition of macro 'WITH_LC_NUMERIC_SET_TO_NEEDED_IN'
             block;                                                          \
             ^~~~~
sv.c:48:5: note: in expansion of macro 'PERL_UNUSED_RESULT'
     PERL_UNUSED_RESULT(Gconvert((NV)(nv), (int)ndig, 0, buffer))
     ^~~~~~~~~~~~~~~~~~
sv.c:48:24: note: in expansion of macro 'Gconvert'
     PERL_UNUSED_RESULT(Gconvert((NV)(nv), (int)ndig, 0, buffer))
                        ^~~~~~~~
sv.c:13128:21: note: in expansion of macro 'SNPRINTF_G'
                     SNPRINTF_G(fv, ebuf, sizeof(ebuf), precis)
                     ^~~~~~~~~~
In file included from perl.h:28,
                 from sv.c:32:
config.h:909:40: note: format string is defined here
 #define Gconvert(x,n,t,b) sprintf((b),"%.*""Lg",(n),(x))
                                        ^~~~~~~
In file included from sv.c:32:
config.h:909:39: note: assuming directive output of 136 bytes
 #define Gconvert(x,n,t,b) sprintf((b),"%.*""Lg",(n),(x))
                                       ^~~~~
perl.h:6834:13: note: in definition of macro 'WITH_LC_NUMERIC_SET_TO_NEEDED_IN'
             block;                                                          \
             ^~~~~
sv.c:48:5: note: in expansion of macro 'PERL_UNUSED_RESULT'
     PERL_UNUSED_RESULT(Gconvert((NV)(nv), (int)ndig, 0, buffer))
     ^~~~~~~~~~~~~~~~~~
sv.c:48:24: note: in expansion of macro 'Gconvert'
     PERL_UNUSED_RESULT(Gconvert((NV)(nv), (int)ndig, 0, buffer))
                        ^~~~~~~~
sv.c:13128:21: note: in expansion of macro 'SNPRINTF_G'
                     SNPRINTF_G(fv, ebuf, sizeof(ebuf), precis)
                     ^~~~~~~~~~
config.h:909:27: note: 'sprintf' output between 2 and 138 bytes into a destination of size 130
 #define Gconvert(x,n,t,b) sprintf((b),"%.*""Lg",(n),(x))
perl.h:6834:13: note: in definition of macro 'WITH_LC_NUMERIC_SET_TO_NEEDED_IN'
             block;                                                          \
             ^~~~~
sv.c:48:5: note: in expansion of macro 'PERL_UNUSED_RESULT'
     PERL_UNUSED_RESULT(Gconvert((NV)(nv), (int)ndig, 0, buffer))
     ^~~~~~~~~~~~~~~~~~
sv.c:48:24: note: in expansion of macro 'Gconvert'
     PERL_UNUSED_RESULT(Gconvert((NV)(nv), (int)ndig, 0, buffer))
                        ^~~~~~~~
sv.c:13128:21: note: in expansion of macro 'SNPRINTF_G'
                     SNPRINTF_G(fv, ebuf, sizeof(ebuf), precis)
                     ^~~~~~~~~~
config.h:909:39: warning: '%.*Lg' directive writing between 1 and 137 bytes into a region of size 130 [-Wformat-overflow=]
 #define Gconvert(x,n,t,b) sprintf((b),"%.*""Lg",(n),(x))
                                       ^~~~~
perl.h:6834:13: note: in definition of macro 'WITH_LC_NUMERIC_SET_TO_NEEDED_IN'
             block;                                                          \
             ^~~~~
sv.c:48:5: note: in expansion of macro 'PERL_UNUSED_RESULT'
     PERL_UNUSED_RESULT(Gconvert((NV)(nv), (int)ndig, 0, buffer))
     ^~~~~~~~~~~~~~~~~~
sv.c:48:24: note: in expansion of macro 'Gconvert'
     PERL_UNUSED_RESULT(Gconvert((NV)(nv), (int)ndig, 0, buffer))
                        ^~~~~~~~
sv.c:13128:21: note: in expansion of macro 'SNPRINTF_G'
                     SNPRINTF_G(fv, ebuf, sizeof(ebuf), precis)
                     ^~~~~~~~~~
In file included from perl.h:28,
                 from sv.c:32:
config.h:909:40: note: format string is defined here
 #define Gconvert(x,n,t,b) sprintf((b),"%.*""Lg",(n),(x))
                                        ^~~~~~~
In file included from sv.c:32:
config.h:909:39: note: assuming directive output of 136 bytes
 #define Gconvert(x,n,t,b) sprintf((b),"%.*""Lg",(n),(x))
                                       ^~~~~
perl.h:6834:13: note: in definition of macro 'WITH_LC_NUMERIC_SET_TO_NEEDED_IN'
             block;                                                          \
             ^~~~~
sv.c:48:5: note: in expansion of macro 'PERL_UNUSED_RESULT'
     PERL_UNUSED_RESULT(Gconvert((NV)(nv), (int)ndig, 0, buffer))
     ^~~~~~~~~~~~~~~~~~
sv.c:48:24: note: in expansion of macro 'Gconvert'
     PERL_UNUSED_RESULT(Gconvert((NV)(nv), (int)ndig, 0, buffer))
                        ^~~~~~~~
sv.c:13128:21: note: in expansion of macro 'SNPRINTF_G'
                     SNPRINTF_G(fv, ebuf, sizeof(ebuf), precis)
                     ^~~~~~~~~~
config.h:909:27: note: 'sprintf' output between 2 and 138 bytes into a destination of size 130
 #define Gconvert(x,n,t,b) sprintf((b),"%.*""Lg",(n),(x))
perl.h:6834:13: note: in definition of macro 'WITH_LC_NUMERIC_SET_TO_NEEDED_IN'
             block;                                                          \
             ^~~~~
sv.c:48:5: note: in expansion of macro 'PERL_UNUSED_RESULT'
     PERL_UNUSED_RESULT(Gconvert((NV)(nv), (int)ndig, 0, buffer))
     ^~~~~~~~~~~~~~~~~~
sv.c:48:24: note: in expansion of macro 'Gconvert'
     PERL_UNUSED_RESULT(Gconvert((NV)(nv), (int)ndig, 0, buffer))
                        ^~~~~~~~
sv.c:13128:21: note: in expansion of macro 'SNPRINTF_G'
                     SNPRINTF_G(fv, ebuf, sizeof(ebuf), precis)
                     ^~~~~~~~~~
Warning (mostly harmless): No library found for -ldb
DB_File.xs: In function 'ParseOpenInfo':
DB_File.xs:476:44: warning: suggest braces around empty body in an 'if' statement [-Wempty-body]
         if (RETVAL->dbp) err_close(RETVAL) ;                           \
                                            ^
DB_File.xs:1044:13: note: in expansion of macro 'croak_and_free'
             croak_and_free("type parameter is not a reference") ;
             ^~~~~~~~~~~~~~
DB_File.xs:476:44: warning: suggest braces around empty body in an 'if' statement [-Wempty-body]
         if (RETVAL->dbp) err_close(RETVAL) ;                           \
                                            ^
DB_File.xs:1050:13: note: in expansion of macro 'croak_and_free'
             croak_and_free("internal error") ;
             ^~~~~~~~~~~~~~
DB_File.xs:476:44: warning: suggest braces around empty body in an 'if' statement [-Wempty-body]
         if (RETVAL->dbp) err_close(RETVAL) ;                           \
                                            ^
DB_File.xs:1056:17: note: in expansion of macro 'croak_and_free'
                 croak_and_free("DB_File can only tie an associative array to a DB_HASH database") ;
                 ^~~~~~~~~~~~~~
DB_File.xs:476:44: warning: suggest braces around empty body in an 'if' statement [-Wempty-body]
         if (RETVAL->dbp) err_close(RETVAL) ;                           \
                                            ^
DB_File.xs:1091:17: note: in expansion of macro 'croak_and_free'
                 croak_and_free("DB_File can only tie an associative array to a DB_BTREE database");
                 ^~~~~~~~~~~~~~
DB_File.xs:476:44: warning: suggest braces around empty body in an 'if' statement [-Wempty-body]
         if (RETVAL->dbp) err_close(RETVAL) ;                           \
                                            ^
DB_File.xs:1140:17: note: in expansion of macro 'croak_and_free'
                 croak_and_free("DB_File can only tie an array to a DB_RECNO database");
                 ^~~~~~~~~~~~~~
DB_File.xs:476:44: warning: suggest braces around empty body in an 'if' statement [-Wempty-body]
         if (RETVAL->dbp) err_close(RETVAL) ;                           \
                                            ^
DB_File.xs:1229:13: note: in expansion of macro 'croak_and_free'
             croak_and_free("type is not of type DB_File::HASHINFO, DB_File::BTREEINFO or DB_File::RECNOINFO");
             ^~~~~~~~~~~~~~
Warning (mostly harmless): No library found for -lndbm
Warning (mostly harmless): No library found for -ldbm
Warning (mostly harmless): No library found for -lucb
Warning (mostly harmless): No library found for -lposix
Warning (mostly harmless): No library found for -lcposix
Socket.c: In function 'XS_Socket_pack_ip_mreq_source':
Socket.c:1673:7: warning: variable 'interface' set but not used [-Wunused-but-set-variable]
  SV * interface;
       ^~~~~~~~~
Making header files for XS...
In file included from APItest.xs:10:
APItest.c: In function 'XS_XS__APItest__Magic_test_Gconvert':
../../config.h:909:39: warning: '%.*Lg' directive writing between 1 and 107 bytes into a region of size 100 [-Wformat-overflow=]
 #define Gconvert(x,n,t,b) sprintf((b),"%.*""Lg",(n),(x))
                                       ^~~~~
../../perl.h:496:67: note: in definition of macro 'PERL_UNUSED_RESULT'
 #    define PERL_UNUSED_RESULT(v) STMT_START { __typeof__(v) z = (v); (void)sizeof(z); } STMT_END
                                                                   ^
APItest.xs:6801:28: note: in expansion of macro 'Gconvert'
         PERL_UNUSED_RESULT(Gconvert(SvNV(number), len,
                            ^~~~~~~~
../../config.h:909:39: note: assuming directive output of 106 bytes
 #define Gconvert(x,n,t,b) sprintf((b),"%.*""Lg",(n),(x))
                                       ^~~~~
../../perl.h:496:67: note: in definition of macro 'PERL_UNUSED_RESULT'
 #    define PERL_UNUSED_RESULT(v) STMT_START { __typeof__(v) z = (v); (void)sizeof(z); } STMT_END
                                                                   ^
APItest.xs:6801:28: note: in expansion of macro 'Gconvert'
         PERL_UNUSED_RESULT(Gconvert(SvNV(number), len,
                            ^~~~~~~~
../../config.h:909:27: note: 'sprintf' output between 2 and 108 bytes into a destination of size 100
 #define Gconvert(x,n,t,b) sprintf((b),"%.*""Lg",(n),(x))
../../perl.h:496:67: note: in definition of macro 'PERL_UNUSED_RESULT'
 #    define PERL_UNUSED_RESULT(v) STMT_START { __typeof__(v) z = (v); (void)sizeof(z); } STMT_END
                                                                   ^
APItest.xs:6801:28: note: in expansion of macro 'Gconvert'
         PERL_UNUSED_RESULT(Gconvert(SvNV(number), len,
                            ^~~~~~~~
[2020-07-30 10:55:33-0400] Skip tests from '/home/core/smoke/TestSmoke/smokecurrent.skiptests'
[2020-07-30 10:55:33-0400] 
[2020-07-30 10:55:33-0400]  Tests start here:
[2020-07-30 10:55:33-0400] TSTENV = stdio	
# Failed test 30 - atime: default case at io/fs.t line 529
# Failed test 31 - mtime: default case at io/fs.t line 530
# Failed test 36 - atime: default case at io/fs.t line 529
# Failed test 37 - mtime: default case at io/fs.t line 530
# Will use Digest::MD5

#   Failed test 'atime set correctly'
#   at t/utime.t line 150.
#          got: '2.222222'
#     expected: '1.111111111'

#   Failed test 'mtime set correctly'
#   at t/utime.t line 152.
#          got: '2.222222'
#     expected: '2.222222222'

#   Failed test 'atime set correctly'
#   at t/utime.t line 162.
#          got: '2.222222'
#     expected: '1.111111111'

#   Failed test 'mtime set correctly'
#   at t/utime.t line 164.
#          got: '2.222222'
#     expected: '2.222222222'

#   Failed test 'File 1 atime set correctly'
#   at t/utime.t line 189.
#          got: '2.222222'
#     expected: '1.111111111'

#   Failed test 'File 1 mtime set correctly'
#   at t/utime.t line 191.
#          got: '2.222222'
#     expected: '2.222222222'

#   Failed test 'File 2 atime set correctly'
#   at t/utime.t line 197.
#          got: '2.222222'
#     expected: '1.111111111'

#   Failed test 'File 2 mtime set correctly'
#   at t/utime.t line 199.
#          got: '2.222222'
#     expected: '2.222222222'
# Looks like you failed 8 tests of 22.

#   Failed test 'and set errno to ENOTTY'
#   at t/termios.t line 74.
#          got: 45
#     expected: 25

#   Failed test 'and set errno to ENOTTY'
#   at t/termios.t line 79.
#          got: 45
#     expected: 25

#   Failed test 'and set errno to ENOTTY'
#   at t/termios.t line 163.
#          got: 45
#     expected: 25

#   Failed test 'and set errno to ENOTTY'
#   at t/termios.t line 167.
#          got: 45
#     expected: 25

#   Failed test 'and set errno to ENOTTY'
#   at t/termios.t line 172.
#          got: 45
#     expected: 25

#   Failed test 'and set errno to ENOTTY'
#   at t/termios.t line 177.
#          got: 45
#     expected: 25
# Looks like you failed 6 tests of 1595.

error while running harness target 'test_harness': 1 at /home/core/smoke/TestSmoke/Test/Smoke/App/RunSmoke.pm line 118.
[2020-07-30 11:20:01-0400] 
[2020-07-30 11:20:01-0400] ../t/io/fs.t................................................FAILED
[2020-07-30 11:20:01-0400]     30-31, 36-37
[2020-07-30 11:20:01-0400] ../dist/Time-HiRes/t/utime.t................................FAILED
[2020-07-30 11:20:01-0400]     2-3, 5-6, 12-15
[2020-07-30 11:20:01-0400] ../dist/Time-HiRes/t/utime.t................................FAILED
[2020-07-30 11:20:01-0400]     Non-zero exit status: 8
[2020-07-30 11:20:01-0400] ../ext/POSIX/t/termios.t....................................FAILED
[2020-07-30 11:20:01-0400]     74, 76, 1589, 1591, 1593, 1595
[2020-07-30 11:20:01-0400] ../ext/POSIX/t/termios.t....................................FAILED
[2020-07-30 11:20:01-0400]     Non-zero exit status: 6
[2020-07-30 11:20:01-0400] Archived results...
[2020-07-30 11:20:01-0400] Unskip tests from '/home/core/smoke/TestSmoke/smokecurrent.skiptests'
[2020-07-30 11:20:01-0400] 
[2020-07-30 11:20:01-0400] Configuration: -Dusedevel -Dcc=gcc -Duselongdouble -DDEBUGGING
[2020-07-30 11:20:01-0400] ------------------------------------------------------------------------------
[2020-07-30 11:20:01-0400] make distclean ...
[2020-07-30 11:20:23-0400] 
[2020-07-30 11:20:23-0400] Copy Policy.sh ...
[2020-07-30 11:20:23-0400] 
[2020-07-30 11:20:23-0400] Configure ...
[2020-07-30 11:21:44-0400] 
[2020-07-30 11:21:44-0400] make ...
In file included from sv.c:32:
sv.c: In function 'Perl_sv_vcatpvfn_flags':
config.h:909:39: warning: '%.*Lg' directive writing between 1 and 137 bytes into a region of size 130 [-Wformat-overflow=]
 #define Gconvert(x,n,t,b) sprintf((b),"%.*""Lg",(n),(x))
                                       ^~~~~
perl.h:6834:13: note: in definition of macro 'WITH_LC_NUMERIC_SET_TO_NEEDED_IN'
             block;                                                          \
             ^~~~~
sv.c:48:5: note: in expansion of macro 'PERL_UNUSED_RESULT'
     PERL_UNUSED_RESULT(Gconvert((NV)(nv), (int)ndig, 0, buffer))
     ^~~~~~~~~~~~~~~~~~
sv.c:48:24: note: in expansion of macro 'Gconvert'
     PERL_UNUSED_RESULT(Gconvert((NV)(nv), (int)ndig, 0, buffer))
                        ^~~~~~~~
sv.c:13128:21: note: in expansion of macro 'SNPRINTF_G'
                     SNPRINTF_G(fv, ebuf, sizeof(ebuf), precis)
                     ^~~~~~~~~~
In file included from perl.h:28,
                 from sv.c:32:
config.h:909:40: note: format string is defined here
 #define Gconvert(x,n,t,b) sprintf((b),"%.*""Lg",(n),(x))
                                        ^~~~~~~
In file included from sv.c:32:
config.h:909:39: note: assuming directive output of 136 bytes
 #define Gconvert(x,n,t,b) sprintf((b),"%.*""Lg",(n),(x))
                                       ^~~~~
perl.h:6834:13: note: in definition of macro 'WITH_LC_NUMERIC_SET_TO_NEEDED_IN'
             block;                                                          \
             ^~~~~
sv.c:48:5: note: in expansion of macro 'PERL_UNUSED_RESULT'
     PERL_UNUSED_RESULT(Gconvert((NV)(nv), (int)ndig, 0, buffer))
     ^~~~~~~~~~~~~~~~~~
sv.c:48:24: note: in expansion of macro 'Gconvert'
     PERL_UNUSED_RESULT(Gconvert((NV)(nv), (int)ndig, 0, buffer))
                        ^~~~~~~~
sv.c:13128:21: note: in expansion of macro 'SNPRINTF_G'
                     SNPRINTF_G(fv, ebuf, sizeof(ebuf), precis)
                     ^~~~~~~~~~
config.h:909:27: note: 'sprintf' output between 2 and 138 bytes into a destination of size 130
 #define Gconvert(x,n,t,b) sprintf((b),"%.*""Lg",(n),(x))
perl.h:6834:13: note: in definition of macro 'WITH_LC_NUMERIC_SET_TO_NEEDED_IN'
             block;                                                          \
             ^~~~~
sv.c:48:5: note: in expansion of macro 'PERL_UNUSED_RESULT'
     PERL_UNUSED_RESULT(Gconvert((NV)(nv), (int)ndig, 0, buffer))
     ^~~~~~~~~~~~~~~~~~
sv.c:48:24: note: in expansion of macro 'Gconvert'
     PERL_UNUSED_RESULT(Gconvert((NV)(nv), (int)ndig, 0, buffer))
                        ^~~~~~~~
sv.c:13128:21: note: in expansion of macro 'SNPRINTF_G'
                     SNPRINTF_G(fv, ebuf, sizeof(ebuf), precis)
                     ^~~~~~~~~~
config.h:909:39: warning: '%.*Lg' directive writing between 1 and 137 bytes into a region of size 130 [-Wformat-overflow=]
 #define Gconvert(x,n,t,b) sprintf((b),"%.*""Lg",(n),(x))
                                       ^~~~~
perl.h:6834:13: note: in definition of macro 'WITH_LC_NUMERIC_SET_TO_NEEDED_IN'
             block;                                                          \
             ^~~~~
sv.c:48:5: note: in expansion of macro 'PERL_UNUSED_RESULT'
     PERL_UNUSED_RESULT(Gconvert((NV)(nv), (int)ndig, 0, buffer))
     ^~~~~~~~~~~~~~~~~~
sv.c:48:24: note: in expansion of macro 'Gconvert'
     PERL_UNUSED_RESULT(Gconvert((NV)(nv), (int)ndig, 0, buffer))
                        ^~~~~~~~
sv.c:13128:21: note: in expansion of macro 'SNPRINTF_G'
                     SNPRINTF_G(fv, ebuf, sizeof(ebuf), precis)
                     ^~~~~~~~~~
In file included from perl.h:28,
                 from sv.c:32:
config.h:909:40: note: format string is defined here
 #define Gconvert(x,n,t,b) sprintf((b),"%.*""Lg",(n),(x))
                                        ^~~~~~~
In file included from sv.c:32:
config.h:909:39: note: assuming directive output of 136 bytes
 #define Gconvert(x,n,t,b) sprintf((b),"%.*""Lg",(n),(x))
                                       ^~~~~
perl.h:6834:13: note: in definition of macro 'WITH_LC_NUMERIC_SET_TO_NEEDED_IN'
             block;                                                          \
             ^~~~~
sv.c:48:5: note: in expansion of macro 'PERL_UNUSED_RESULT'
     PERL_UNUSED_RESULT(Gconvert((NV)(nv), (int)ndig, 0, buffer))
     ^~~~~~~~~~~~~~~~~~
sv.c:48:24: note: in expansion of macro 'Gconvert'
     PERL_UNUSED_RESULT(Gconvert((NV)(nv), (int)ndig, 0, buffer))
                        ^~~~~~~~
sv.c:13128:21: note: in expansion of macro 'SNPRINTF_G'
                     SNPRINTF_G(fv, ebuf, sizeof(ebuf), precis)
                     ^~~~~~~~~~
config.h:909:27: note: 'sprintf' output between 2 and 138 bytes into a destination of size 130
 #define Gconvert(x,n,t,b) sprintf((b),"%.*""Lg",(n),(x))
perl.h:6834:13: note: in definition of macro 'WITH_LC_NUMERIC_SET_TO_NEEDED_IN'
             block;                                                          \
             ^~~~~
sv.c:48:5: note: in expansion of macro 'PERL_UNUSED_RESULT'
     PERL_UNUSED_RESULT(Gconvert((NV)(nv), (int)ndig, 0, buffer))
     ^~~~~~~~~~~~~~~~~~
sv.c:48:24: note: in expansion of macro 'Gconvert'
     PERL_UNUSED_RESULT(Gconvert((NV)(nv), (int)ndig, 0, buffer))
                        ^~~~~~~~
sv.c:13128:21: note: in expansion of macro 'SNPRINTF_G'
                     SNPRINTF_G(fv, ebuf, sizeof(ebuf), precis)
                     ^~~~~~~~~~
Warning (mostly harmless): No library found for -ldb
DB_File.xs: In function 'ParseOpenInfo':
DB_File.xs:476:44: warning: suggest braces around empty body in an 'if' statement [-Wempty-body]
         if (RETVAL->dbp) err_close(RETVAL) ;                           \
                                            ^
DB_File.xs:1044:13: note: in expansion of macro 'croak_and_free'
             croak_and_free("type parameter is not a reference") ;
             ^~~~~~~~~~~~~~
DB_File.xs:476:44: warning: suggest braces around empty body in an 'if' statement [-Wempty-body]
         if (RETVAL->dbp) err_close(RETVAL) ;                           \
                                            ^
DB_File.xs:1050:13: note: in expansion of macro 'croak_and_free'
             croak_and_free("internal error") ;
             ^~~~~~~~~~~~~~
DB_File.xs:476:44: warning: suggest braces around empty body in an 'if' statement [-Wempty-body]
         if (RETVAL->dbp) err_close(RETVAL) ;                           \
                                            ^
DB_File.xs:1056:17: note: in expansion of macro 'croak_and_free'
                 croak_and_free("DB_File can only tie an associative array to a DB_HASH database") ;
                 ^~~~~~~~~~~~~~
DB_File.xs:476:44: warning: suggest braces around empty body in an 'if' statement [-Wempty-body]
         if (RETVAL->dbp) err_close(RETVAL) ;                           \
                                            ^
DB_File.xs:1091:17: note: in expansion of macro 'croak_and_free'
                 croak_and_free("DB_File can only tie an associative array to a DB_BTREE database");
                 ^~~~~~~~~~~~~~
DB_File.xs:476:44: warning: suggest braces around empty body in an 'if' statement [-Wempty-body]
         if (RETVAL->dbp) err_close(RETVAL) ;                           \
                                            ^
DB_File.xs:1140:17: note: in expansion of macro 'croak_and_free'
                 croak_and_free("DB_File can only tie an array to a DB_RECNO database");
                 ^~~~~~~~~~~~~~
DB_File.xs:476:44: warning: suggest braces around empty body in an 'if' statement [-Wempty-body]
         if (RETVAL->dbp) err_close(RETVAL) ;                           \
                                            ^
DB_File.xs:1229:13: note: in expansion of macro 'croak_and_free'
             croak_and_free("type is not of type DB_File::HASHINFO, DB_File::BTREEINFO or DB_File::RECNOINFO");
             ^~~~~~~~~~~~~~
Warning (mostly harmless): No library found for -lndbm
Warning (mostly harmless): No library found for -ldbm
Warning (mostly harmless): No library found for -lucb
Warning (mostly harmless): No library found for -lposix
Warning (mostly harmless): No library found for -lcposix
Socket.c: In function 'XS_Socket_pack_ip_mreq_source':
Socket.c:1673:7: warning: variable 'interface' set but not used [-Wunused-but-set-variable]
  SV * interface;
       ^~~~~~~~~
Making header files for XS...
In file included from APItest.xs:10:
APItest.c: In function 'XS_XS__APItest__Magic_test_Gconvert':
../../config.h:909:39: warning: '%.*Lg' directive writing between 1 and 107 bytes into a region of size 100 [-Wformat-overflow=]
 #define Gconvert(x,n,t,b) sprintf((b),"%.*""Lg",(n),(x))
                                       ^~~~~
../../perl.h:496:67: note: in definition of macro 'PERL_UNUSED_RESULT'
 #    define PERL_UNUSED_RESULT(v) STMT_START { __typeof__(v) z = (v); (void)sizeof(z); } STMT_END
                                                                   ^
APItest.xs:6801:28: note: in expansion of macro 'Gconvert'
         PERL_UNUSED_RESULT(Gconvert(SvNV(number), len,
                            ^~~~~~~~
../../config.h:909:39: note: assuming directive output of 106 bytes
 #define Gconvert(x,n,t,b) sprintf((b),"%.*""Lg",(n),(x))
                                       ^~~~~
../../perl.h:496:67: note: in definition of macro 'PERL_UNUSED_RESULT'
 #    define PERL_UNUSED_RESULT(v) STMT_START { __typeof__(v) z = (v); (void)sizeof(z); } STMT_END
                                                                   ^
APItest.xs:6801:28: note: in expansion of macro 'Gconvert'
         PERL_UNUSED_RESULT(Gconvert(SvNV(number), len,
                            ^~~~~~~~
../../config.h:909:27: note: 'sprintf' output between 2 and 108 bytes into a destination of size 100
 #define Gconvert(x,n,t,b) sprintf((b),"%.*""Lg",(n),(x))
../../perl.h:496:67: note: in definition of macro 'PERL_UNUSED_RESULT'
 #    define PERL_UNUSED_RESULT(v) STMT_START { __typeof__(v) z = (v); (void)sizeof(z); } STMT_END
                                                                   ^
APItest.xs:6801:28: note: in expansion of macro 'Gconvert'
         PERL_UNUSED_RESULT(Gconvert(SvNV(number), len,
                            ^~~~~~~~
[2020-07-30 11:31:24-0400] Skip tests from '/home/core/smoke/TestSmoke/smokecurrent.skiptests'
[2020-07-30 11:31:24-0400] 
[2020-07-30 11:31:24-0400]  Tests start here:
[2020-07-30 11:31:24-0400] TSTENV = stdio	
# Failed test 30 - atime: default case at io/fs.t line 529
# Failed test 31 - mtime: default case at io/fs.t line 530
# Failed test 36 - atime: default case at io/fs.t line 529
# Failed test 37 - mtime: default case at io/fs.t line 530
# Will use Digest::MD5

#   Failed test 'atime set correctly'
#   at t/utime.t line 150.
#          got: '2.222222'
#     expected: '1.111111111'

#   Failed test 'mtime set correctly'
#   at t/utime.t line 152.
#          got: '2.222222'
#     expected: '2.222222222'

#   Failed test 'atime set correctly'
#   at t/utime.t line 162.
#          got: '2.222222'
#     expected: '1.111111111'

#   Failed test 'mtime set correctly'
#   at t/utime.t line 164.
#          got: '2.222222'
#     expected: '2.222222222'

#   Failed test 'File 1 atime set correctly'
#   at t/utime.t line 189.
#          got: '2.222222'
#     expected: '1.111111111'

#   Failed test 'File 1 mtime set correctly'
#   at t/utime.t line 191.
#          got: '2.222222'
#     expected: '2.222222222'

#   Failed test 'File 2 atime set correctly'
#   at t/utime.t line 197.
#          got: '2.222222'
#     expected: '1.111111111'

#   Failed test 'File 2 mtime set correctly'
#   at t/utime.t line 199.
#          got: '2.222222'
#     expected: '2.222222222'
# Looks like you failed 8 tests of 22.

#   Failed test 'and set errno to ENOTTY'
#   at t/termios.t line 74.
#          got: 45
#     expected: 25

#   Failed test 'and set errno to ENOTTY'
#   at t/termios.t line 79.
#          got: 45
#     expected: 25

#   Failed test 'and set errno to ENOTTY'
#   at t/termios.t line 163.
#          got: 45
#     expected: 25

#   Failed test 'and set errno to ENOTTY'
#   at t/termios.t line 167.
#          got: 45
#     expected: 25

#   Failed test 'and set errno to ENOTTY'
#   at t/termios.t line 172.
#          got: 45
#     expected: 25

#   Failed test 'and set errno to ENOTTY'
#   at t/termios.t line 177.
#          got: 45
#     expected: 25
# Looks like you failed 6 tests of 1595.

error while running harness target 'test_harness': 1 at /home/core/smoke/TestSmoke/Test/Smoke/App/RunSmoke.pm line 118.
[2020-07-30 12:03:44-0400] 
[2020-07-30 12:03:44-0400] ../t/io/fs.t................................................FAILED
[2020-07-30 12:03:44-0400]     30-31, 36-37
[2020-07-30 12:03:44-0400] ../dist/Time-HiRes/t/utime.t................................FAILED
[2020-07-30 12:03:44-0400]     2-3, 5-6, 12-15
[2020-07-30 12:03:44-0400] ../dist/Time-HiRes/t/utime.t................................FAILED
[2020-07-30 12:03:44-0400]     Non-zero exit status: 8
[2020-07-30 12:03:44-0400] ../ext/POSIX/t/termios.t....................................FAILED
[2020-07-30 12:03:44-0400]     74, 76, 1589, 1591, 1593, 1595
[2020-07-30 12:03:44-0400] ../ext/POSIX/t/termios.t....................................FAILED
[2020-07-30 12:03:44-0400]     Non-zero exit status: 6
[2020-07-30 12:03:44-0400] Archived results...
[2020-07-30 12:03:44-0400] Unskip tests from '/home/core/smoke/TestSmoke/smokecurrent.skiptests'
[2020-07-30 12:03:44-0400] 
[2020-07-30 12:03:44-0400] Configuration: -Dusedevel -Dcc=gcc -Duseithreads
[2020-07-30 12:03:44-0400] ------------------------------------------------------------------------------
[2020-07-30 12:03:44-0400] make distclean ...
[2020-07-30 12:04:11-0400] 
[2020-07-30 12:04:11-0400] Copy Policy.sh ...
[2020-07-30 12:04:11-0400] 
[2020-07-30 12:04:11-0400] Configure ...
[2020-07-30 12:05:31-0400] 
[2020-07-30 12:05:31-0400] make ...
In file included from sv.c:32:
sv.c: In function 'Perl_sv_vcatpvfn_flags':
config.h:909:39: warning: '%.*g' directive writing between 1 and 133 bytes into a region of size 127 [-Wformat-overflow=]
 #define Gconvert(x,n,t,b) sprintf((b),"%.*g",(n),(x))
                                       ^~~~~~
perl.h:6834:13: note: in definition of macro 'WITH_LC_NUMERIC_SET_TO_NEEDED_IN'
             block;                                                          \
             ^~~~~
sv.c:48:5: note: in expansion of macro 'PERL_UNUSED_RESULT'
     PERL_UNUSED_RESULT(Gconvert((NV)(nv), (int)ndig, 0, buffer))
     ^~~~~~~~~~~~~~~~~~
sv.c:48:24: note: in expansion of macro 'Gconvert'
     PERL_UNUSED_RESULT(Gconvert((NV)(nv), (int)ndig, 0, buffer))
                        ^~~~~~~~
sv.c:13128:21: note: in expansion of macro 'SNPRINTF_G'
                     SNPRINTF_G(fv, ebuf, sizeof(ebuf), precis)
                     ^~~~~~~~~~
config.h:909:39: note: assuming directive output of 132 bytes
 #define Gconvert(x,n,t,b) sprintf((b),"%.*g",(n),(x))
                                       ^~~~~~
perl.h:6834:13: note: in definition of macro 'WITH_LC_NUMERIC_SET_TO_NEEDED_IN'
             block;                                                          \
             ^~~~~
sv.c:48:5: note: in expansion of macro 'PERL_UNUSED_RESULT'
     PERL_UNUSED_RESULT(Gconvert((NV)(nv), (int)ndig, 0, buffer))
     ^~~~~~~~~~~~~~~~~~
sv.c:48:24: note: in expansion of macro 'Gconvert'
     PERL_UNUSED_RESULT(Gconvert((NV)(nv), (int)ndig, 0, buffer))
                        ^~~~~~~~
sv.c:13128:21: note: in expansion of macro 'SNPRINTF_G'
                     SNPRINTF_G(fv, ebuf, sizeof(ebuf), precis)
                     ^~~~~~~~~~
config.h:909:27: note: 'sprintf' output between 2 and 134 bytes into a destination of size 127
 #define Gconvert(x,n,t,b) sprintf((b),"%.*g",(n),(x))
perl.h:6834:13: note: in definition of macro 'WITH_LC_NUMERIC_SET_TO_NEEDED_IN'
             block;                                                          \
             ^~~~~
sv.c:48:5: note: in expansion of macro 'PERL_UNUSED_RESULT'
     PERL_UNUSED_RESULT(Gconvert((NV)(nv), (int)ndig, 0, buffer))
     ^~~~~~~~~~~~~~~~~~
sv.c:48:24: note: in expansion of macro 'Gconvert'
     PERL_UNUSED_RESULT(Gconvert((NV)(nv), (int)ndig, 0, buffer))
                        ^~~~~~~~
sv.c:13128:21: note: in expansion of macro 'SNPRINTF_G'
                     SNPRINTF_G(fv, ebuf, sizeof(ebuf), precis)
                     ^~~~~~~~~~
config.h:909:39: warning: '%.*g' directive writing between 1 and 133 bytes into a region of size 127 [-Wformat-overflow=]
 #define Gconvert(x,n,t,b) sprintf((b),"%.*g",(n),(x))
                                       ^~~~~~
perl.h:6834:13: note: in definition of macro 'WITH_LC_NUMERIC_SET_TO_NEEDED_IN'
             block;                                                          \
             ^~~~~
sv.c:48:5: note: in expansion of macro 'PERL_UNUSED_RESULT'
     PERL_UNUSED_RESULT(Gconvert((NV)(nv), (int)ndig, 0, buffer))
     ^~~~~~~~~~~~~~~~~~
sv.c:48:24: note: in expansion of macro 'Gconvert'
     PERL_UNUSED_RESULT(Gconvert((NV)(nv), (int)ndig, 0, buffer))
                        ^~~~~~~~
sv.c:13128:21: note: in expansion of macro 'SNPRINTF_G'
                     SNPRINTF_G(fv, ebuf, sizeof(ebuf), precis)
                     ^~~~~~~~~~
config.h:909:39: note: assuming directive output of 132 bytes
 #define Gconvert(x,n,t,b) sprintf((b),"%.*g",(n),(x))
                                       ^~~~~~
perl.h:6834:13: note: in definition of macro 'WITH_LC_NUMERIC_SET_TO_NEEDED_IN'
             block;                                                          \
             ^~~~~
sv.c:48:5: note: in expansion of macro 'PERL_UNUSED_RESULT'
     PERL_UNUSED_RESULT(Gconvert((NV)(nv), (int)ndig, 0, buffer))
     ^~~~~~~~~~~~~~~~~~
sv.c:48:24: note: in expansion of macro 'Gconvert'
     PERL_UNUSED_RESULT(Gconvert((NV)(nv), (int)ndig, 0, buffer))
                        ^~~~~~~~
sv.c:13128:21: note: in expansion of macro 'SNPRINTF_G'
                     SNPRINTF_G(fv, ebuf, sizeof(ebuf), precis)
                     ^~~~~~~~~~
config.h:909:27: note: 'sprintf' output between 2 and 134 bytes into a destination of size 127
 #define Gconvert(x,n,t,b) sprintf((b),"%.*g",(n),(x))
perl.h:6834:13: note: in definition of macro 'WITH_LC_NUMERIC_SET_TO_NEEDED_IN'
             block;                                                          \
             ^~~~~
sv.c:48:5: note: in expansion of macro 'PERL_UNUSED_RESULT'
     PERL_UNUSED_RESULT(Gconvert((NV)(nv), (int)ndig, 0, buffer))
     ^~~~~~~~~~~~~~~~~~
sv.c:48:24: note: in expansion of macro 'Gconvert'
     PERL_UNUSED_RESULT(Gconvert((NV)(nv), (int)ndig, 0, buffer))
                        ^~~~~~~~
sv.c:13128:21: note: in expansion of macro 'SNPRINTF_G'
                     SNPRINTF_G(fv, ebuf, sizeof(ebuf), precis)
                     ^~~~~~~~~~
time64.c: In function 'Perl_localtime64_r':
time64.c:573:30: warning: 'orig_year' may be used uninitialized in this function [-Wmaybe-uninitialized]
             local_tm->tm_year++;
             ~~~~~~~~~~~~~~~~~^~
Warning (mostly harmless): No library found for -ldb
DB_File.xs: In function 'ParseOpenInfo':
DB_File.xs:476:44: warning: suggest braces around empty body in an 'if' statement [-Wempty-body]
         if (RETVAL->dbp) err_close(RETVAL) ;                           \
                                            ^
DB_File.xs:1044:13: note: in expansion of macro 'croak_and_free'
             croak_and_free("type parameter is not a reference") ;
             ^~~~~~~~~~~~~~
DB_File.xs:476:44: warning: suggest braces around empty body in an 'if' statement [-Wempty-body]
         if (RETVAL->dbp) err_close(RETVAL) ;                           \
                                            ^
DB_File.xs:1050:13: note: in expansion of macro 'croak_and_free'
             croak_and_free("internal error") ;
             ^~~~~~~~~~~~~~
DB_File.xs:476:44: warning: suggest braces around empty body in an 'if' statement [-Wempty-body]
         if (RETVAL->dbp) err_close(RETVAL) ;                           \
                                            ^
DB_File.xs:1056:17: note: in expansion of macro 'croak_and_free'
                 croak_and_free("DB_File can only tie an associative array to a DB_HASH database") ;
                 ^~~~~~~~~~~~~~
DB_File.xs:476:44: warning: suggest braces around empty body in an 'if' statement [-Wempty-body]
         if (RETVAL->dbp) err_close(RETVAL) ;                           \
                                            ^
DB_File.xs:1091:17: note: in expansion of macro 'croak_and_free'
                 croak_and_free("DB_File can only tie an associative array to a DB_BTREE database");
                 ^~~~~~~~~~~~~~
DB_File.xs:476:44: warning: suggest braces around empty body in an 'if' statement [-Wempty-body]
         if (RETVAL->dbp) err_close(RETVAL) ;                           \
                                            ^
DB_File.xs:1140:17: note: in expansion of macro 'croak_and_free'
                 croak_and_free("DB_File can only tie an array to a DB_RECNO database");
                 ^~~~~~~~~~~~~~
DB_File.xs:476:44: warning: suggest braces around empty body in an 'if' statement [-Wempty-body]
         if (RETVAL->dbp) err_close(RETVAL) ;                           \
                                            ^
DB_File.xs:1229:13: note: in expansion of macro 'croak_and_free'
             croak_and_free("type is not of type DB_File::HASHINFO, DB_File::BTREEINFO or DB_File::RECNOINFO");
             ^~~~~~~~~~~~~~
Warning (mostly harmless): No library found for -lndbm
Warning (mostly harmless): No library found for -ldbm
Warning (mostly harmless): No library found for -lucb
In file included from ../../perl.h:5611,
                 from Opcode.xs:3:
Opcode.xs: In function 'opmask_addlocal':
Opcode.xs:240:17: warning: cast between incompatible function types from 'void (*)(PerlInterpreter *, const char *, ...)' {aka 'void (*)(struct interpreter *, const char *, ...)'} to 'void (*)(void *)' [-Wcast-function-type]
  SAVEDESTRUCTOR((void(*)(void*))Perl_warn,"PL_op_mask restored");
                 ^
../../embed.h:496:57: note: in definition of macro 'save_destructor'
 #define save_destructor(a,b) Perl_save_destructor(aTHX_ a,b)
                                                         ^
Opcode.xs:240:2: note: in expansion of macro 'SAVEDESTRUCTOR'
  SAVEDESTRUCTOR((void(*)(void*))Perl_warn,"PL_op_mask restored");
  ^~~~~~~~~~~~~~
Warning (mostly harmless): No library found for -lposix
Warning (mostly harmless): No library found for -lcposix
Socket.c: In function 'XS_Socket_pack_ip_mreq_source':
Socket.c:1673:7: warning: variable 'interface' set but not used [-Wunused-but-set-variable]
  SV * interface;
       ^~~~~~~~~
Making header files for XS...
In file included from APItest.xs:10:
APItest.c: In function 'XS_XS__APItest__Magic_test_Gconvert':
../../config.h:909:39: warning: '%.*g' directive writing between 1 and 106 bytes into a region of size 100 [-Wformat-overflow=]
 #define Gconvert(x,n,t,b) sprintf((b),"%.*g",(n),(x))
                                       ^~~~~~
../../perl.h:496:67: note: in definition of macro 'PERL_UNUSED_RESULT'
 #    define PERL_UNUSED_RESULT(v) STMT_START { __typeof__(v) z = (v); (void)sizeof(z); } STMT_END
                                                                   ^
APItest.xs:6801:28: note: in expansion of macro 'Gconvert'
         PERL_UNUSED_RESULT(Gconvert(SvNV(number), len,
                            ^~~~~~~~
../../config.h:909:39: note: assuming directive output of 105 bytes
 #define Gconvert(x,n,t,b) sprintf((b),"%.*g",(n),(x))
                                       ^~~~~~
../../perl.h:496:67: note: in definition of macro 'PERL_UNUSED_RESULT'
 #    define PERL_UNUSED_RESULT(v) STMT_START { __typeof__(v) z = (v); (void)sizeof(z); } STMT_END
                                                                   ^
APItest.xs:6801:28: note: in expansion of macro 'Gconvert'
         PERL_UNUSED_RESULT(Gconvert(SvNV(number), len,
                            ^~~~~~~~
../../config.h:909:27: note: 'sprintf' output between 2 and 107 bytes into a destination of size 100
 #define Gconvert(x,n,t,b) sprintf((b),"%.*g",(n),(x))
../../perl.h:496:67: note: in definition of macro 'PERL_UNUSED_RESULT'
 #    define PERL_UNUSED_RESULT(v) STMT_START { __typeof__(v) z = (v); (void)sizeof(z); } STMT_END
                                                                   ^
APItest.xs:6801:28: note: in expansion of macro 'Gconvert'
         PERL_UNUSED_RESULT(Gconvert(SvNV(number), len,
                            ^~~~~~~~
[2020-07-30 12:12:22-0400] Skip tests from '/home/core/smoke/TestSmoke/smokecurrent.skiptests'
[2020-07-30 12:12:22-0400] 
[2020-07-30 12:12:22-0400]  Tests start here:
[2020-07-30 12:12:22-0400] TSTENV = stdio	
# Failed test 30 - atime: default case at io/fs.t line 529
# Failed test 31 - mtime: default case at io/fs.t line 530
# Failed test 36 - atime: default case at io/fs.t line 529
# Failed test 37 - mtime: default case at io/fs.t line 530
# Will use Digest::MD5

#   Failed test 'atime set correctly'
#   at t/utime.t line 150.
#          got: '2.222222'
#     expected: '1.111111111'

#   Failed test 'mtime set correctly'
#   at t/utime.t line 152.
#          got: '2.222222'
#     expected: '2.222222222'

#   Failed test 'atime set correctly'
#   at t/utime.t line 162.
#          got: '2.222222'
#     expected: '1.111111111'

#   Failed test 'mtime set correctly'
#   at t/utime.t line 164.
#          got: '2.222222'
#     expected: '2.222222222'

#   Failed test 'File 1 atime set correctly'
#   at t/utime.t line 189.
#          got: '2.222222'
#     expected: '1.111111111'

#   Failed test 'File 1 mtime set correctly'
#   at t/utime.t line 191.
#          got: '2.222222'
#     expected: '2.222222222'

#   Failed test 'File 2 atime set correctly'
#   at t/utime.t line 197.
#          got: '2.222222'
#     expected: '1.111111111'

#   Failed test 'File 2 mtime set correctly'
#   at t/utime.t line 199.
#          got: '2.222222'
#     expected: '2.222222222'
# Looks like you failed 8 tests of 22.

#   Failed test 'and set errno to ENOTTY'
#   at t/termios.t line 74.
#          got: 45
#     expected: 25

#   Failed test 'and set errno to ENOTTY'
#   at t/termios.t line 79.
#          got: 45
#     expected: 25

#   Failed test 'and set errno to ENOTTY'
#   at t/termios.t line 163.
#          got: 45
#     expected: 25

#   Failed test 'and set errno to ENOTTY'
#   at t/termios.t line 167.
#          got: 45
#     expected: 25

#   Failed test 'and set errno to ENOTTY'
#   at t/termios.t line 172.
#          got: 45
#     expected: 25

#   Failed test 'and set errno to ENOTTY'
#   at t/termios.t line 177.
#          got: 45
#     expected: 25
# Looks like you failed 6 tests of 1595.

error while running harness target 'test_harness': 1 at /home/core/smoke/TestSmoke/Test/Smoke/App/RunSmoke.pm line 118.
[2020-07-30 12:41:27-0400] 
[2020-07-30 12:41:27-0400] ../t/io/fs.t................................................FAILED
[2020-07-30 12:41:27-0400]     30-31, 36-37
[2020-07-30 12:41:27-0400] ../dist/Time-HiRes/t/utime.t................................FAILED
[2020-07-30 12:41:27-0400]     2-3, 5-6, 12-15
[2020-07-30 12:41:27-0400] ../dist/Time-HiRes/t/utime.t................................FAILED
[2020-07-30 12:41:27-0400]     Non-zero exit status: 8
[2020-07-30 12:41:27-0400] ../ext/POSIX/t/termios.t....................................FAILED
[2020-07-30 12:41:27-0400]     74, 76, 1589, 1591, 1593, 1595
[2020-07-30 12:41:27-0400] ../ext/POSIX/t/termios.t....................................FAILED
[2020-07-30 12:41:27-0400]     Non-zero exit status: 6
[2020-07-30 12:41:27-0400] Archived results...
[2020-07-30 12:41:27-0400] Unskip tests from '/home/core/smoke/TestSmoke/smokecurrent.skiptests'
[2020-07-30 12:41:27-0400] 
[2020-07-30 12:41:27-0400] Configuration: -Dusedevel -Dcc=gcc -Duseithreads -DDEBUGGING
[2020-07-30 12:41:27-0400] ------------------------------------------------------------------------------
[2020-07-30 12:41:27-0400] make distclean ...
[2020-07-30 12:41:50-0400] 
[2020-07-30 12:41:50-0400] Copy Policy.sh ...
[2020-07-30 12:41:50-0400] 
[2020-07-30 12:41:50-0400] Configure ...
[2020-07-30 12:43:13-0400] 
[2020-07-30 12:43:13-0400] make ...
In file included from sv.c:32:
sv.c: In function 'Perl_sv_vcatpvfn_flags':
config.h:909:39: warning: '%.*g' directive writing between 1 and 133 bytes into a region of size 127 [-Wformat-overflow=]
 #define Gconvert(x,n,t,b) sprintf((b),"%.*g",(n),(x))
                                       ^~~~~~
perl.h:6834:13: note: in definition of macro 'WITH_LC_NUMERIC_SET_TO_NEEDED_IN'
             block;                                                          \
             ^~~~~
sv.c:48:5: note: in expansion of macro 'PERL_UNUSED_RESULT'
     PERL_UNUSED_RESULT(Gconvert((NV)(nv), (int)ndig, 0, buffer))
     ^~~~~~~~~~~~~~~~~~
sv.c:48:24: note: in expansion of macro 'Gconvert'
     PERL_UNUSED_RESULT(Gconvert((NV)(nv), (int)ndig, 0, buffer))
                        ^~~~~~~~
sv.c:13128:21: note: in expansion of macro 'SNPRINTF_G'
                     SNPRINTF_G(fv, ebuf, sizeof(ebuf), precis)
                     ^~~~~~~~~~
config.h:909:39: note: assuming directive output of 132 bytes
 #define Gconvert(x,n,t,b) sprintf((b),"%.*g",(n),(x))
                                       ^~~~~~
perl.h:6834:13: note: in definition of macro 'WITH_LC_NUMERIC_SET_TO_NEEDED_IN'
             block;                                                          \
             ^~~~~
sv.c:48:5: note: in expansion of macro 'PERL_UNUSED_RESULT'
     PERL_UNUSED_RESULT(Gconvert((NV)(nv), (int)ndig, 0, buffer))
     ^~~~~~~~~~~~~~~~~~
sv.c:48:24: note: in expansion of macro 'Gconvert'
     PERL_UNUSED_RESULT(Gconvert((NV)(nv), (int)ndig, 0, buffer))
                        ^~~~~~~~
sv.c:13128:21: note: in expansion of macro 'SNPRINTF_G'
                     SNPRINTF_G(fv, ebuf, sizeof(ebuf), precis)
                     ^~~~~~~~~~
config.h:909:27: note: 'sprintf' output between 2 and 134 bytes into a destination of size 127
 #define Gconvert(x,n,t,b) sprintf((b),"%.*g",(n),(x))
perl.h:6834:13: note: in definition of macro 'WITH_LC_NUMERIC_SET_TO_NEEDED_IN'
             block;                                                          \
             ^~~~~
sv.c:48:5: note: in expansion of macro 'PERL_UNUSED_RESULT'
     PERL_UNUSED_RESULT(Gconvert((NV)(nv), (int)ndig, 0, buffer))
     ^~~~~~~~~~~~~~~~~~
sv.c:48:24: note: in expansion of macro 'Gconvert'
     PERL_UNUSED_RESULT(Gconvert((NV)(nv), (int)ndig, 0, buffer))
                        ^~~~~~~~
sv.c:13128:21: note: in expansion of macro 'SNPRINTF_G'
                     SNPRINTF_G(fv, ebuf, sizeof(ebuf), precis)
                     ^~~~~~~~~~
config.h:909:39: warning: '%.*g' directive writing between 1 and 133 bytes into a region of size 127 [-Wformat-overflow=]
 #define Gconvert(x,n,t,b) sprintf((b),"%.*g",(n),(x))
                                       ^~~~~~
perl.h:6834:13: note: in definition of macro 'WITH_LC_NUMERIC_SET_TO_NEEDED_IN'
             block;                                                          \
             ^~~~~
sv.c:48:5: note: in expansion of macro 'PERL_UNUSED_RESULT'
     PERL_UNUSED_RESULT(Gconvert((NV)(nv), (int)ndig, 0, buffer))
     ^~~~~~~~~~~~~~~~~~
sv.c:48:24: note: in expansion of macro 'Gconvert'
     PERL_UNUSED_RESULT(Gconvert((NV)(nv), (int)ndig, 0, buffer))
                        ^~~~~~~~
sv.c:13128:21: note: in expansion of macro 'SNPRINTF_G'
                     SNPRINTF_G(fv, ebuf, sizeof(ebuf), precis)
                     ^~~~~~~~~~
config.h:909:39: note: assuming directive output of 132 bytes
 #define Gconvert(x,n,t,b) sprintf((b),"%.*g",(n),(x))
                                       ^~~~~~
perl.h:6834:13: note: in definition of macro 'WITH_LC_NUMERIC_SET_TO_NEEDED_IN'
             block;                                                          \
             ^~~~~
sv.c:48:5: note: in expansion of macro 'PERL_UNUSED_RESULT'
     PERL_UNUSED_RESULT(Gconvert((NV)(nv), (int)ndig, 0, buffer))
     ^~~~~~~~~~~~~~~~~~
sv.c:48:24: note: in expansion of macro 'Gconvert'
     PERL_UNUSED_RESULT(Gconvert((NV)(nv), (int)ndig, 0, buffer))
                        ^~~~~~~~
sv.c:13128:21: note: in expansion of macro 'SNPRINTF_G'
                     SNPRINTF_G(fv, ebuf, sizeof(ebuf), precis)
                     ^~~~~~~~~~
config.h:909:27: note: 'sprintf' output between 2 and 134 bytes into a destination of size 127
 #define Gconvert(x,n,t,b) sprintf((b),"%.*g",(n),(x))
perl.h:6834:13: note: in definition of macro 'WITH_LC_NUMERIC_SET_TO_NEEDED_IN'
             block;                                                          \
             ^~~~~
sv.c:48:5: note: in expansion of macro 'PERL_UNUSED_RESULT'
     PERL_UNUSED_RESULT(Gconvert((NV)(nv), (int)ndig, 0, buffer))
     ^~~~~~~~~~~~~~~~~~
sv.c:48:24: note: in expansion of macro 'Gconvert'
     PERL_UNUSED_RESULT(Gconvert((NV)(nv), (int)ndig, 0, buffer))
                        ^~~~~~~~
sv.c:13128:21: note: in expansion of macro 'SNPRINTF_G'
                     SNPRINTF_G(fv, ebuf, sizeof(ebuf), precis)
                     ^~~~~~~~~~
time64.c: In function 'Perl_localtime64_r':
time64.c:573:30: warning: 'orig_year' may be used uninitialized in this function [-Wmaybe-uninitialized]
             local_tm->tm_year++;
             ~~~~~~~~~~~~~~~~~^~
Warning (mostly harmless): No library found for -ldb
DB_File.xs: In function 'ParseOpenInfo':
DB_File.xs:476:44: warning: suggest braces around empty body in an 'if' statement [-Wempty-body]
         if (RETVAL->dbp) err_close(RETVAL) ;                           \
                                            ^
DB_File.xs:1044:13: note: in expansion of macro 'croak_and_free'
             croak_and_free("type parameter is not a reference") ;
             ^~~~~~~~~~~~~~
DB_File.xs:476:44: warning: suggest braces around empty body in an 'if' statement [-Wempty-body]
         if (RETVAL->dbp) err_close(RETVAL) ;                           \
                                            ^
DB_File.xs:1050:13: note: in expansion of macro 'croak_and_free'
             croak_and_free("internal error") ;
             ^~~~~~~~~~~~~~
DB_File.xs:476:44: warning: suggest braces around empty body in an 'if' statement [-Wempty-body]
         if (RETVAL->dbp) err_close(RETVAL) ;                           \
                                            ^
DB_File.xs:1056:17: note: in expansion of macro 'croak_and_free'
                 croak_and_free("DB_File can only tie an associative array to a DB_HASH database") ;
                 ^~~~~~~~~~~~~~
DB_File.xs:476:44: warning: suggest braces around empty body in an 'if' statement [-Wempty-body]
         if (RETVAL->dbp) err_close(RETVAL) ;                           \
                                            ^
DB_File.xs:1091:17: note: in expansion of macro 'croak_and_free'
                 croak_and_free("DB_File can only tie an associative array to a DB_BTREE database");
                 ^~~~~~~~~~~~~~
DB_File.xs:476:44: warning: suggest braces around empty body in an 'if' statement [-Wempty-body]
         if (RETVAL->dbp) err_close(RETVAL) ;                           \
                                            ^
DB_File.xs:1140:17: note: in expansion of macro 'croak_and_free'
                 croak_and_free("DB_File can only tie an array to a DB_RECNO database");
                 ^~~~~~~~~~~~~~
DB_File.xs:476:44: warning: suggest braces around empty body in an 'if' statement [-Wempty-body]
         if (RETVAL->dbp) err_close(RETVAL) ;                           \
                                            ^
DB_File.xs:1229:13: note: in expansion of macro 'croak_and_free'
             croak_and_free("type is not of type DB_File::HASHINFO, DB_File::BTREEINFO or DB_File::RECNOINFO");
             ^~~~~~~~~~~~~~
In file included from ../../perl.h:5611,
                 from ListUtil.xs:8:
ListUtil.c: In function 'XS_List__Util_reduce':
../../embed.h:59:23: warning: 'retvals' may be used uninitialized in this function [-Wmaybe-uninitialized]
 #define av_push(a,b)  Perl_av_push(aTHX_ a,b)
                       ^~~~~~~~~~~~
ListUtil.xs:530:9: note: 'retvals' was declared here
     AV *retvals;
         ^~~~~~~
Warning (mostly harmless): No library found for -lndbm
Warning (mostly harmless): No library found for -ldbm
Warning (mostly harmless): No library found for -lucb
In file included from ../../perl.h:5611,
                 from Opcode.xs:3:
Opcode.xs: In function 'opmask_addlocal':
Opcode.xs:240:17: warning: cast between incompatible function types from 'void (*)(PerlInterpreter *, const char *, ...)' {aka 'void (*)(struct interpreter *, const char *, ...)'} to 'void (*)(void *)' [-Wcast-function-type]
  SAVEDESTRUCTOR((void(*)(void*))Perl_warn,"PL_op_mask restored");
                 ^
../../embed.h:496:57: note: in definition of macro 'save_destructor'
 #define save_destructor(a,b) Perl_save_destructor(aTHX_ a,b)
                                                         ^
Opcode.xs:240:2: note: in expansion of macro 'SAVEDESTRUCTOR'
  SAVEDESTRUCTOR((void(*)(void*))Perl_warn,"PL_op_mask restored");
  ^~~~~~~~~~~~~~
Warning (mostly harmless): No library found for -lposix
Warning (mostly harmless): No library found for -lcposix
Socket.c: In function 'XS_Socket_pack_ip_mreq_source':
Socket.c:1673:7: warning: variable 'interface' set but not used [-Wunused-but-set-variable]
  SV * interface;
       ^~~~~~~~~
Making header files for XS...
In file included from APItest.xs:10:
APItest.c: In function 'XS_XS__APItest__Magic_test_Gconvert':
../../config.h:909:39: warning: '%.*g' directive writing between 1 and 106 bytes into a region of size 100 [-Wformat-overflow=]
 #define Gconvert(x,n,t,b) sprintf((b),"%.*g",(n),(x))
                                       ^~~~~~
../../perl.h:496:67: note: in definition of macro 'PERL_UNUSED_RESULT'
 #    define PERL_UNUSED_RESULT(v) STMT_START { __typeof__(v) z = (v); (void)sizeof(z); } STMT_END
                                                                   ^
APItest.xs:6801:28: note: in expansion of macro 'Gconvert'
         PERL_UNUSED_RESULT(Gconvert(SvNV(number), len,
                            ^~~~~~~~
../../config.h:909:39: note: assuming directive output of 105 bytes
 #define Gconvert(x,n,t,b) sprintf((b),"%.*g",(n),(x))
                                       ^~~~~~
../../perl.h:496:67: note: in definition of macro 'PERL_UNUSED_RESULT'
 #    define PERL_UNUSED_RESULT(v) STMT_START { __typeof__(v) z = (v); (void)sizeof(z); } STMT_END
                                                                   ^
APItest.xs:6801:28: note: in expansion of macro 'Gconvert'
         PERL_UNUSED_RESULT(Gconvert(SvNV(number), len,
                            ^~~~~~~~
../../config.h:909:27: note: 'sprintf' output between 2 and 107 bytes into a destination of size 100
 #define Gconvert(x,n,t,b) sprintf((b),"%.*g",(n),(x))
../../perl.h:496:67: note: in definition of macro 'PERL_UNUSED_RESULT'
 #    define PERL_UNUSED_RESULT(v) STMT_START { __typeof__(v) z = (v); (void)sizeof(z); } STMT_END
                                                                   ^
APItest.xs:6801:28: note: in expansion of macro 'Gconvert'
         PERL_UNUSED_RESULT(Gconvert(SvNV(number), len,
                            ^~~~~~~~
[2020-07-30 12:53:45-0400] Skip tests from '/home/core/smoke/TestSmoke/smokecurrent.skiptests'
[2020-07-30 12:53:45-0400] 
[2020-07-30 12:53:45-0400]  Tests start here:
[2020-07-30 12:53:45-0400] TSTENV = stdio	
# Failed test 30 - atime: default case at io/fs.t line 529
# Failed test 31 - mtime: default case at io/fs.t line 530
# Failed test 36 - atime: default case at io/fs.t line 529
# Failed test 37 - mtime: default case at io/fs.t line 530
# Will use Digest::MD5

#   Failed test 'atime set correctly'
#   at t/utime.t line 150.
#          got: '2.222222'
#     expected: '1.111111111'

#   Failed test 'mtime set correctly'
#   at t/utime.t line 152.
#          got: '2.222222'
#     expected: '2.222222222'

#   Failed test 'atime set correctly'
#   at t/utime.t line 162.
#          got: '2.222222'
#     expected: '1.111111111'

#   Failed test 'mtime set correctly'
#   at t/utime.t line 164.
#          got: '2.222222'
#     expected: '2.222222222'

#   Failed test 'File 1 atime set correctly'
#   at t/utime.t line 189.
#          got: '2.222222'
#     expected: '1.111111111'

#   Failed test 'File 1 mtime set correctly'
#   at t/utime.t line 191.
#          got: '2.222222'
#     expected: '2.222222222'

#   Failed test 'File 2 atime set correctly'
#   at t/utime.t line 197.
#          got: '2.222222'
#     expected: '1.111111111'

#   Failed test 'File 2 mtime set correctly'
#   at t/utime.t line 199.
#          got: '2.222222'
#     expected: '2.222222222'
# Looks like you failed 8 tests of 22.

#   Failed test 'and set errno to ENOTTY'
#   at t/termios.t line 74.
#          got: 45
#     expected: 25

#   Failed test 'and set errno to ENOTTY'
#   at t/termios.t line 79.
#          got: 45
#     expected: 25

#   Failed test 'and set errno to ENOTTY'
#   at t/termios.t line 163.
#          got: 45
#     expected: 25

#   Failed test 'and set errno to ENOTTY'
#   at t/termios.t line 167.
#          got: 45
#     expected: 25

#   Failed test 'and set errno to ENOTTY'
#   at t/termios.t line 172.
#          got: 45
#     expected: 25

#   Failed test 'and set errno to ENOTTY'
#   at t/termios.t line 177.
#          got: 45
#     expected: 25
# Looks like you failed 6 tests of 1595.

error while running harness target 'test_harness': 1 at /home/core/smoke/TestSmoke/Test/Smoke/App/RunSmoke.pm line 118.
[2020-07-30 13:33:16-0400] 
[2020-07-30 13:33:16-0400] ../t/io/fs.t................................................FAILED
[2020-07-30 13:33:16-0400]     30-31, 36-37
[2020-07-30 13:33:16-0400] ../dist/Time-HiRes/t/utime.t................................FAILED
[2020-07-30 13:33:16-0400]     2-3, 5-6, 12-15
[2020-07-30 13:33:16-0400] ../dist/Time-HiRes/t/utime.t................................FAILED
[2020-07-30 13:33:16-0400]     Non-zero exit status: 8
[2020-07-30 13:33:16-0400] ../ext/POSIX/t/termios.t....................................FAILED
[2020-07-30 13:33:16-0400]     74, 76, 1589, 1591, 1593, 1595
[2020-07-30 13:33:16-0400] ../ext/POSIX/t/termios.t....................................FAILED
[2020-07-30 13:33:16-0400]     Non-zero exit status: 6
[2020-07-30 13:33:16-0400] Archived results...
[2020-07-30 13:33:16-0400] Unskip tests from '/home/core/smoke/TestSmoke/smokecurrent.skiptests'
[2020-07-30 13:33:16-0400] 
[2020-07-30 13:33:16-0400] Configuration: -Dusedevel -Dcc=gcc -Duseithreads -Duse64bitall
[2020-07-30 13:33:16-0400] ------------------------------------------------------------------------------
[2020-07-30 13:33:16-0400] make distclean ...
[2020-07-30 13:33:46-0400] 
[2020-07-30 13:33:46-0400] Copy Policy.sh ...
[2020-07-30 13:33:46-0400] 
[2020-07-30 13:33:46-0400] Configure ...
[2020-07-30 13:35:05-0400] 
[2020-07-30 13:35:05-0400] make ...
In file included from sv.c:32:
sv.c: In function 'Perl_sv_vcatpvfn_flags':
config.h:909:39: warning: '%.*g' directive writing between 1 and 133 bytes into a region of size 127 [-Wformat-overflow=]
 #define Gconvert(x,n,t,b) sprintf((b),"%.*g",(n),(x))
                                       ^~~~~~
perl.h:6834:13: note: in definition of macro 'WITH_LC_NUMERIC_SET_TO_NEEDED_IN'
             block;                                                          \
             ^~~~~
sv.c:48:5: note: in expansion of macro 'PERL_UNUSED_RESULT'
     PERL_UNUSED_RESULT(Gconvert((NV)(nv), (int)ndig, 0, buffer))
     ^~~~~~~~~~~~~~~~~~
sv.c:48:24: note: in expansion of macro 'Gconvert'
     PERL_UNUSED_RESULT(Gconvert((NV)(nv), (int)ndig, 0, buffer))
                        ^~~~~~~~
sv.c:13128:21: note: in expansion of macro 'SNPRINTF_G'
                     SNPRINTF_G(fv, ebuf, sizeof(ebuf), precis)
                     ^~~~~~~~~~
config.h:909:39: note: assuming directive output of 132 bytes
 #define Gconvert(x,n,t,b) sprintf((b),"%.*g",(n),(x))
                                       ^~~~~~
perl.h:6834:13: note: in definition of macro 'WITH_LC_NUMERIC_SET_TO_NEEDED_IN'
             block;                                                          \
             ^~~~~
sv.c:48:5: note: in expansion of macro 'PERL_UNUSED_RESULT'
     PERL_UNUSED_RESULT(Gconvert((NV)(nv), (int)ndig, 0, buffer))
     ^~~~~~~~~~~~~~~~~~
sv.c:48:24: note: in expansion of macro 'Gconvert'
     PERL_UNUSED_RESULT(Gconvert((NV)(nv), (int)ndig, 0, buffer))
                        ^~~~~~~~
sv.c:13128:21: note: in expansion of macro 'SNPRINTF_G'
                     SNPRINTF_G(fv, ebuf, sizeof(ebuf), precis)
                     ^~~~~~~~~~
config.h:909:27: note: 'sprintf' output between 2 and 134 bytes into a destination of size 127
 #define Gconvert(x,n,t,b) sprintf((b),"%.*g",(n),(x))
perl.h:6834:13: note: in definition of macro 'WITH_LC_NUMERIC_SET_TO_NEEDED_IN'
             block;                                                          \
             ^~~~~
sv.c:48:5: note: in expansion of macro 'PERL_UNUSED_RESULT'
     PERL_UNUSED_RESULT(Gconvert((NV)(nv), (int)ndig, 0, buffer))
     ^~~~~~~~~~~~~~~~~~
sv.c:48:24: note: in expansion of macro 'Gconvert'
     PERL_UNUSED_RESULT(Gconvert((NV)(nv), (int)ndig, 0, buffer))
                        ^~~~~~~~
sv.c:13128:21: note: in expansion of macro 'SNPRINTF_G'
                     SNPRINTF_G(fv, ebuf, sizeof(ebuf), precis)
                     ^~~~~~~~~~
config.h:909:39: warning: '%.*g' directive writing between 1 and 133 bytes into a region of size 127 [-Wformat-overflow=]
 #define Gconvert(x,n,t,b) sprintf((b),"%.*g",(n),(x))
                                       ^~~~~~
perl.h:6834:13: note: in definition of macro 'WITH_LC_NUMERIC_SET_TO_NEEDED_IN'
             block;                                                          \
             ^~~~~
sv.c:48:5: note: in expansion of macro 'PERL_UNUSED_RESULT'
     PERL_UNUSED_RESULT(Gconvert((NV)(nv), (int)ndig, 0, buffer))
     ^~~~~~~~~~~~~~~~~~
sv.c:48:24: note: in expansion of macro 'Gconvert'
     PERL_UNUSED_RESULT(Gconvert((NV)(nv), (int)ndig, 0, buffer))
                        ^~~~~~~~
sv.c:13128:21: note: in expansion of macro 'SNPRINTF_G'
                     SNPRINTF_G(fv, ebuf, sizeof(ebuf), precis)
                     ^~~~~~~~~~
config.h:909:39: note: assuming directive output of 132 bytes
 #define Gconvert(x,n,t,b) sprintf((b),"%.*g",(n),(x))
                                       ^~~~~~
perl.h:6834:13: note: in definition of macro 'WITH_LC_NUMERIC_SET_TO_NEEDED_IN'
             block;                                                          \
             ^~~~~
sv.c:48:5: note: in expansion of macro 'PERL_UNUSED_RESULT'
     PERL_UNUSED_RESULT(Gconvert((NV)(nv), (int)ndig, 0, buffer))
     ^~~~~~~~~~~~~~~~~~
sv.c:48:24: note: in expansion of macro 'Gconvert'
     PERL_UNUSED_RESULT(Gconvert((NV)(nv), (int)ndig, 0, buffer))
                        ^~~~~~~~
sv.c:13128:21: note: in expansion of macro 'SNPRINTF_G'
                     SNPRINTF_G(fv, ebuf, sizeof(ebuf), precis)
                     ^~~~~~~~~~
config.h:909:27: note: 'sprintf' output between 2 and 134 bytes into a destination of size 127
 #define Gconvert(x,n,t,b) sprintf((b),"%.*g",(n),(x))
perl.h:6834:13: note: in definition of macro 'WITH_LC_NUMERIC_SET_TO_NEEDED_IN'
             block;                                                          \
             ^~~~~
sv.c:48:5: note: in expansion of macro 'PERL_UNUSED_RESULT'
     PERL_UNUSED_RESULT(Gconvert((NV)(nv), (int)ndig, 0, buffer))
     ^~~~~~~~~~~~~~~~~~
sv.c:48:24: note: in expansion of macro 'Gconvert'
     PERL_UNUSED_RESULT(Gconvert((NV)(nv), (int)ndig, 0, buffer))
                        ^~~~~~~~
sv.c:13128:21: note: in expansion of macro 'SNPRINTF_G'
                     SNPRINTF_G(fv, ebuf, sizeof(ebuf), precis)
                     ^~~~~~~~~~
time64.c: In function 'Perl_localtime64_r':
time64.c:573:30: warning: 'orig_year' may be used uninitialized in this function [-Wmaybe-uninitialized]
             local_tm->tm_year++;
             ~~~~~~~~~~~~~~~~~^~
Warning (mostly harmless): No library found for -ldb
DB_File.xs: In function 'ParseOpenInfo':
DB_File.xs:476:44: warning: suggest braces around empty body in an 'if' statement [-Wempty-body]
         if (RETVAL->dbp) err_close(RETVAL) ;                           \
                                            ^
DB_File.xs:1044:13: note: in expansion of macro 'croak_and_free'
             croak_and_free("type parameter is not a reference") ;
             ^~~~~~~~~~~~~~
DB_File.xs:476:44: warning: suggest braces around empty body in an 'if' statement [-Wempty-body]
         if (RETVAL->dbp) err_close(RETVAL) ;                           \
                                            ^
DB_File.xs:1050:13: note: in expansion of macro 'croak_and_free'
             croak_and_free("internal error") ;
             ^~~~~~~~~~~~~~
DB_File.xs:476:44: warning: suggest braces around empty body in an 'if' statement [-Wempty-body]
         if (RETVAL->dbp) err_close(RETVAL) ;                           \
                                            ^
DB_File.xs:1056:17: note: in expansion of macro 'croak_and_free'
                 croak_and_free("DB_File can only tie an associative array to a DB_HASH database") ;
                 ^~~~~~~~~~~~~~
DB_File.xs:476:44: warning: suggest braces around empty body in an 'if' statement [-Wempty-body]
         if (RETVAL->dbp) err_close(RETVAL) ;                           \
                                            ^
DB_File.xs:1091:17: note: in expansion of macro 'croak_and_free'
                 croak_and_free("DB_File can only tie an associative array to a DB_BTREE database");
                 ^~~~~~~~~~~~~~
DB_File.xs:476:44: warning: suggest braces around empty body in an 'if' statement [-Wempty-body]
         if (RETVAL->dbp) err_close(RETVAL) ;                           \
                                            ^
DB_File.xs:1140:17: note: in expansion of macro 'croak_and_free'
                 croak_and_free("DB_File can only tie an array to a DB_RECNO database");
                 ^~~~~~~~~~~~~~
DB_File.xs:476:44: warning: suggest braces around empty body in an 'if' statement [-Wempty-body]
         if (RETVAL->dbp) err_close(RETVAL) ;                           \
                                            ^
DB_File.xs:1229:13: note: in expansion of macro 'croak_and_free'
             croak_and_free("type is not of type DB_File::HASHINFO, DB_File::BTREEINFO or DB_File::RECNOINFO");
             ^~~~~~~~~~~~~~
Warning (mostly harmless): No library found for -lndbm
Warning (mostly harmless): No library found for -ldbm
Warning (mostly harmless): No library found for -lucb
In file included from ../../perl.h:5611,
                 from Opcode.xs:3:
Opcode.xs: In function 'opmask_addlocal':
Opcode.xs:240:17: warning: cast between incompatible function types from 'void (*)(PerlInterpreter *, const char *, ...)' {aka 'void (*)(struct interpreter *, const char *, ...)'} to 'void (*)(void *)' [-Wcast-function-type]
  SAVEDESTRUCTOR((void(*)(void*))Perl_warn,"PL_op_mask restored");
                 ^
../../embed.h:496:57: note: in definition of macro 'save_destructor'
 #define save_destructor(a,b) Perl_save_destructor(aTHX_ a,b)
                                                         ^
Opcode.xs:240:2: note: in expansion of macro 'SAVEDESTRUCTOR'
  SAVEDESTRUCTOR((void(*)(void*))Perl_warn,"PL_op_mask restored");
  ^~~~~~~~~~~~~~
Warning (mostly harmless): No library found for -lposix
Warning (mostly harmless): No library found for -lcposix
Socket.c: In function 'XS_Socket_pack_ip_mreq_source':
Socket.c:1673:7: warning: variable 'interface' set but not used [-Wunused-but-set-variable]
  SV * interface;
       ^~~~~~~~~
Making header files for XS...
In file included from APItest.xs:10:
APItest.c: In function 'XS_XS__APItest__Magic_test_Gconvert':
../../config.h:909:39: warning: '%.*g' directive writing between 1 and 106 bytes into a region of size 100 [-Wformat-overflow=]
 #define Gconvert(x,n,t,b) sprintf((b),"%.*g",(n),(x))
                                       ^~~~~~
../../perl.h:496:67: note: in definition of macro 'PERL_UNUSED_RESULT'
 #    define PERL_UNUSED_RESULT(v) STMT_START { __typeof__(v) z = (v); (void)sizeof(z); } STMT_END
                                                                   ^
APItest.xs:6801:28: note: in expansion of macro 'Gconvert'
         PERL_UNUSED_RESULT(Gconvert(SvNV(number), len,
                            ^~~~~~~~
../../config.h:909:39: note: assuming directive output of 105 bytes
 #define Gconvert(x,n,t,b) sprintf((b),"%.*g",(n),(x))
                                       ^~~~~~
../../perl.h:496:67: note: in definition of macro 'PERL_UNUSED_RESULT'
 #    define PERL_UNUSED_RESULT(v) STMT_START { __typeof__(v) z = (v); (void)sizeof(z); } STMT_END
                                                                   ^
APItest.xs:6801:28: note: in expansion of macro 'Gconvert'
         PERL_UNUSED_RESULT(Gconvert(SvNV(number), len,
                            ^~~~~~~~
../../config.h:909:27: note: 'sprintf' output between 2 and 107 bytes into a destination of size 100
 #define Gconvert(x,n,t,b) sprintf((b),"%.*g",(n),(x))
../../perl.h:496:67: note: in definition of macro 'PERL_UNUSED_RESULT'
 #    define PERL_UNUSED_RESULT(v) STMT_START { __typeof__(v) z = (v); (void)sizeof(z); } STMT_END
                                                                   ^
APItest.xs:6801:28: note: in expansion of macro 'Gconvert'
         PERL_UNUSED_RESULT(Gconvert(SvNV(number), len,
                            ^~~~~~~~
[2020-07-30 13:41:57-0400] Skip tests from '/home/core/smoke/TestSmoke/smokecurrent.skiptests'
[2020-07-30 13:41:57-0400] 
[2020-07-30 13:41:57-0400]  Tests start here:
[2020-07-30 13:41:57-0400] TSTENV = stdio	
# Failed test 30 - atime: default case at io/fs.t line 529
# Failed test 31 - mtime: default case at io/fs.t line 530
# Failed test 36 - atime: default case at io/fs.t line 529
# Failed test 37 - mtime: default case at io/fs.t line 530
# Will use Digest::MD5

#   Failed test 'atime set correctly'
#   at t/utime.t line 150.
#          got: '2.222222'
#     expected: '1.111111111'

#   Failed test 'mtime set correctly'
#   at t/utime.t line 152.
#          got: '2.222222'
#     expected: '2.222222222'

#   Failed test 'atime set correctly'
#   at t/utime.t line 162.
#          got: '2.222222'
#     expected: '1.111111111'

#   Failed test 'mtime set correctly'
#   at t/utime.t line 164.
#          got: '2.222222'
#     expected: '2.222222222'

#   Failed test 'File 1 atime set correctly'
#   at t/utime.t line 189.
#          got: '2.222222'
#     expected: '1.111111111'

#   Failed test 'File 1 mtime set correctly'
#   at t/utime.t line 191.
#          got: '2.222222'
#     expected: '2.222222222'

#   Failed test 'File 2 atime set correctly'
#   at t/utime.t line 197.
#          got: '2.222222'
#     expected: '1.111111111'

#   Failed test 'File 2 mtime set correctly'
#   at t/utime.t line 199.
#          got: '2.222222'
#     expected: '2.222222222'
# Looks like you failed 8 tests of 22.

#   Failed test 'and set errno to ENOTTY'
#   at t/termios.t line 74.
#          got: 45
#     expected: 25

#   Failed test 'and set errno to ENOTTY'
#   at t/termios.t line 79.
#          got: 45
#     expected: 25

#   Failed test 'and set errno to ENOTTY'
#   at t/termios.t line 163.
#          got: 45
#     expected: 25

#   Failed test 'and set errno to ENOTTY'
#   at t/termios.t line 167.
#          got: 45
#     expected: 25

#   Failed test 'and set errno to ENOTTY'
#   at t/termios.t line 172.
#          got: 45
#     expected: 25

#   Failed test 'and set errno to ENOTTY'
#   at t/termios.t line 177.
#          got: 45
#     expected: 25
# Looks like you failed 6 tests of 1595.

error while running harness target 'test_harness': 1 at /home/core/smoke/TestSmoke/Test/Smoke/App/RunSmoke.pm line 118.
[2020-07-30 14:11:11-0400] 
[2020-07-30 14:11:11-0400] ../t/io/fs.t................................................FAILED
[2020-07-30 14:11:11-0400]     30-31, 36-37
[2020-07-30 14:11:11-0400] ../dist/Time-HiRes/t/utime.t................................FAILED
[2020-07-30 14:11:11-0400]     2-3, 5-6, 12-15
[2020-07-30 14:11:11-0400] ../dist/Time-HiRes/t/utime.t................................FAILED
[2020-07-30 14:11:11-0400]     Non-zero exit status: 8
[2020-07-30 14:11:11-0400] ../ext/POSIX/t/termios.t....................................FAILED
[2020-07-30 14:11:11-0400]     74, 76, 1589, 1591, 1593, 1595
[2020-07-30 14:11:11-0400] ../ext/POSIX/t/termios.t....................................FAILED
[2020-07-30 14:11:11-0400]     Non-zero exit status: 6
[2020-07-30 14:11:11-0400] Archived results...
[2020-07-30 14:11:11-0400] Unskip tests from '/home/core/smoke/TestSmoke/smokecurrent.skiptests'
[2020-07-30 14:11:11-0400] 
[2020-07-30 14:11:11-0400] Configuration: -Dusedevel -Dcc=gcc -Duseithreads -Duse64bitall -DDEBUGGING
[2020-07-30 14:11:11-0400] ------------------------------------------------------------------------------
[2020-07-30 14:11:11-0400] make distclean ...
[2020-07-30 14:11:34-0400] 
[2020-07-30 14:11:34-0400] Copy Policy.sh ...
[2020-07-30 14:11:34-0400] 
[2020-07-30 14:11:34-0400] Configure ...
[2020-07-30 14:12:55-0400] 
[2020-07-30 14:12:55-0400] make ...
In file included from sv.c:32:
sv.c: In function 'Perl_sv_vcatpvfn_flags':
config.h:909:39: warning: '%.*g' directive writing between 1 and 133 bytes into a region of size 127 [-Wformat-overflow=]
 #define Gconvert(x,n,t,b) sprintf((b),"%.*g",(n),(x))
                                       ^~~~~~
perl.h:6834:13: note: in definition of macro 'WITH_LC_NUMERIC_SET_TO_NEEDED_IN'
             block;                                                          \
             ^~~~~
sv.c:48:5: note: in expansion of macro 'PERL_UNUSED_RESULT'
     PERL_UNUSED_RESULT(Gconvert((NV)(nv), (int)ndig, 0, buffer))
     ^~~~~~~~~~~~~~~~~~
sv.c:48:24: note: in expansion of macro 'Gconvert'
     PERL_UNUSED_RESULT(Gconvert((NV)(nv), (int)ndig, 0, buffer))
                        ^~~~~~~~
sv.c:13128:21: note: in expansion of macro 'SNPRINTF_G'
                     SNPRINTF_G(fv, ebuf, sizeof(ebuf), precis)
                     ^~~~~~~~~~
config.h:909:39: note: assuming directive output of 132 bytes
 #define Gconvert(x,n,t,b) sprintf((b),"%.*g",(n),(x))
                                       ^~~~~~
perl.h:6834:13: note: in definition of macro 'WITH_LC_NUMERIC_SET_TO_NEEDED_IN'
             block;                                                          \
             ^~~~~
sv.c:48:5: note: in expansion of macro 'PERL_UNUSED_RESULT'
     PERL_UNUSED_RESULT(Gconvert((NV)(nv), (int)ndig, 0, buffer))
     ^~~~~~~~~~~~~~~~~~
sv.c:48:24: note: in expansion of macro 'Gconvert'
     PERL_UNUSED_RESULT(Gconvert((NV)(nv), (int)ndig, 0, buffer))
                        ^~~~~~~~
sv.c:13128:21: note: in expansion of macro 'SNPRINTF_G'
                     SNPRINTF_G(fv, ebuf, sizeof(ebuf), precis)
                     ^~~~~~~~~~
config.h:909:27: note: 'sprintf' output between 2 and 134 bytes into a destination of size 127
 #define Gconvert(x,n,t,b) sprintf((b),"%.*g",(n),(x))
perl.h:6834:13: note: in definition of macro 'WITH_LC_NUMERIC_SET_TO_NEEDED_IN'
             block;                                                          \
             ^~~~~
sv.c:48:5: note: in expansion of macro 'PERL_UNUSED_RESULT'
     PERL_UNUSED_RESULT(Gconvert((NV)(nv), (int)ndig, 0, buffer))
     ^~~~~~~~~~~~~~~~~~
sv.c:48:24: note: in expansion of macro 'Gconvert'
     PERL_UNUSED_RESULT(Gconvert((NV)(nv), (int)ndig, 0, buffer))
                        ^~~~~~~~
sv.c:13128:21: note: in expansion of macro 'SNPRINTF_G'
                     SNPRINTF_G(fv, ebuf, sizeof(ebuf), precis)
                     ^~~~~~~~~~
config.h:909:39: warning: '%.*g' directive writing between 1 and 133 bytes into a region of size 127 [-Wformat-overflow=]
 #define Gconvert(x,n,t,b) sprintf((b),"%.*g",(n),(x))
                                       ^~~~~~
perl.h:6834:13: note: in definition of macro 'WITH_LC_NUMERIC_SET_TO_NEEDED_IN'
             block;                                                          \
             ^~~~~
sv.c:48:5: note: in expansion of macro 'PERL_UNUSED_RESULT'
     PERL_UNUSED_RESULT(Gconvert((NV)(nv), (int)ndig, 0, buffer))
     ^~~~~~~~~~~~~~~~~~
sv.c:48:24: note: in expansion of macro 'Gconvert'
     PERL_UNUSED_RESULT(Gconvert((NV)(nv), (int)ndig, 0, buffer))
                        ^~~~~~~~
sv.c:13128:21: note: in expansion of macro 'SNPRINTF_G'
                     SNPRINTF_G(fv, ebuf, sizeof(ebuf), precis)
                     ^~~~~~~~~~
config.h:909:39: note: assuming directive output of 132 bytes
 #define Gconvert(x,n,t,b) sprintf((b),"%.*g",(n),(x))
                                       ^~~~~~
perl.h:6834:13: note: in definition of macro 'WITH_LC_NUMERIC_SET_TO_NEEDED_IN'
             block;                                                          \
             ^~~~~
sv.c:48:5: note: in expansion of macro 'PERL_UNUSED_RESULT'
     PERL_UNUSED_RESULT(Gconvert((NV)(nv), (int)ndig, 0, buffer))
     ^~~~~~~~~~~~~~~~~~
sv.c:48:24: note: in expansion of macro 'Gconvert'
     PERL_UNUSED_RESULT(Gconvert((NV)(nv), (int)ndig, 0, buffer))
                        ^~~~~~~~
sv.c:13128:21: note: in expansion of macro 'SNPRINTF_G'
                     SNPRINTF_G(fv, ebuf, sizeof(ebuf), precis)
                     ^~~~~~~~~~
config.h:909:27: note: 'sprintf' output between 2 and 134 bytes into a destination of size 127
 #define Gconvert(x,n,t,b) sprintf((b),"%.*g",(n),(x))
perl.h:6834:13: note: in definition of macro 'WITH_LC_NUMERIC_SET_TO_NEEDED_IN'
             block;                                                          \
             ^~~~~
sv.c:48:5: note: in expansion of macro 'PERL_UNUSED_RESULT'
     PERL_UNUSED_RESULT(Gconvert((NV)(nv), (int)ndig, 0, buffer))
     ^~~~~~~~~~~~~~~~~~
sv.c:48:24: note: in expansion of macro 'Gconvert'
     PERL_UNUSED_RESULT(Gconvert((NV)(nv), (int)ndig, 0, buffer))
                        ^~~~~~~~
sv.c:13128:21: note: in expansion of macro 'SNPRINTF_G'
                     SNPRINTF_G(fv, ebuf, sizeof(ebuf), precis)
                     ^~~~~~~~~~
time64.c: In function 'Perl_localtime64_r':
time64.c:573:30: warning: 'orig_year' may be used uninitialized in this function [-Wmaybe-uninitialized]
             local_tm->tm_year++;
             ~~~~~~~~~~~~~~~~~^~
Warning (mostly harmless): No library found for -ldb
DB_File.xs: In function 'ParseOpenInfo':
DB_File.xs:476:44: warning: suggest braces around empty body in an 'if' statement [-Wempty-body]
         if (RETVAL->dbp) err_close(RETVAL) ;                           \
                                            ^
DB_File.xs:1044:13: note: in expansion of macro 'croak_and_free'
             croak_and_free("type parameter is not a reference") ;
             ^~~~~~~~~~~~~~
DB_File.xs:476:44: warning: suggest braces around empty body in an 'if' statement [-Wempty-body]
         if (RETVAL->dbp) err_close(RETVAL) ;                           \
                                            ^
DB_File.xs:1050:13: note: in expansion of macro 'croak_and_free'
             croak_and_free("internal error") ;
             ^~~~~~~~~~~~~~
DB_File.xs:476:44: warning: suggest braces around empty body in an 'if' statement [-Wempty-body]
         if (RETVAL->dbp) err_close(RETVAL) ;                           \
                                            ^
DB_File.xs:1056:17: note: in expansion of macro 'croak_and_free'
                 croak_and_free("DB_File can only tie an associative array to a DB_HASH database") ;
                 ^~~~~~~~~~~~~~
DB_File.xs:476:44: warning: suggest braces around empty body in an 'if' statement [-Wempty-body]
         if (RETVAL->dbp) err_close(RETVAL) ;                           \
                                            ^
DB_File.xs:1091:17: note: in expansion of macro 'croak_and_free'
                 croak_and_free("DB_File can only tie an associative array to a DB_BTREE database");
                 ^~~~~~~~~~~~~~
DB_File.xs:476:44: warning: suggest braces around empty body in an 'if' statement [-Wempty-body]
         if (RETVAL->dbp) err_close(RETVAL) ;                           \
                                            ^
DB_File.xs:1140:17: note: in expansion of macro 'croak_and_free'
                 croak_and_free("DB_File can only tie an array to a DB_RECNO database");
                 ^~~~~~~~~~~~~~
DB_File.xs:476:44: warning: suggest braces around empty body in an 'if' statement [-Wempty-body]
         if (RETVAL->dbp) err_close(RETVAL) ;                           \
                                            ^
DB_File.xs:1229:13: note: in expansion of macro 'croak_and_free'
             croak_and_free("type is not of type DB_File::HASHINFO, DB_File::BTREEINFO or DB_File::RECNOINFO");
             ^~~~~~~~~~~~~~
In file included from ../../perl.h:5611,
                 from ListUtil.xs:8:
ListUtil.c: In function 'XS_List__Util_reduce':
../../embed.h:59:23: warning: 'retvals' may be used uninitialized in this function [-Wmaybe-uninitialized]
 #define av_push(a,b)  Perl_av_push(aTHX_ a,b)
                       ^~~~~~~~~~~~
ListUtil.xs:530:9: note: 'retvals' was declared here
     AV *retvals;
         ^~~~~~~
Warning (mostly harmless): No library found for -lndbm
Warning (mostly harmless): No library found for -ldbm
Warning (mostly harmless): No library found for -lucb
In file included from ../../perl.h:5611,
                 from Opcode.xs:3:
Opcode.xs: In function 'opmask_addlocal':
Opcode.xs:240:17: warning: cast between incompatible function types from 'void (*)(PerlInterpreter *, const char *, ...)' {aka 'void (*)(struct interpreter *, const char *, ...)'} to 'void (*)(void *)' [-Wcast-function-type]
  SAVEDESTRUCTOR((void(*)(void*))Perl_warn,"PL_op_mask restored");
                 ^
../../embed.h:496:57: note: in definition of macro 'save_destructor'
 #define save_destructor(a,b) Perl_save_destructor(aTHX_ a,b)
                                                         ^
Opcode.xs:240:2: note: in expansion of macro 'SAVEDESTRUCTOR'
  SAVEDESTRUCTOR((void(*)(void*))Perl_warn,"PL_op_mask restored");
  ^~~~~~~~~~~~~~
Warning (mostly harmless): No library found for -lposix
Warning (mostly harmless): No library found for -lcposix
Socket.c: In function 'XS_Socket_pack_ip_mreq_source':
Socket.c:1673:7: warning: variable 'interface' set but not used [-Wunused-but-set-variable]
  SV * interface;
       ^~~~~~~~~
Making header files for XS...
In file included from APItest.xs:10:
APItest.c: In function 'XS_XS__APItest__Magic_test_Gconvert':
../../config.h:909:39: warning: '%.*g' directive writing between 1 and 106 bytes into a region of size 100 [-Wformat-overflow=]
 #define Gconvert(x,n,t,b) sprintf((b),"%.*g",(n),(x))
                                       ^~~~~~
../../perl.h:496:67: note: in definition of macro 'PERL_UNUSED_RESULT'
 #    define PERL_UNUSED_RESULT(v) STMT_START { __typeof__(v) z = (v); (void)sizeof(z); } STMT_END
                                                                   ^
APItest.xs:6801:28: note: in expansion of macro 'Gconvert'
         PERL_UNUSED_RESULT(Gconvert(SvNV(number), len,
                            ^~~~~~~~
../../config.h:909:39: note: assuming directive output of 105 bytes
 #define Gconvert(x,n,t,b) sprintf((b),"%.*g",(n),(x))
                                       ^~~~~~
../../perl.h:496:67: note: in definition of macro 'PERL_UNUSED_RESULT'
 #    define PERL_UNUSED_RESULT(v) STMT_START { __typeof__(v) z = (v); (void)sizeof(z); } STMT_END
                                                                   ^
APItest.xs:6801:28: note: in expansion of macro 'Gconvert'
         PERL_UNUSED_RESULT(Gconvert(SvNV(number), len,
                            ^~~~~~~~
../../config.h:909:27: note: 'sprintf' output between 2 and 107 bytes into a destination of size 100
 #define Gconvert(x,n,t,b) sprintf((b),"%.*g",(n),(x))
../../perl.h:496:67: note: in definition of macro 'PERL_UNUSED_RESULT'
 #    define PERL_UNUSED_RESULT(v) STMT_START { __typeof__(v) z = (v); (void)sizeof(z); } STMT_END
                                                                   ^
APItest.xs:6801:28: note: in expansion of macro 'Gconvert'
         PERL_UNUSED_RESULT(Gconvert(SvNV(number), len,
                            ^~~~~~~~
[2020-07-30 14:23:26-0400] Skip tests from '/home/core/smoke/TestSmoke/smokecurrent.skiptests'
[2020-07-30 14:23:26-0400] 
[2020-07-30 14:23:26-0400]  Tests start here:
[2020-07-30 14:23:26-0400] TSTENV = stdio	
# Failed test 30 - atime: default case at io/fs.t line 529
# Failed test 31 - mtime: default case at io/fs.t line 530
# Failed test 36 - atime: default case at io/fs.t line 529
# Failed test 37 - mtime: default case at io/fs.t line 530
# Will use Digest::MD5

#   Failed test 'atime set correctly'
#   at t/utime.t line 150.
#          got: '2.222222'
#     expected: '1.111111111'

#   Failed test 'mtime set correctly'
#   at t/utime.t line 152.
#          got: '2.222222'
#     expected: '2.222222222'

#   Failed test 'atime set correctly'
#   at t/utime.t line 162.
#          got: '2.222222'
#     expected: '1.111111111'

#   Failed test 'mtime set correctly'
#   at t/utime.t line 164.
#          got: '2.222222'
#     expected: '2.222222222'

#   Failed test 'File 1 atime set correctly'
#   at t/utime.t line 189.
#          got: '2.222222'
#     expected: '1.111111111'

#   Failed test 'File 1 mtime set correctly'
#   at t/utime.t line 191.
#          got: '2.222222'
#     expected: '2.222222222'

#   Failed test 'File 2 atime set correctly'
#   at t/utime.t line 197.
#          got: '2.222222'
#     expected: '1.111111111'

#   Failed test 'File 2 mtime set correctly'
#   at t/utime.t line 199.
#          got: '2.222222'
#     expected: '2.222222222'
# Looks like you failed 8 tests of 22.

#   Failed test 'and set errno to ENOTTY'
#   at t/termios.t line 74.
#          got: 45
#     expected: 25

#   Failed test 'and set errno to ENOTTY'
#   at t/termios.t line 79.
#          got: 45
#     expected: 25

#   Failed test 'and set errno to ENOTTY'
#   at t/termios.t line 163.
#          got: 45
#     expected: 25

#   Failed test 'and set errno to ENOTTY'
#   at t/termios.t line 167.
#          got: 45
#     expected: 25

#   Failed test 'and set errno to ENOTTY'
#   at t/termios.t line 172.
#          got: 45
#     expected: 25

#   Failed test 'and set errno to ENOTTY'
#   at t/termios.t line 177.
#          got: 45
#     expected: 25
# Looks like you failed 6 tests of 1595.

error while running harness target 'test_harness': 1 at /home/core/smoke/TestSmoke/Test/Smoke/App/RunSmoke.pm line 118.
[2020-07-30 15:02:51-0400] 
[2020-07-30 15:02:51-0400] ../t/io/fs.t................................................FAILED
[2020-07-30 15:02:51-0400]     30-31, 36-37
[2020-07-30 15:02:51-0400] ../dist/Time-HiRes/t/utime.t................................FAILED
[2020-07-30 15:02:51-0400]     2-3, 5-6, 12-15
[2020-07-30 15:02:51-0400] ../dist/Time-HiRes/t/utime.t................................FAILED
[2020-07-30 15:02:51-0400]     Non-zero exit status: 8
[2020-07-30 15:02:51-0400] ../ext/POSIX/t/termios.t....................................FAILED
[2020-07-30 15:02:51-0400]     74, 76, 1589, 1591, 1593, 1595
[2020-07-30 15:02:51-0400] ../ext/POSIX/t/termios.t....................................FAILED
[2020-07-30 15:02:51-0400]     Non-zero exit status: 6
[2020-07-30 15:02:51-0400] Archived results...
[2020-07-30 15:02:51-0400] Unskip tests from '/home/core/smoke/TestSmoke/smokecurrent.skiptests'
[2020-07-30 15:02:51-0400] 
[2020-07-30 15:02:51-0400] Configuration: -Dusedevel -Dcc=gcc -Duseithreads -Duselongdouble
[2020-07-30 15:02:51-0400] ------------------------------------------------------------------------------
[2020-07-30 15:02:51-0400] make distclean ...
[2020-07-30 15:03:21-0400] 
[2020-07-30 15:03:21-0400] Copy Policy.sh ...
[2020-07-30 15:03:21-0400] 
[2020-07-30 15:03:21-0400] Configure ...
[2020-07-30 15:04:42-0400] 
[2020-07-30 15:04:42-0400] make ...
In file included from sv.c:32:
sv.c: In function 'Perl_sv_vcatpvfn_flags':
config.h:909:39: warning: '%.*Lg' directive writing between 1 and 137 bytes into a region of size 130 [-Wformat-overflow=]
 #define Gconvert(x,n,t,b) sprintf((b),"%.*""Lg",(n),(x))
                                       ^~~~~
perl.h:6834:13: note: in definition of macro 'WITH_LC_NUMERIC_SET_TO_NEEDED_IN'
             block;                                                          \
             ^~~~~
sv.c:48:5: note: in expansion of macro 'PERL_UNUSED_RESULT'
     PERL_UNUSED_RESULT(Gconvert((NV)(nv), (int)ndig, 0, buffer))
     ^~~~~~~~~~~~~~~~~~
sv.c:48:24: note: in expansion of macro 'Gconvert'
     PERL_UNUSED_RESULT(Gconvert((NV)(nv), (int)ndig, 0, buffer))
                        ^~~~~~~~
sv.c:13128:21: note: in expansion of macro 'SNPRINTF_G'
                     SNPRINTF_G(fv, ebuf, sizeof(ebuf), precis)
                     ^~~~~~~~~~
In file included from perl.h:28,
                 from sv.c:32:
config.h:909:40: note: format string is defined here
 #define Gconvert(x,n,t,b) sprintf((b),"%.*""Lg",(n),(x))
                                        ^~~~~~~
In file included from sv.c:32:
config.h:909:39: note: assuming directive output of 136 bytes
 #define Gconvert(x,n,t,b) sprintf((b),"%.*""Lg",(n),(x))
                                       ^~~~~
perl.h:6834:13: note: in definition of macro 'WITH_LC_NUMERIC_SET_TO_NEEDED_IN'
             block;                                                          \
             ^~~~~
sv.c:48:5: note: in expansion of macro 'PERL_UNUSED_RESULT'
     PERL_UNUSED_RESULT(Gconvert((NV)(nv), (int)ndig, 0, buffer))
     ^~~~~~~~~~~~~~~~~~
sv.c:48:24: note: in expansion of macro 'Gconvert'
     PERL_UNUSED_RESULT(Gconvert((NV)(nv), (int)ndig, 0, buffer))
                        ^~~~~~~~
sv.c:13128:21: note: in expansion of macro 'SNPRINTF_G'
                     SNPRINTF_G(fv, ebuf, sizeof(ebuf), precis)
                     ^~~~~~~~~~
config.h:909:27: note: 'sprintf' output between 2 and 138 bytes into a destination of size 130
 #define Gconvert(x,n,t,b) sprintf((b),"%.*""Lg",(n),(x))
perl.h:6834:13: note: in definition of macro 'WITH_LC_NUMERIC_SET_TO_NEEDED_IN'
             block;                                                          \
             ^~~~~
sv.c:48:5: note: in expansion of macro 'PERL_UNUSED_RESULT'
     PERL_UNUSED_RESULT(Gconvert((NV)(nv), (int)ndig, 0, buffer))
     ^~~~~~~~~~~~~~~~~~
sv.c:48:24: note: in expansion of macro 'Gconvert'
     PERL_UNUSED_RESULT(Gconvert((NV)(nv), (int)ndig, 0, buffer))
                        ^~~~~~~~
sv.c:13128:21: note: in expansion of macro 'SNPRINTF_G'
                     SNPRINTF_G(fv, ebuf, sizeof(ebuf), precis)
                     ^~~~~~~~~~
config.h:909:39: warning: '%.*Lg' directive writing between 1 and 137 bytes into a region of size 130 [-Wformat-overflow=]
 #define Gconvert(x,n,t,b) sprintf((b),"%.*""Lg",(n),(x))
                                       ^~~~~
perl.h:6834:13: note: in definition of macro 'WITH_LC_NUMERIC_SET_TO_NEEDED_IN'
             block;                                                          \
             ^~~~~
sv.c:48:5: note: in expansion of macro 'PERL_UNUSED_RESULT'
     PERL_UNUSED_RESULT(Gconvert((NV)(nv), (int)ndig, 0, buffer))
     ^~~~~~~~~~~~~~~~~~
sv.c:48:24: note: in expansion of macro 'Gconvert'
     PERL_UNUSED_RESULT(Gconvert((NV)(nv), (int)ndig, 0, buffer))
                        ^~~~~~~~
sv.c:13128:21: note: in expansion of macro 'SNPRINTF_G'
                     SNPRINTF_G(fv, ebuf, sizeof(ebuf), precis)
                     ^~~~~~~~~~
In file included from perl.h:28,
                 from sv.c:32:
config.h:909:40: note: format string is defined here
 #define Gconvert(x,n,t,b) sprintf((b),"%.*""Lg",(n),(x))
                                        ^~~~~~~
In file included from sv.c:32:
config.h:909:39: note: assuming directive output of 136 bytes
 #define Gconvert(x,n,t,b) sprintf((b),"%.*""Lg",(n),(x))
                                       ^~~~~
perl.h:6834:13: note: in definition of macro 'WITH_LC_NUMERIC_SET_TO_NEEDED_IN'
             block;                                                          \
             ^~~~~
sv.c:48:5: note: in expansion of macro 'PERL_UNUSED_RESULT'
     PERL_UNUSED_RESULT(Gconvert((NV)(nv), (int)ndig, 0, buffer))
     ^~~~~~~~~~~~~~~~~~
sv.c:48:24: note: in expansion of macro 'Gconvert'
     PERL_UNUSED_RESULT(Gconvert((NV)(nv), (int)ndig, 0, buffer))
                        ^~~~~~~~
sv.c:13128:21: note: in expansion of macro 'SNPRINTF_G'
                     SNPRINTF_G(fv, ebuf, sizeof(ebuf), precis)
                     ^~~~~~~~~~
config.h:909:27: note: 'sprintf' output between 2 and 138 bytes into a destination of size 130
 #define Gconvert(x,n,t,b) sprintf((b),"%.*""Lg",(n),(x))
perl.h:6834:13: note: in definition of macro 'WITH_LC_NUMERIC_SET_TO_NEEDED_IN'
             block;                                                          \
             ^~~~~
sv.c:48:5: note: in expansion of macro 'PERL_UNUSED_RESULT'
     PERL_UNUSED_RESULT(Gconvert((NV)(nv), (int)ndig, 0, buffer))
     ^~~~~~~~~~~~~~~~~~
sv.c:48:24: note: in expansion of macro 'Gconvert'
     PERL_UNUSED_RESULT(Gconvert((NV)(nv), (int)ndig, 0, buffer))
                        ^~~~~~~~
sv.c:13128:21: note: in expansion of macro 'SNPRINTF_G'
                     SNPRINTF_G(fv, ebuf, sizeof(ebuf), precis)
                     ^~~~~~~~~~
time64.c: In function 'Perl_localtime64_r':
time64.c:573:30: warning: 'orig_year' may be used uninitialized in this function [-Wmaybe-uninitialized]
             local_tm->tm_year++;
             ~~~~~~~~~~~~~~~~~^~
Warning (mostly harmless): No library found for -ldb
DB_File.xs: In function 'ParseOpenInfo':
DB_File.xs:476:44: warning: suggest braces around empty body in an 'if' statement [-Wempty-body]
         if (RETVAL->dbp) err_close(RETVAL) ;                           \
                                            ^
DB_File.xs:1044:13: note: in expansion of macro 'croak_and_free'
             croak_and_free("type parameter is not a reference") ;
             ^~~~~~~~~~~~~~
DB_File.xs:476:44: warning: suggest braces around empty body in an 'if' statement [-Wempty-body]
         if (RETVAL->dbp) err_close(RETVAL) ;                           \
                                            ^
DB_File.xs:1050:13: note: in expansion of macro 'croak_and_free'
             croak_and_free("internal error") ;
             ^~~~~~~~~~~~~~
DB_File.xs:476:44: warning: suggest braces around empty body in an 'if' statement [-Wempty-body]
         if (RETVAL->dbp) err_close(RETVAL) ;                           \
                                            ^
DB_File.xs:1056:17: note: in expansion of macro 'croak_and_free'
                 croak_and_free("DB_File can only tie an associative array to a DB_HASH database") ;
                 ^~~~~~~~~~~~~~
DB_File.xs:476:44: warning: suggest braces around empty body in an 'if' statement [-Wempty-body]
         if (RETVAL->dbp) err_close(RETVAL) ;                           \
                                            ^
DB_File.xs:1091:17: note: in expansion of macro 'croak_and_free'
                 croak_and_free("DB_File can only tie an associative array to a DB_BTREE database");
                 ^~~~~~~~~~~~~~
DB_File.xs:476:44: warning: suggest braces around empty body in an 'if' statement [-Wempty-body]
         if (RETVAL->dbp) err_close(RETVAL) ;                           \
                                            ^
DB_File.xs:1140:17: note: in expansion of macro 'croak_and_free'
                 croak_and_free("DB_File can only tie an array to a DB_RECNO database");
                 ^~~~~~~~~~~~~~
DB_File.xs:476:44: warning: suggest braces around empty body in an 'if' statement [-Wempty-body]
         if (RETVAL->dbp) err_close(RETVAL) ;                           \
                                            ^
DB_File.xs:1229:13: note: in expansion of macro 'croak_and_free'
             croak_and_free("type is not of type DB_File::HASHINFO, DB_File::BTREEINFO or DB_File::RECNOINFO");
             ^~~~~~~~~~~~~~
Warning (mostly harmless): No library found for -lndbm
Warning (mostly harmless): No library found for -ldbm
Warning (mostly harmless): No library found for -lucb
In file included from ../../perl.h:5611,
                 from Opcode.xs:3:
Opcode.xs: In function 'opmask_addlocal':
Opcode.xs:240:17: warning: cast between incompatible function types from 'void (*)(PerlInterpreter *, const char *, ...)' {aka 'void (*)(struct interpreter *, const char *, ...)'} to 'void (*)(void *)' [-Wcast-function-type]
  SAVEDESTRUCTOR((void(*)(void*))Perl_warn,"PL_op_mask restored");
                 ^
../../embed.h:496:57: note: in definition of macro 'save_destructor'
 #define save_destructor(a,b) Perl_save_destructor(aTHX_ a,b)
                                                         ^
Opcode.xs:240:2: note: in expansion of macro 'SAVEDESTRUCTOR'
  SAVEDESTRUCTOR((void(*)(void*))Perl_warn,"PL_op_mask restored");
  ^~~~~~~~~~~~~~
Warning (mostly harmless): No library found for -lposix
Warning (mostly harmless): No library found for -lcposix
Socket.c: In function 'XS_Socket_pack_ip_mreq_source':
Socket.c:1673:7: warning: variable 'interface' set but not used [-Wunused-but-set-variable]
  SV * interface;
       ^~~~~~~~~
Making header files for XS...
In file included from APItest.xs:10:
APItest.c: In function 'XS_XS__APItest__Magic_test_Gconvert':
../../config.h:909:39: warning: '%.*Lg' directive writing between 1 and 107 bytes into a region of size 100 [-Wformat-overflow=]
 #define Gconvert(x,n,t,b) sprintf((b),"%.*""Lg",(n),(x))
                                       ^~~~~
../../perl.h:496:67: note: in definition of macro 'PERL_UNUSED_RESULT'
 #    define PERL_UNUSED_RESULT(v) STMT_START { __typeof__(v) z = (v); (void)sizeof(z); } STMT_END
                                                                   ^
APItest.xs:6801:28: note: in expansion of macro 'Gconvert'
         PERL_UNUSED_RESULT(Gconvert(SvNV(number), len,
                            ^~~~~~~~
../../config.h:909:39: note: assuming directive output of 106 bytes
 #define Gconvert(x,n,t,b) sprintf((b),"%.*""Lg",(n),(x))
                                       ^~~~~
../../perl.h:496:67: note: in definition of macro 'PERL_UNUSED_RESULT'
 #    define PERL_UNUSED_RESULT(v) STMT_START { __typeof__(v) z = (v); (void)sizeof(z); } STMT_END
                                                                   ^
APItest.xs:6801:28: note: in expansion of macro 'Gconvert'
         PERL_UNUSED_RESULT(Gconvert(SvNV(number), len,
                            ^~~~~~~~
../../config.h:909:27: note: 'sprintf' output between 2 and 108 bytes into a destination of size 100
 #define Gconvert(x,n,t,b) sprintf((b),"%.*""Lg",(n),(x))
../../perl.h:496:67: note: in definition of macro 'PERL_UNUSED_RESULT'
 #    define PERL_UNUSED_RESULT(v) STMT_START { __typeof__(v) z = (v); (void)sizeof(z); } STMT_END
                                                                   ^
APItest.xs:6801:28: note: in expansion of macro 'Gconvert'
         PERL_UNUSED_RESULT(Gconvert(SvNV(number), len,
                            ^~~~~~~~
[2020-07-30 15:11:24-0400] Skip tests from '/home/core/smoke/TestSmoke/smokecurrent.skiptests'
[2020-07-30 15:11:24-0400] 
[2020-07-30 15:11:24-0400]  Tests start here:
[2020-07-30 15:11:24-0400] TSTENV = stdio	
# Failed test 30 - atime: default case at io/fs.t line 529
# Failed test 31 - mtime: default case at io/fs.t line 530
# Failed test 36 - atime: default case at io/fs.t line 529
# Failed test 37 - mtime: default case at io/fs.t line 530
# Will use Digest::MD5

#   Failed test 'atime set correctly'
#   at t/utime.t line 150.
#          got: '2.222222'
#     expected: '1.111111111'

#   Failed test 'mtime set correctly'
#   at t/utime.t line 152.
#          got: '2.222222'
#     expected: '2.222222222'

#   Failed test 'atime set correctly'
#   at t/utime.t line 162.
#          got: '2.222222'
#     expected: '1.111111111'

#   Failed test 'mtime set correctly'
#   at t/utime.t line 164.
#          got: '2.222222'
#     expected: '2.222222222'

#   Failed test 'File 1 atime set correctly'
#   at t/utime.t line 189.
#          got: '2.222222'
#     expected: '1.111111111'

#   Failed test 'File 1 mtime set correctly'
#   at t/utime.t line 191.
#          got: '2.222222'
#     expected: '2.222222222'

#   Failed test 'File 2 atime set correctly'
#   at t/utime.t line 197.
#          got: '2.222222'
#     expected: '1.111111111'

#   Failed test 'File 2 mtime set correctly'
#   at t/utime.t line 199.
#          got: '2.222222'
#     expected: '2.222222222'
# Looks like you failed 8 tests of 22.

#   Failed test 'and set errno to ENOTTY'
#   at t/termios.t line 74.
#          got: 45
#     expected: 25

#   Failed test 'and set errno to ENOTTY'
#   at t/termios.t line 79.
#          got: 45
#     expected: 25

#   Failed test 'and set errno to ENOTTY'
#   at t/termios.t line 163.
#          got: 45
#     expected: 25

#   Failed test 'and set errno to ENOTTY'
#   at t/termios.t line 167.
#          got: 45
#     expected: 25

#   Failed test 'and set errno to ENOTTY'
#   at t/termios.t line 172.
#          got: 45
#     expected: 25

#   Failed test 'and set errno to ENOTTY'
#   at t/termios.t line 177.
#          got: 45
#     expected: 25
# Looks like you failed 6 tests of 1595.

error while running harness target 'test_harness': 1 at /home/core/smoke/TestSmoke/Test/Smoke/App/RunSmoke.pm line 118.
[2020-07-30 15:41:06-0400] 
[2020-07-30 15:41:06-0400] ../t/io/fs.t................................................FAILED
[2020-07-30 15:41:06-0400]     30-31, 36-37
[2020-07-30 15:41:06-0400] ../dist/Time-HiRes/t/utime.t................................FAILED
[2020-07-30 15:41:06-0400]     2-3, 5-6, 12-15
[2020-07-30 15:41:06-0400] ../dist/Time-HiRes/t/utime.t................................FAILED
[2020-07-30 15:41:06-0400]     Non-zero exit status: 8
[2020-07-30 15:41:06-0400] ../ext/POSIX/t/termios.t....................................FAILED
[2020-07-30 15:41:06-0400]     74, 76, 1589, 1591, 1593, 1595
[2020-07-30 15:41:06-0400] ../ext/POSIX/t/termios.t....................................FAILED
[2020-07-30 15:41:06-0400]     Non-zero exit status: 6
[2020-07-30 15:41:06-0400] Archived results...
[2020-07-30 15:41:06-0400] Unskip tests from '/home/core/smoke/TestSmoke/smokecurrent.skiptests'
[2020-07-30 15:41:06-0400] 
[2020-07-30 15:41:06-0400] Configuration: -Dusedevel -Dcc=gcc -Duseithreads -Duselongdouble -DDEBUGGING
[2020-07-30 15:41:06-0400] ------------------------------------------------------------------------------
[2020-07-30 15:41:06-0400] make distclean ...
[2020-07-30 15:41:29-0400] 
[2020-07-30 15:41:29-0400] Copy Policy.sh ...
[2020-07-30 15:41:29-0400] 
[2020-07-30 15:41:29-0400] Configure ...
[2020-07-30 15:42:51-0400] 
[2020-07-30 15:42:51-0400] make ...
In file included from sv.c:32:
sv.c: In function 'Perl_sv_vcatpvfn_flags':
config.h:909:39: warning: '%.*Lg' directive writing between 1 and 137 bytes into a region of size 130 [-Wformat-overflow=]
 #define Gconvert(x,n,t,b) sprintf((b),"%.*""Lg",(n),(x))
                                       ^~~~~
perl.h:6834:13: note: in definition of macro 'WITH_LC_NUMERIC_SET_TO_NEEDED_IN'
             block;                                                          \
             ^~~~~
sv.c:48:5: note: in expansion of macro 'PERL_UNUSED_RESULT'
     PERL_UNUSED_RESULT(Gconvert((NV)(nv), (int)ndig, 0, buffer))
     ^~~~~~~~~~~~~~~~~~
sv.c:48:24: note: in expansion of macro 'Gconvert'
     PERL_UNUSED_RESULT(Gconvert((NV)(nv), (int)ndig, 0, buffer))
                        ^~~~~~~~
sv.c:13128:21: note: in expansion of macro 'SNPRINTF_G'
                     SNPRINTF_G(fv, ebuf, sizeof(ebuf), precis)
                     ^~~~~~~~~~
In file included from perl.h:28,
                 from sv.c:32:
config.h:909:40: note: format string is defined here
 #define Gconvert(x,n,t,b) sprintf((b),"%.*""Lg",(n),(x))
                                        ^~~~~~~
In file included from sv.c:32:
config.h:909:39: note: assuming directive output of 136 bytes
 #define Gconvert(x,n,t,b) sprintf((b),"%.*""Lg",(n),(x))
                                       ^~~~~
perl.h:6834:13: note: in definition of macro 'WITH_LC_NUMERIC_SET_TO_NEEDED_IN'
             block;                                                          \
             ^~~~~
sv.c:48:5: note: in expansion of macro 'PERL_UNUSED_RESULT'
     PERL_UNUSED_RESULT(Gconvert((NV)(nv), (int)ndig, 0, buffer))
     ^~~~~~~~~~~~~~~~~~
sv.c:48:24: note: in expansion of macro 'Gconvert'
     PERL_UNUSED_RESULT(Gconvert((NV)(nv), (int)ndig, 0, buffer))
                        ^~~~~~~~
sv.c:13128:21: note: in expansion of macro 'SNPRINTF_G'
                     SNPRINTF_G(fv, ebuf, sizeof(ebuf), precis)
                     ^~~~~~~~~~
config.h:909:27: note: 'sprintf' output between 2 and 138 bytes into a destination of size 130
 #define Gconvert(x,n,t,b) sprintf((b),"%.*""Lg",(n),(x))
perl.h:6834:13: note: in definition of macro 'WITH_LC_NUMERIC_SET_TO_NEEDED_IN'
             block;                                                          \
             ^~~~~
sv.c:48:5: note: in expansion of macro 'PERL_UNUSED_RESULT'
     PERL_UNUSED_RESULT(Gconvert((NV)(nv), (int)ndig, 0, buffer))
     ^~~~~~~~~~~~~~~~~~
sv.c:48:24: note: in expansion of macro 'Gconvert'
     PERL_UNUSED_RESULT(Gconvert((NV)(nv), (int)ndig, 0, buffer))
                        ^~~~~~~~
sv.c:13128:21: note: in expansion of macro 'SNPRINTF_G'
                     SNPRINTF_G(fv, ebuf, sizeof(ebuf), precis)
                     ^~~~~~~~~~
config.h:909:39: warning: '%.*Lg' directive writing between 1 and 137 bytes into a region of size 130 [-Wformat-overflow=]
 #define Gconvert(x,n,t,b) sprintf((b),"%.*""Lg",(n),(x))
                                       ^~~~~
perl.h:6834:13: note: in definition of macro 'WITH_LC_NUMERIC_SET_TO_NEEDED_IN'
             block;                                                          \
             ^~~~~
sv.c:48:5: note: in expansion of macro 'PERL_UNUSED_RESULT'
     PERL_UNUSED_RESULT(Gconvert((NV)(nv), (int)ndig, 0, buffer))
     ^~~~~~~~~~~~~~~~~~
sv.c:48:24: note: in expansion of macro 'Gconvert'
     PERL_UNUSED_RESULT(Gconvert((NV)(nv), (int)ndig, 0, buffer))
                        ^~~~~~~~
sv.c:13128:21: note: in expansion of macro 'SNPRINTF_G'
                     SNPRINTF_G(fv, ebuf, sizeof(ebuf), precis)
                     ^~~~~~~~~~
In file included from perl.h:28,
                 from sv.c:32:
config.h:909:40: note: format string is defined here
 #define Gconvert(x,n,t,b) sprintf((b),"%.*""Lg",(n),(x))
                                        ^~~~~~~
In file included from sv.c:32:
config.h:909:39: note: assuming directive output of 136 bytes
 #define Gconvert(x,n,t,b) sprintf((b),"%.*""Lg",(n),(x))
                                       ^~~~~
perl.h:6834:13: note: in definition of macro 'WITH_LC_NUMERIC_SET_TO_NEEDED_IN'
             block;                                                          \
             ^~~~~
sv.c:48:5: note: in expansion of macro 'PERL_UNUSED_RESULT'
     PERL_UNUSED_RESULT(Gconvert((NV)(nv), (int)ndig, 0, buffer))
     ^~~~~~~~~~~~~~~~~~
sv.c:48:24: note: in expansion of macro 'Gconvert'
     PERL_UNUSED_RESULT(Gconvert((NV)(nv), (int)ndig, 0, buffer))
                        ^~~~~~~~
sv.c:13128:21: note: in expansion of macro 'SNPRINTF_G'
                     SNPRINTF_G(fv, ebuf, sizeof(ebuf), precis)
                     ^~~~~~~~~~
config.h:909:27: note: 'sprintf' output between 2 and 138 bytes into a destination of size 130
 #define Gconvert(x,n,t,b) sprintf((b),"%.*""Lg",(n),(x))
perl.h:6834:13: note: in definition of macro 'WITH_LC_NUMERIC_SET_TO_NEEDED_IN'
             block;                                                          \
             ^~~~~
sv.c:48:5: note: in expansion of macro 'PERL_UNUSED_RESULT'
     PERL_UNUSED_RESULT(Gconvert((NV)(nv), (int)ndig, 0, buffer))
     ^~~~~~~~~~~~~~~~~~
sv.c:48:24: note: in expansion of macro 'Gconvert'
     PERL_UNUSED_RESULT(Gconvert((NV)(nv), (int)ndig, 0, buffer))
                        ^~~~~~~~
sv.c:13128:21: note: in expansion of macro 'SNPRINTF_G'
                     SNPRINTF_G(fv, ebuf, sizeof(ebuf), precis)
                     ^~~~~~~~~~
time64.c: In function 'Perl_localtime64_r':
time64.c:573:30: warning: 'orig_year' may be used uninitialized in this function [-Wmaybe-uninitialized]
             local_tm->tm_year++;
             ~~~~~~~~~~~~~~~~~^~
Warning (mostly harmless): No library found for -ldb
DB_File.xs: In function 'ParseOpenInfo':
DB_File.xs:476:44: warning: suggest braces around empty body in an 'if' statement [-Wempty-body]
         if (RETVAL->dbp) err_close(RETVAL) ;                           \
                                            ^
DB_File.xs:1044:13: note: in expansion of macro 'croak_and_free'
             croak_and_free("type parameter is not a reference") ;
             ^~~~~~~~~~~~~~
DB_File.xs:476:44: warning: suggest braces around empty body in an 'if' statement [-Wempty-body]
         if (RETVAL->dbp) err_close(RETVAL) ;                           \
                                            ^
DB_File.xs:1050:13: note: in expansion of macro 'croak_and_free'
             croak_and_free("internal error") ;
             ^~~~~~~~~~~~~~
DB_File.xs:476:44: warning: suggest braces around empty body in an 'if' statement [-Wempty-body]
         if (RETVAL->dbp) err_close(RETVAL) ;                           \
                                            ^
DB_File.xs:1056:17: note: in expansion of macro 'croak_and_free'
                 croak_and_free("DB_File can only tie an associative array to a DB_HASH database") ;
                 ^~~~~~~~~~~~~~
DB_File.xs:476:44: warning: suggest braces around empty body in an 'if' statement [-Wempty-body]
         if (RETVAL->dbp) err_close(RETVAL) ;                           \
                                            ^
DB_File.xs:1091:17: note: in expansion of macro 'croak_and_free'
                 croak_and_free("DB_File can only tie an associative array to a DB_BTREE database");
                 ^~~~~~~~~~~~~~
DB_File.xs:476:44: warning: suggest braces around empty body in an 'if' statement [-Wempty-body]
         if (RETVAL->dbp) err_close(RETVAL) ;                           \
                                            ^
DB_File.xs:1140:17: note: in expansion of macro 'croak_and_free'
                 croak_and_free("DB_File can only tie an array to a DB_RECNO database");
                 ^~~~~~~~~~~~~~
DB_File.xs:476:44: warning: suggest braces around empty body in an 'if' statement [-Wempty-body]
         if (RETVAL->dbp) err_close(RETVAL) ;                           \
                                            ^
DB_File.xs:1229:13: note: in expansion of macro 'croak_and_free'
             croak_and_free("type is not of type DB_File::HASHINFO, DB_File::BTREEINFO or DB_File::RECNOINFO");
             ^~~~~~~~~~~~~~
In file included from ../../perl.h:5611,
                 from ListUtil.xs:8:
ListUtil.c: In function 'XS_List__Util_reduce':
../../embed.h:59:23: warning: 'retvals' may be used uninitialized in this function [-Wmaybe-uninitialized]
 #define av_push(a,b)  Perl_av_push(aTHX_ a,b)
                       ^~~~~~~~~~~~
ListUtil.xs:530:9: note: 'retvals' was declared here
     AV *retvals;
         ^~~~~~~
Warning (mostly harmless): No library found for -lndbm
Warning (mostly harmless): No library found for -ldbm
Warning (mostly harmless): No library found for -lucb
In file included from ../../perl.h:5611,
                 from Opcode.xs:3:
Opcode.xs: In function 'opmask_addlocal':
Opcode.xs:240:17: warning: cast between incompatible function types from 'void (*)(PerlInterpreter *, const char *, ...)' {aka 'void (*)(struct interpreter *, const char *, ...)'} to 'void (*)(void *)' [-Wcast-function-type]
  SAVEDESTRUCTOR((void(*)(void*))Perl_warn,"PL_op_mask restored");
                 ^
../../embed.h:496:57: note: in definition of macro 'save_destructor'
 #define save_destructor(a,b) Perl_save_destructor(aTHX_ a,b)
                                                         ^
Opcode.xs:240:2: note: in expansion of macro 'SAVEDESTRUCTOR'
  SAVEDESTRUCTOR((void(*)(void*))Perl_warn,"PL_op_mask restored");
  ^~~~~~~~~~~~~~
Warning (mostly harmless): No library found for -lposix
Warning (mostly harmless): No library found for -lcposix
Socket.c: In function 'XS_Socket_pack_ip_mreq_source':
Socket.c:1673:7: warning: variable 'interface' set but not used [-Wunused-but-set-variable]
  SV * interface;
       ^~~~~~~~~
Making header files for XS...
In file included from APItest.xs:10:
APItest.c: In function 'XS_XS__APItest__Magic_test_Gconvert':
../../config.h:909:39: warning: '%.*Lg' directive writing between 1 and 107 bytes into a region of size 100 [-Wformat-overflow=]
 #define Gconvert(x,n,t,b) sprintf((b),"%.*""Lg",(n),(x))
                                       ^~~~~
../../perl.h:496:67: note: in definition of macro 'PERL_UNUSED_RESULT'
 #    define PERL_UNUSED_RESULT(v) STMT_START { __typeof__(v) z = (v); (void)sizeof(z); } STMT_END
                                                                   ^
APItest.xs:6801:28: note: in expansion of macro 'Gconvert'
         PERL_UNUSED_RESULT(Gconvert(SvNV(number), len,
                            ^~~~~~~~
../../config.h:909:39: note: assuming directive output of 106 bytes
 #define Gconvert(x,n,t,b) sprintf((b),"%.*""Lg",(n),(x))
                                       ^~~~~
../../perl.h:496:67: note: in definition of macro 'PERL_UNUSED_RESULT'
 #    define PERL_UNUSED_RESULT(v) STMT_START { __typeof__(v) z = (v); (void)sizeof(z); } STMT_END
                                                                   ^
APItest.xs:6801:28: note: in expansion of macro 'Gconvert'
         PERL_UNUSED_RESULT(Gconvert(SvNV(number), len,
                            ^~~~~~~~
../../config.h:909:27: note: 'sprintf' output between 2 and 108 bytes into a destination of size 100
 #define Gconvert(x,n,t,b) sprintf((b),"%.*""Lg",(n),(x))
../../perl.h:496:67: note: in definition of macro 'PERL_UNUSED_RESULT'
 #    define PERL_UNUSED_RESULT(v) STMT_START { __typeof__(v) z = (v); (void)sizeof(z); } STMT_END
                                                                   ^
APItest.xs:6801:28: note: in expansion of macro 'Gconvert'
         PERL_UNUSED_RESULT(Gconvert(SvNV(number), len,
                            ^~~~~~~~
[2020-07-30 15:53:17-0400] Skip tests from '/home/core/smoke/TestSmoke/smokecurrent.skiptests'
[2020-07-30 15:53:17-0400] 
[2020-07-30 15:53:17-0400]  Tests start here:
[2020-07-30 15:53:17-0400] TSTENV = stdio	
# Failed test 30 - atime: default case at io/fs.t line 529
# Failed test 31 - mtime: default case at io/fs.t line 530
# Failed test 36 - atime: default case at io/fs.t line 529
# Failed test 37 - mtime: default case at io/fs.t line 530
# Will use Digest::MD5

#   Failed test 'atime set correctly'
#   at t/utime.t line 150.
#          got: '2.222222'
#     expected: '1.111111111'

#   Failed test 'mtime set correctly'
#   at t/utime.t line 152.
#          got: '2.222222'
#     expected: '2.222222222'

#   Failed test 'atime set correctly'
#   at t/utime.t line 162.
#          got: '2.222222'
#     expected: '1.111111111'

#   Failed test 'mtime set correctly'
#   at t/utime.t line 164.
#          got: '2.222222'
#     expected: '2.222222222'

#   Failed test 'File 1 atime set correctly'
#   at t/utime.t line 189.
#          got: '2.222222'
#     expected: '1.111111111'

#   Failed test 'File 1 mtime set correctly'
#   at t/utime.t line 191.
#          got: '2.222222'
#     expected: '2.222222222'

#   Failed test 'File 2 atime set correctly'
#   at t/utime.t line 197.
#          got: '2.222222'
#     expected: '1.111111111'

#   Failed test 'File 2 mtime set correctly'
#   at t/utime.t line 199.
#          got: '2.222222'
#     expected: '2.222222222'
# Looks like you failed 8 tests of 22.

#   Failed test 'and set errno to ENOTTY'
#   at t/termios.t line 74.
#          got: 45
#     expected: 25

#   Failed test 'and set errno to ENOTTY'
#   at t/termios.t line 79.
#          got: 45
#     expected: 25

#   Failed test 'and set errno to ENOTTY'
#   at t/termios.t line 163.
#          got: 45
#     expected: 25

#   Failed test 'and set errno to ENOTTY'
#   at t/termios.t line 167.
#          got: 45
#     expected: 25

#   Failed test 'and set errno to ENOTTY'
#   at t/termios.t line 172.
#          got: 45
#     expected: 25

#   Failed test 'and set errno to ENOTTY'
#   at t/termios.t line 177.
#          got: 45
#     expected: 25
# Looks like you failed 6 tests of 1595.

error while running harness target 'test_harness': 1 at /home/core/smoke/TestSmoke/Test/Smoke/App/RunSmoke.pm line 118.
[2020-07-30 16:32:49-0400] 
[2020-07-30 16:32:49-0400] ../t/io/fs.t................................................FAILED
[2020-07-30 16:32:49-0400]     30-31, 36-37
[2020-07-30 16:32:49-0400] ../dist/Time-HiRes/t/utime.t................................FAILED
[2020-07-30 16:32:49-0400]     2-3, 5-6, 12-15
[2020-07-30 16:32:49-0400] ../dist/Time-HiRes/t/utime.t................................FAILED
[2020-07-30 16:32:49-0400]     Non-zero exit status: 8
[2020-07-30 16:32:49-0400] ../ext/POSIX/t/termios.t....................................FAILED
[2020-07-30 16:32:49-0400]     74, 76, 1589, 1591, 1593, 1595
[2020-07-30 16:32:49-0400] ../ext/POSIX/t/termios.t....................................FAILED
[2020-07-30 16:32:49-0400]     Non-zero exit status: 6
[2020-07-30 16:32:49-0400] Archived results...
[2020-07-30 16:32:49-0400] Unskip tests from '/home/core/smoke/TestSmoke/smokecurrent.skiptests'
[2020-07-30 16:32:49-0400] Finished smoking bd88bd2a72478af4411aa8a4868c294e649d0e00 v5.32.0-64-gbd88bd2a72 smoke-me/jkeenan/dire-wolf
[2020-07-30 16:32:49-0400] Reading smokeresult from /home/core/smoke/perl-current/mktest.out
[2020-07-30 16:32:49-0400] Processing [-Dcc=gcc]
[2020-07-30 16:32:49-0400] Processing [-DDEBUGGING -Dcc=gcc]
[2020-07-30 16:32:49-0400] Processing [-Dcc=gcc -Duse64bitall]
[2020-07-30 16:32:49-0400] Processing [-DDEBUGGING -Dcc=gcc -Duse64bitall]
[2020-07-30 16:32:49-0400] Processing [-Dcc=gcc -Duselongdouble]
[2020-07-30 16:32:49-0400] Processing [-DDEBUGGING -Dcc=gcc -Duselongdouble]
[2020-07-30 16:32:49-0400] Processing [-Dcc=gcc -Duseithreads]
[2020-07-30 16:32:49-0400] Processing [-DDEBUGGING -Dcc=gcc -Duseithreads]
[2020-07-30 16:32:49-0400] Processing [-Dcc=gcc -Duseithreads -Duse64bitall]
[2020-07-30 16:32:49-0400] Processing [-DDEBUGGING -Dcc=gcc -Duseithreads -Duse64bitall]
[2020-07-30 16:32:49-0400] Processing [-Dcc=gcc -Duseithreads -Duselongdouble]
[2020-07-30 16:32:49-0400] Processing [-DDEBUGGING -Dcc=gcc -Duseithreads -Duselongdouble]
[2020-07-30 16:32:49-0400] ==> Starting reporter
[2020-07-30 16:32:49-0400] Writing report to '/home/core/smoke/perl-current/mktest.rpt'
-- 
Report generated by Test::Smoke::Gateway v0.09_01