Show report
[2020-04-05 08:22:59+0200] ==> Skipping synctree
[2020-04-05 08:22:59+0200] ==> Starting runsmoke
[2020-04-05 08:22:59+0200] [tssmokeperl.pl] chdir(/pro/3gl/CPAN/perl-current)
[2020-04-05 08:22:59+0200] Setup alarm: Mon Apr  6 07:52:59 2020
[2020-04-05 08:22:59+0200] qx[/pro/bin/perl -e "require q[/pro/3gl/CPAN/perl-current/cpan/Test-Harness/lib/Test/Harness.pm];print Test::Harness->VERSION" 2>&1]
[2020-04-05 08:23:00+0200] Found: Test::Harness version 3.42.
[2020-04-05 08:23:00+0200] Reading build configurations from /pro/3gl/CPAN/smoke/p59.cfg
[2020-04-05 08:23:00+0200] Reading 'Policy.sh' from ../Policy.sh (v=1)
[2020-04-05 08:23:00+0200] Running test suite only with 'harness'
[2020-04-05 08:23:00+0200] make distclean ...
[2020-04-05 08:23:00+0200] Smoking patch 0d547987b4a450dd159c70d568bebe35f87b6f0d v5.31.10-36-g0d54798
[2020-04-05 08:23:00+0200] Smoking branch blead
[2020-04-05 08:23:00+0200] Locally applied patches from '/pro/3gl/CPAN/perl-current/patchlevel.h'
[2020-04-05 08:23:00+0200] Patches: 'RC0;uncommitted-changes;SMOKE0d547987b4a450dd159c70d568bebe35f87b6f0d'
[2020-04-05 08:23:00+0200] 
[2020-04-05 08:23:00+0200] Configuration: -Dcc=gcc -Dusedevel
[2020-04-05 08:23:00+0200] ------------------------------------------------------------------------------
[2020-04-05 08:23:00+0200] make distclean ...
[2020-04-05 08:23:00+0200] 
[2020-04-05 08:23:00+0200] Copy Policy.sh ...
[2020-04-05 08:23:00+0200] 
[2020-04-05 08:23:00+0200] Configure ...
[2020-04-05 08:24:27+0200] 
[2020-04-05 08:24:27+0200] make ...
===== PROCURA Policy for hpux/ccache gcc ========================
===== PROCURA Policy results ============================
cc:         ccache gcc
ccversion:  -
gccversion: -
ccflags:    -milp32 -fPIC 
optimize:   
ld:         
ldflags:    -L/usr/lib/hpux32 -L/pro/local/lib
libswanted: cl pthread cl pthread socket bind inet nsl ndbm gdbm dbm db malloc dl ld sun m crypt sec util c cposix posix ucb bsd BSD
libsdirs:    /usr/lib/hpux32  /lib /pro/local/lib
locincpth:  /pro/local/include
loclibpth:  /usr/lib/hpux32
useshrplib: 
===== PROCURA Policy done ===============================
[2020-04-05 08:39:53+0200] Skip tests from '/pro/3gl/CPAN/smoke/p59.skip'
[2020-04-05 08:39:53+0200] 
[2020-04-05 08:39:53+0200]  Tests start here:
[2020-04-05 08:39:53+0200] TSTENV = stdio	
op.c: In function 'Perl_ck_eval':
op.c:12795:9: warning: value computed is not used [-Wunused-value]
op.c: In function 'Perl_pmruntime':
op.c:7445:15: warning: 't_cp' may be used uninitialized in this function [-Wmaybe-uninitialized]
op.c:7039:14: note: 't_cp' was declared here
op.c:7487:28: warning: 'r_cp' may be used uninitialized in this function [-Wmaybe-uninitialized]
op.c:7039:8: note: 'r_cp' was declared here
pp.c: In function 'Perl_pp_argelem':
pp.c:7025:13: warning: value computed is not used [-Wunused-value]
op.c: In function 'Perl_ck_eval':
op.c:12795:9: warning: value computed is not used [-Wunused-value]
op.c: In function 'Perl_pmruntime':
op.c:7445:15: warning: 't_cp' may be used uninitialized in this function [-Wmaybe-uninitialized]
op.c:7039:14: note: 't_cp' was declared here
op.c:7487:28: warning: 'r_cp' may be used uninitialized in this function [-Wmaybe-uninitialized]
op.c:7039:8: note: 'r_cp' was declared here
RealPPPort.xs: In function 'XS_Devel__PPPort_check_HeUTF8':
RealPPPort.xs:1990:17: warning: value computed is not used [-Wunused-value]
Warning (mostly harmless): No library found for -lposix
Warning (mostly harmless): No library found for -lcposix
./const-xs.inc: In function 'boot_Socket':
./const-xs.inc:986:20: warning: missing braces around initializer [-Wmissing-braces]
./const-xs.inc:986:20: warning: (near initialization for 'ip6_address._s6_un') [-Wmissing-braces]
./const-xs.inc:995:20: warning: missing braces around initializer [-Wmissing-braces]
./const-xs.inc:995:20: warning: (near initialization for 'ip6_address._s6_un') [-Wmissing-braces]
In file included from HiRes.xs:1047:0:
const-c.inc: In function 'constant_19':
const-c.inc:351:42: warning: unused parameter 'iv_return' [-Wunused-parameter]
Making header files for XS...
APItest.xs: In function 'XS_XS__APItest__HvMacro_u8_to_u16_le':
APItest.xs:6895:13: warning: unused variable 'u64' [-Wunused-variable]
re_exec.c: In function 'S_dump_exec_pos':
re_exec.c:4170:21: warning: format '%u' expects argument of type 'unsigned int', but argument 12 has type 'U32' [-Wformat]
re_exec.c: In function 'S_regtry':
re_exec.c:6539:30: warning: 'fold_array' may be used uninitialized in this function [-Wmaybe-uninitialized]
re_exec.c:6443:17: note: 'fold_array' was declared here
re_exec.c:6545:28: warning: 'folder' may be used uninitialized in this function [-Wmaybe-uninitialized]
re_exec.c:6442:16: note: 'folder' was declared here
No saved state, selection will be empty
Cannot figure out an encoding to use at t/use-Encode-Alias.t line 5.
# Connected to 127.0.0.1
# Connected to 127.0.0.1
Integer overflow in hexadecimal number at t/broken_univ_can.t line 7.
Redefining sub xChild::foo at xChild--6243 line 2.
Redefining sub Data::ok at -e line 1.
# Will use Digest::MD5
make: *** [test_harness] Error 1

error while running harness target 'test_harness': 2 at /pro/3gl/CPAN/smoke/lib/Test/Smoke/App/RunSmoke.pm line 118.
[2020-04-05 08:57:44+0200] 
[2020-04-05 08:57:44+0200] ../dist/Net-Ping/t/450_service.t............................PASSED
[2020-04-05 08:57:44+0200]     9, 18
[2020-04-05 08:57:44+0200] ../lib/locale.t.............................................FAILED
[2020-04-05 08:57:44+0200]     448
[2020-04-05 08:57:44+0200] Archived results...
[2020-04-05 08:57:44+0200] TSTENV = perlio	
Integer overflow in hexadecimal number at t/broken_univ_can.t line 7.
# Will use Digest::MD5
# Connected to 127.0.0.1
# Connected to 127.0.0.1
Cannot figure out an encoding to use at t/use-Encode-Alias.t line 5.
[2020-04-05 09:13:11+0200] 
[2020-04-05 09:13:11+0200] All tests successful.
[2020-04-05 09:13:11+0200] ../dist/Net-Ping/t/450_service.t............................PASSED
[2020-04-05 09:13:11+0200]     9, 18
[2020-04-05 09:13:11+0200] Archived results...
[2020-04-05 09:13:11+0200] TSTENV = locale:en_US.utf8	
# Will use Digest::MD5
Integer overflow in hexadecimal number at t/broken_univ_can.t line 7.
# Connected to 127.0.0.1
syswrite() isn't allowed on :utf8 handles at t/Socket.t line 47.
# Looks like your test exited with 255 just after 2.
make: *** [test_harness] Error 1

error while running harness target 'test_harness': 2 at /pro/3gl/CPAN/smoke/lib/Test/Smoke/App/RunSmoke.pm line 118.
[2020-04-05 09:28:47+0200] 
[2020-04-05 09:28:47+0200] ../dist/Net-Ping/t/450_service.t............................PASSED
[2020-04-05 09:28:47+0200]     9, 18
[2020-04-05 09:28:47+0200] ../cpan/Socket/t/Socket.t...................................FAILED
[2020-04-05 09:28:47+0200]     Non-zero exit status: 255
[2020-04-05 09:28:47+0200] ../cpan/Socket/t/Socket.t...................................FAILED
[2020-04-05 09:28:47+0200]     Bad plan.  You planned 6 tests but ran 2.
[2020-04-05 09:28:47+0200] Archived results...
[2020-04-05 09:28:47+0200] Unskip tests from '/pro/3gl/CPAN/smoke/p59.skip'
[2020-04-05 09:28:47+0200] 
[2020-04-05 09:28:47+0200] Configuration: -Dcc=gcc -Dusedevel -DDEBUGGING
[2020-04-05 09:28:47+0200] ------------------------------------------------------------------------------
[2020-04-05 09:28:47+0200] make distclean ...
[2020-04-05 09:29:32+0200] 
[2020-04-05 09:29:32+0200] Copy Policy.sh ...
[2020-04-05 09:29:32+0200] 
[2020-04-05 09:29:32+0200] Configure ...
[2020-04-05 09:30:58+0200] 
[2020-04-05 09:30:58+0200] make ...
===== PROCURA Policy for hpux/ccache gcc ========================
===== PROCURA Policy results ============================
cc:         ccache gcc
ccversion:  -
gccversion: -
ccflags:    -milp32 -fPIC -DDEBUGGING
optimize:   
ld:         
ldflags:    -L/usr/lib/hpux32 -L/pro/local/lib
libswanted: cl pthread cl pthread socket bind inet nsl ndbm gdbm dbm db malloc dl ld sun m crypt sec util c cposix posix ucb bsd BSD
libsdirs:    /usr/lib/hpux32  /lib /pro/local/lib
locincpth:  /pro/local/include
loclibpth:  /usr/lib/hpux32
useshrplib: 
===== PROCURA Policy done ===============================
[2020-04-05 09:57:26+0200] Skip tests from '/pro/3gl/CPAN/smoke/p59.skip'
[2020-04-05 09:57:26+0200] 
[2020-04-05 09:57:26+0200]  Tests start here:
[2020-04-05 09:57:26+0200] TSTENV = stdio	
op.c: In function 'Perl_ck_eval':
op.c:12795:9: warning: value computed is not used [-Wunused-value]
op.c: In function 'S_pmtrans':
op.c:7445:15: warning: 't_cp' may be used uninitialized in this function [-Wmaybe-uninitialized]
op.c:7487:28: warning: 'r_cp' may be used uninitialized in this function [-Wmaybe-uninitialized]
toke.c: In function 'Perl_scan_num':
toke.c:11631:54: warning: 'b' may be used uninitialized in this function [-Wmaybe-uninitialized]
pp.c: In function 'Perl_pp_argelem':
pp.c:7025:13: warning: value computed is not used [-Wunused-value]
regexec.c: In function 'S_dump_exec_pos':
regexec.c:4170:21: warning: format '%u' expects argument of type 'unsigned int', but argument 12 has type 'U32' [-Wformat]
regexec.c: In function 'S_regtry':
regexec.c:6539:30: warning: 'fold_array' may be used uninitialized in this function [-Wmaybe-uninitialized]
regexec.c:6443:17: note: 'fold_array' was declared here
regexec.c:6545:28: warning: 'folder' may be used uninitialized in this function [-Wmaybe-uninitialized]
regexec.c:6442:16: note: 'folder' was declared here
time64.c: In function 'Perl_localtime64_r':
time64.c:573:30: warning: 'orig_year' may be used uninitialized in this function [-Wmaybe-uninitialized]
op.c: In function 'Perl_ck_eval':
op.c:12795:9: warning: value computed is not used [-Wunused-value]
op.c: In function 'S_pmtrans':
op.c:7445:15: warning: 't_cp' may be used uninitialized in this function [-Wmaybe-uninitialized]
op.c:7487:28: warning: 'r_cp' may be used uninitialized in this function [-Wmaybe-uninitialized]
RealPPPort.xs: In function 'XS_Devel__PPPort_check_HeUTF8':
RealPPPort.xs:1990:17: warning: value computed is not used [-Wunused-value]
Warning (mostly harmless): No library found for -lposix
Warning (mostly harmless): No library found for -lcposix
./const-xs.inc: In function 'boot_Socket':
./const-xs.inc:986:20: warning: missing braces around initializer [-Wmissing-braces]
./const-xs.inc:986:20: warning: (near initialization for 'ip6_address._s6_un') [-Wmissing-braces]
./const-xs.inc:995:20: warning: missing braces around initializer [-Wmissing-braces]
./const-xs.inc:995:20: warning: (near initialization for 'ip6_address._s6_un') [-Wmissing-braces]
Storable.xs: In function 'store_hook':
Storable.xs:4087:17: warning: format '%d' expects argument of type 'int', but argument 3 has type 'I32' [-Wformat]
Storable.xs: In function 'store':
Storable.xs:4462:6: warning: format '%d' expects argument of type 'int', but argument 3 has type 'I32' [-Wformat]
In file included from HiRes.xs:1047:0:
const-c.inc: In function 'constant_19':
const-c.inc:351:42: warning: unused parameter 'iv_return' [-Wunused-parameter]
Making header files for XS...
APItest.xs: In function 'XS_XS__APItest__HvMacro_u8_to_u16_le':
APItest.xs:6895:13: warning: unused variable 'u64' [-Wunused-variable]
re_exec.c: In function 'S_dump_exec_pos':
re_exec.c:4170:21: warning: format '%u' expects argument of type 'unsigned int', but argument 12 has type 'U32' [-Wformat]
re_exec.c: In function 'S_regtry':
re_exec.c:6539:30: warning: 'fold_array' may be used uninitialized in this function [-Wmaybe-uninitialized]
re_exec.c:6443:17: note: 'fold_array' was declared here
re_exec.c:6545:28: warning: 'folder' may be used uninitialized in this function [-Wmaybe-uninitialized]
re_exec.c:6442:16: note: 'folder' was declared here
No saved state, selection will be empty
Cannot figure out an encoding to use at t/use-Encode-Alias.t line 5.
# Connected to 127.0.0.1
# Connected to 127.0.0.1
Integer overflow in hexadecimal number at t/broken_univ_can.t line 7.
Redefining sub xChild::foo at xChild--9937 line 2.
Redefining sub Data::ok at -e line 1.
# Will use Digest::MD5
[2020-04-05 10:28:43+0200] 
[2020-04-05 10:28:43+0200] All tests successful.
[2020-04-05 10:28:43+0200] ../dist/Net-Ping/t/450_service.t............................PASSED
[2020-04-05 10:28:43+0200]     9, 18
[2020-04-05 10:28:43+0200] Archived results...
[2020-04-05 10:28:43+0200] TSTENV = perlio	
# Connected to 127.0.0.1
# Connected to 127.0.0.1
# Will use Digest::MD5
Cannot figure out an encoding to use at t/use-Encode-Alias.t line 5.
Integer overflow in hexadecimal number at t/broken_univ_can.t line 7.
[2020-04-05 10:55:07+0200] 
[2020-04-05 10:55:07+0200] All tests successful.
[2020-04-05 10:55:07+0200] ../dist/Net-Ping/t/450_service.t............................PASSED
[2020-04-05 10:55:07+0200]     9, 18
[2020-04-05 10:55:07+0200] Archived results...
[2020-04-05 10:55:07+0200] TSTENV = locale:en_US.utf8	
Integer overflow in hexadecimal number at t/broken_univ_can.t line 7.
# Connected to 127.0.0.1
syswrite() isn't allowed on :utf8 handles at t/Socket.t line 47.
# Looks like your test exited with 255 just after 2.
# Will use Digest::MD5
make: *** [test_harness] Error 1

error while running harness target 'test_harness': 2 at /pro/3gl/CPAN/smoke/lib/Test/Smoke/App/RunSmoke.pm line 118.
[2020-04-05 11:21:20+0200] 
[2020-04-05 11:21:20+0200] ../dist/Net-Ping/t/450_service.t............................PASSED
[2020-04-05 11:21:20+0200]     9, 18
[2020-04-05 11:21:20+0200] ../cpan/Socket/t/Socket.t...................................FAILED
[2020-04-05 11:21:20+0200]     Non-zero exit status: 255
[2020-04-05 11:21:20+0200] ../cpan/Socket/t/Socket.t...................................FAILED
[2020-04-05 11:21:20+0200]     Bad plan.  You planned 6 tests but ran 2.
[2020-04-05 11:21:20+0200] Archived results...
[2020-04-05 11:21:20+0200] Unskip tests from '/pro/3gl/CPAN/smoke/p59.skip'
[2020-04-05 11:21:20+0200] 
[2020-04-05 11:21:20+0200] Configuration: -Dcc=gcc -Dusedevel -Duse64bitall
[2020-04-05 11:21:20+0200] ------------------------------------------------------------------------------
[2020-04-05 11:21:20+0200] make distclean ...
[2020-04-05 11:22:27+0200] 
[2020-04-05 11:22:27+0200] Copy Policy.sh ...
[2020-04-05 11:22:27+0200] 
[2020-04-05 11:22:27+0200] Configure ...
[2020-04-05 11:23:52+0200] 
[2020-04-05 11:23:52+0200] make ...
===== PROCURA Policy for hpux/ccache gcc ========================
===== PROCURA Policy results ============================
cc:         ccache gcc
ccversion:  -
gccversion: -
ccflags:    -mlp64 -fPIC 
optimize:   
ld:         
ldflags:    -mlp64 -L/pro/local/lib -L/usr/lib/hpux64
libswanted: cl pthread cl pthread socket bind inet nsl ndbm gdbm dbm db malloc dl ld sun m crypt sec util c cposix posix ucb bsd BSD
libsdirs:     /lib /pro/local/lib /usr/lib/hpux64
locincpth:  /pro/local/include
loclibpth:  /usr/lib/hpux64
useshrplib: 
===== PROCURA Policy done ===============================
[2020-04-05 11:39:00+0200] Skip tests from '/pro/3gl/CPAN/smoke/p59.skip'
[2020-04-05 11:39:00+0200] 
[2020-04-05 11:39:00+0200]  Tests start here:
[2020-04-05 11:39:00+0200] TSTENV = stdio	
op.c: In function 'Perl_ck_eval':
op.c:12795:9: warning: value computed is not used [-Wunused-value]
op.c: In function 'Perl_pmruntime':
op.c:7445:15: warning: 't_cp' may be used uninitialized in this function [-Wmaybe-uninitialized]
op.c:7039:14: note: 't_cp' was declared here
op.c:7487:28: warning: 'r_cp' may be used uninitialized in this function [-Wmaybe-uninitialized]
op.c:7039:8: note: 'r_cp' was declared here
pp.c: In function 'Perl_pp_argelem':
pp.c:7025:13: warning: value computed is not used [-Wunused-value]
op.c: In function 'Perl_ck_eval':
op.c:12795:9: warning: value computed is not used [-Wunused-value]
op.c: In function 'Perl_pmruntime':
op.c:7445:15: warning: 't_cp' may be used uninitialized in this function [-Wmaybe-uninitialized]
op.c:7039:14: note: 't_cp' was declared here
op.c:7487:28: warning: 'r_cp' may be used uninitialized in this function [-Wmaybe-uninitialized]
op.c:7039:8: note: 'r_cp' was declared here
RealPPPort.xs: In function 'XS_Devel__PPPort_check_HeUTF8':
RealPPPort.xs:1990:17: warning: value computed is not used [-Wunused-value]
Warning (mostly harmless): No library found for -lposix
Warning (mostly harmless): No library found for -lcposix
./const-xs.inc: In function 'boot_Socket':
./const-xs.inc:986:20: warning: missing braces around initializer [-Wmissing-braces]
./const-xs.inc:986:20: warning: (near initialization for 'ip6_address._s6_un') [-Wmissing-braces]
./const-xs.inc:995:20: warning: missing braces around initializer [-Wmissing-braces]
./const-xs.inc:995:20: warning: (near initialization for 'ip6_address._s6_un') [-Wmissing-braces]
In file included from HiRes.xs:1047:0:
const-c.inc: In function 'constant_19':
const-c.inc:351:42: warning: unused parameter 'iv_return' [-Wunused-parameter]
Making header files for XS...
re_exec.c: In function 'S_regtry':
re_exec.c:6539:30: warning: 'fold_array' may be used uninitialized in this function [-Wmaybe-uninitialized]
re_exec.c:6443:17: note: 'fold_array' was declared here
re_exec.c:6545:28: warning: 'folder' may be used uninitialized in this function [-Wmaybe-uninitialized]
re_exec.c:6442:16: note: 'folder' was declared here
No saved state, selection will be empty
Cannot figure out an encoding to use at t/use-Encode-Alias.t line 5.
# Connected to 127.0.0.1
# Connected to 127.0.0.1
Redefining sub xChild::foo at xChild--13642 line 2.
Redefining sub Data::ok at -e line 1.
# Will use Digest::MD5
[2020-04-05 11:57:00+0200] 
[2020-04-05 11:57:00+0200] All tests successful.
[2020-04-05 11:57:00+0200] ../dist/Net-Ping/t/450_service.t............................PASSED
[2020-04-05 11:57:00+0200]     9, 18
[2020-04-05 11:57:00+0200] Archived results...
[2020-04-05 11:57:00+0200] TSTENV = perlio	
# Connected to 127.0.0.1
# Connected to 127.0.0.1
# Will use Digest::MD5
Cannot figure out an encoding to use at t/use-Encode-Alias.t line 5.
[2020-04-05 12:12:24+0200] 
[2020-04-05 12:12:24+0200] All tests successful.
[2020-04-05 12:12:24+0200] ../dist/Net-Ping/t/450_service.t............................PASSED
[2020-04-05 12:12:24+0200]     9, 18
[2020-04-05 12:12:24+0200] Archived results...
[2020-04-05 12:12:24+0200] TSTENV = locale:en_US.utf8	
# Connected to 127.0.0.1
syswrite() isn't allowed on :utf8 handles at t/Socket.t line 47.
# Looks like your test exited with 255 just after 2.
# Will use Digest::MD5
make: *** [test_harness] Error 1

error while running harness target 'test_harness': 2 at /pro/3gl/CPAN/smoke/lib/Test/Smoke/App/RunSmoke.pm line 118.
[2020-04-05 12:28:08+0200] 
[2020-04-05 12:28:08+0200] ../dist/Net-Ping/t/450_service.t............................PASSED
[2020-04-05 12:28:08+0200]     9, 18
[2020-04-05 12:28:08+0200] ../cpan/Socket/t/Socket.t...................................FAILED
[2020-04-05 12:28:08+0200]     Non-zero exit status: 255
[2020-04-05 12:28:08+0200] ../cpan/Socket/t/Socket.t...................................FAILED
[2020-04-05 12:28:08+0200]     Bad plan.  You planned 6 tests but ran 2.
[2020-04-05 12:28:08+0200] Archived results...
[2020-04-05 12:28:08+0200] Unskip tests from '/pro/3gl/CPAN/smoke/p59.skip'
[2020-04-05 12:28:08+0200] 
[2020-04-05 12:28:08+0200] Configuration: -Dcc=gcc -Dusedevel -Duse64bitall -DDEBUGGING
[2020-04-05 12:28:08+0200] ------------------------------------------------------------------------------
[2020-04-05 12:28:08+0200] make distclean ...
[2020-04-05 12:28:52+0200] 
[2020-04-05 12:28:52+0200] Copy Policy.sh ...
[2020-04-05 12:28:52+0200] 
[2020-04-05 12:28:52+0200] Configure ...
[2020-04-05 12:30:18+0200] 
[2020-04-05 12:30:18+0200] make ...
===== PROCURA Policy for hpux/ccache gcc ========================
===== PROCURA Policy results ============================
cc:         ccache gcc
ccversion:  -
gccversion: -
ccflags:    -mlp64 -fPIC -DDEBUGGING
optimize:   
ld:         
ldflags:    -mlp64 -L/pro/local/lib -L/usr/lib/hpux64
libswanted: cl pthread cl pthread socket bind inet nsl ndbm gdbm dbm db malloc dl ld sun m crypt sec util c cposix posix ucb bsd BSD
libsdirs:     /lib /pro/local/lib /usr/lib/hpux64
locincpth:  /pro/local/include
loclibpth:  /usr/lib/hpux64
useshrplib: 
===== PROCURA Policy done ===============================
[2020-04-05 12:56:01+0200] Skip tests from '/pro/3gl/CPAN/smoke/p59.skip'
[2020-04-05 12:56:01+0200] 
[2020-04-05 12:56:01+0200]  Tests start here:
[2020-04-05 12:56:01+0200] TSTENV = stdio	
op.c: In function 'Perl_ck_eval':
op.c:12795:9: warning: value computed is not used [-Wunused-value]
op.c: In function 'S_pmtrans':
op.c:7445:15: warning: 't_cp' may be used uninitialized in this function [-Wmaybe-uninitialized]
op.c:7487:28: warning: 'r_cp' may be used uninitialized in this function [-Wmaybe-uninitialized]
toke.c: In function 'Perl_scan_num':
toke.c:11631:54: warning: 'b' may be used uninitialized in this function [-Wmaybe-uninitialized]
pp.c: In function 'Perl_pp_argelem':
pp.c:7025:13: warning: value computed is not used [-Wunused-value]
regexec.c: In function 'S_regtry':
regexec.c:6539:30: warning: 'fold_array' may be used uninitialized in this function [-Wmaybe-uninitialized]
regexec.c:6443:17: note: 'fold_array' was declared here
regexec.c:6545:28: warning: 'folder' may be used uninitialized in this function [-Wmaybe-uninitialized]
regexec.c:6442:16: note: 'folder' was declared here
time64.c: In function 'Perl_localtime64_r':
time64.c:573:30: warning: 'orig_year' may be used uninitialized in this function [-Wmaybe-uninitialized]
op.c: In function 'Perl_ck_eval':
op.c:12795:9: warning: value computed is not used [-Wunused-value]
op.c: In function 'S_pmtrans':
op.c:7445:15: warning: 't_cp' may be used uninitialized in this function [-Wmaybe-uninitialized]
op.c:7487:28: warning: 'r_cp' may be used uninitialized in this function [-Wmaybe-uninitialized]
RealPPPort.xs: In function 'XS_Devel__PPPort_check_HeUTF8':
RealPPPort.xs:1990:17: warning: value computed is not used [-Wunused-value]
Warning (mostly harmless): No library found for -lposix
Warning (mostly harmless): No library found for -lcposix
./const-xs.inc: In function 'boot_Socket':
./const-xs.inc:986:20: warning: missing braces around initializer [-Wmissing-braces]
./const-xs.inc:986:20: warning: (near initialization for 'ip6_address._s6_un') [-Wmissing-braces]
./const-xs.inc:995:20: warning: missing braces around initializer [-Wmissing-braces]
./const-xs.inc:995:20: warning: (near initialization for 'ip6_address._s6_un') [-Wmissing-braces]
In file included from HiRes.xs:1047:0:
const-c.inc: In function 'constant_19':
const-c.inc:351:42: warning: unused parameter 'iv_return' [-Wunused-parameter]
Making header files for XS...
re_exec.c: In function 'S_regtry':
re_exec.c:6539:30: warning: 'fold_array' may be used uninitialized in this function [-Wmaybe-uninitialized]
re_exec.c:6443:17: note: 'fold_array' was declared here
re_exec.c:6545:28: warning: 'folder' may be used uninitialized in this function [-Wmaybe-uninitialized]
re_exec.c:6442:16: note: 'folder' was declared here
No saved state, selection will be empty
Cannot figure out an encoding to use at t/use-Encode-Alias.t line 5.
# Connected to 127.0.0.1
# Connected to 127.0.0.1
Redefining sub xChild::foo at xChild--17384 line 2.
Redefining sub Data::ok at -e line 1.
# Will use Digest::MD5
[2020-04-05 13:26:19+0200] 
[2020-04-05 13:26:19+0200] All tests successful.
[2020-04-05 13:26:19+0200] ../dist/Net-Ping/t/450_service.t............................PASSED
[2020-04-05 13:26:19+0200]     9, 18
[2020-04-05 13:26:19+0200] Archived results...
[2020-04-05 13:26:19+0200] TSTENV = perlio	
# Will use Digest::MD5
# Connected to 127.0.0.1
# Connected to 127.0.0.1
Cannot figure out an encoding to use at t/use-Encode-Alias.t line 5.
[2020-04-05 13:51:52+0200] 
[2020-04-05 13:51:52+0200] All tests successful.
[2020-04-05 13:51:52+0200] ../dist/Net-Ping/t/450_service.t............................PASSED
[2020-04-05 13:51:52+0200]     9, 18
[2020-04-05 13:51:52+0200] Archived results...
[2020-04-05 13:51:52+0200] TSTENV = locale:en_US.utf8	
# Will use Digest::MD5
# Connected to 127.0.0.1
syswrite() isn't allowed on :utf8 handles at t/Socket.t line 47.
# Looks like your test exited with 255 just after 2.
make: *** [test_harness] Error 1

error while running harness target 'test_harness': 2 at /pro/3gl/CPAN/smoke/lib/Test/Smoke/App/RunSmoke.pm line 118.
[2020-04-05 14:17:16+0200] 
[2020-04-05 14:17:16+0200] ../dist/Net-Ping/t/450_service.t............................PASSED
[2020-04-05 14:17:16+0200]     9, 18
[2020-04-05 14:17:16+0200] ../cpan/Socket/t/Socket.t...................................FAILED
[2020-04-05 14:17:16+0200]     Non-zero exit status: 255
[2020-04-05 14:17:16+0200] ../cpan/Socket/t/Socket.t...................................FAILED
[2020-04-05 14:17:16+0200]     Bad plan.  You planned 6 tests but ran 2.
[2020-04-05 14:17:16+0200] Archived results...
[2020-04-05 14:17:16+0200] Unskip tests from '/pro/3gl/CPAN/smoke/p59.skip'
[2020-04-05 14:17:16+0200] 
[2020-04-05 14:17:16+0200] Configuration: -Dcc=gcc -Dusedevel -Duseithreads
[2020-04-05 14:17:16+0200] ------------------------------------------------------------------------------
[2020-04-05 14:17:16+0200] make distclean ...
[2020-04-05 14:18:21+0200] 
[2020-04-05 14:18:21+0200] Copy Policy.sh ...
[2020-04-05 14:18:21+0200] 
[2020-04-05 14:18:21+0200] Configure ...
[2020-04-05 14:19:50+0200] 
[2020-04-05 14:19:50+0200] make ...
===== PROCURA Policy for hpux/ccache gcc ========================
===== PROCURA Policy results ============================
cc:         ccache gcc
ccversion:  -
gccversion: -
ccflags:    -milp32 -fPIC 
optimize:   
ld:         
ldflags:    -L/usr/lib/hpux32 -L/pro/local/lib
libswanted: cl pthread cl pthread socket bind inet nsl ndbm gdbm dbm db malloc dl ld sun m crypt sec util c cposix posix ucb bsd BSD
libsdirs:    /usr/lib/hpux32  /lib /pro/local/lib
locincpth:  /pro/local/include
loclibpth:  /usr/lib/hpux32
useshrplib: 
===== PROCURA Policy done ===============================
[2020-04-05 14:36:20+0200] Skip tests from '/pro/3gl/CPAN/smoke/p59.skip'
[2020-04-05 14:36:20+0200] 
[2020-04-05 14:36:20+0200]  Tests start here:
[2020-04-05 14:36:20+0200] TSTENV = stdio	
op.c: In function 'Perl_ck_eval':
op.c:12795:9: warning: value computed is not used [-Wunused-value]
op.c: In function 'Perl_pmruntime':
op.c:7445:15: warning: 't_cp' may be used uninitialized in this function [-Wmaybe-uninitialized]
op.c:7039:14: note: 't_cp' was declared here
op.c:7487:28: warning: 'r_cp' may be used uninitialized in this function [-Wmaybe-uninitialized]
op.c:7039:8: note: 'r_cp' was declared here
pp.c: In function 'Perl_pp_argelem':
pp.c:7025:13: warning: value computed is not used [-Wunused-value]
time64.c: In function 'Perl_localtime64_r':
time64.c:573:30: warning: 'orig_year' may be used uninitialized in this function [-Wmaybe-uninitialized]
op.c: In function 'Perl_ck_eval':
op.c:12795:9: warning: value computed is not used [-Wunused-value]
op.c: In function 'Perl_pmruntime':
op.c:7445:15: warning: 't_cp' may be used uninitialized in this function [-Wmaybe-uninitialized]
op.c:7039:14: note: 't_cp' was declared here
op.c:7487:28: warning: 'r_cp' may be used uninitialized in this function [-Wmaybe-uninitialized]
op.c:7039:8: note: 'r_cp' was declared here
RealPPPort.xs: In function 'XS_Devel__PPPort_check_HeUTF8':
RealPPPort.xs:1990:17: warning: value computed is not used [-Wunused-value]
Warning (mostly harmless): No library found for -lposix
Warning (mostly harmless): No library found for -lcposix
./const-xs.inc: In function 'boot_Socket':
./const-xs.inc:986:20: warning: missing braces around initializer [-Wmissing-braces]
./const-xs.inc:986:20: warning: (near initialization for 'ip6_address._s6_un') [-Wmissing-braces]
./const-xs.inc:995:20: warning: missing braces around initializer [-Wmissing-braces]
./const-xs.inc:995:20: warning: (near initialization for 'ip6_address._s6_un') [-Wmissing-braces]
In file included from HiRes.xs:1047:0:
const-c.inc: In function 'constant_19':
const-c.inc:351:42: warning: unused parameter 'iv_return' [-Wunused-parameter]
Making header files for XS...
APItest.xs: In function 'XS_XS__APItest__HvMacro_u8_to_u16_le':
APItest.xs:6895:13: warning: unused variable 'u64' [-Wunused-variable]
re_exec.c: In function 'S_dump_exec_pos':
re_exec.c:4170:21: warning: format '%u' expects argument of type 'unsigned int', but argument 13 has type 'U32' [-Wformat]
re_exec.c: In function 'S_regtry':
re_exec.c:6539:30: warning: 'fold_array' may be used uninitialized in this function [-Wmaybe-uninitialized]
re_exec.c:6443:17: note: 'fold_array' was declared here
re_exec.c:6545:28: warning: 'folder' may be used uninitialized in this function [-Wmaybe-uninitialized]
re_exec.c:6442:16: note: 'folder' was declared here
shared.xs: In function 'sharedsv_scalar_store':
shared.xs:830:13: warning: value computed is not used [-Wunused-value]
No saved state, selection will be empty
Cannot figure out an encoding to use at t/use-Encode-Alias.t line 5.
# Connected to 127.0.0.1
# Connected to 127.0.0.1
Integer overflow in hexadecimal number at t/broken_univ_can.t line 7.
Redefining sub xChild::foo at xChild--21860 line 2.
Redefining sub Data::ok at -e line 1.
# Will use Digest::MD5
[2020-04-05 14:56:08+0200] 
[2020-04-05 14:56:08+0200] All tests successful.
[2020-04-05 14:56:08+0200] ../dist/Net-Ping/t/450_service.t............................PASSED
[2020-04-05 14:56:08+0200]     9, 18
[2020-04-05 14:56:08+0200] Archived results...
[2020-04-05 14:56:08+0200] TSTENV = perlio	
# Will use Digest::MD5
Integer overflow in hexadecimal number at t/broken_univ_can.t line 7.
# Connected to 127.0.0.1
# Connected to 127.0.0.1
Cannot figure out an encoding to use at t/use-Encode-Alias.t line 5.
[2020-04-05 15:13:23+0200] 
[2020-04-05 15:13:23+0200] All tests successful.
[2020-04-05 15:13:23+0200] ../dist/Net-Ping/t/450_service.t............................PASSED
[2020-04-05 15:13:23+0200]     9, 18
[2020-04-05 15:13:23+0200] Archived results...
[2020-04-05 15:13:23+0200] TSTENV = locale:en_US.utf8	
# Will use Digest::MD5
# Connected to 127.0.0.1
syswrite() isn't allowed on :utf8 handles at t/Socket.t line 47.
# Looks like your test exited with 255 just after 2.
Integer overflow in hexadecimal number at t/broken_univ_can.t line 7.
make: *** [test_harness] Error 1

error while running harness target 'test_harness': 2 at /pro/3gl/CPAN/smoke/lib/Test/Smoke/App/RunSmoke.pm line 118.
[2020-04-05 15:30:55+0200] 
[2020-04-05 15:30:55+0200] ../dist/Net-Ping/t/450_service.t............................PASSED
[2020-04-05 15:30:55+0200]     9, 18
[2020-04-05 15:30:55+0200] ../cpan/Socket/t/Socket.t...................................FAILED
[2020-04-05 15:30:55+0200]     Non-zero exit status: 255
[2020-04-05 15:30:55+0200] ../cpan/Socket/t/Socket.t...................................FAILED
[2020-04-05 15:30:55+0200]     Bad plan.  You planned 6 tests but ran 2.
[2020-04-05 15:30:55+0200] Archived results...
[2020-04-05 15:30:55+0200] Unskip tests from '/pro/3gl/CPAN/smoke/p59.skip'
[2020-04-05 15:30:55+0200] 
[2020-04-05 15:30:55+0200] Configuration: -Dcc=gcc -Dusedevel -Duseithreads -DDEBUGGING
[2020-04-05 15:30:55+0200] ------------------------------------------------------------------------------
[2020-04-05 15:30:55+0200] make distclean ...
[2020-04-05 15:31:43+0200] 
[2020-04-05 15:31:43+0200] Copy Policy.sh ...
[2020-04-05 15:31:43+0200] 
[2020-04-05 15:31:43+0200] Configure ...
[2020-04-05 15:33:13+0200] 
[2020-04-05 15:33:13+0200] make ...
===== PROCURA Policy for hpux/ccache gcc ========================
===== PROCURA Policy results ============================
cc:         ccache gcc
ccversion:  -
gccversion: -
ccflags:    -milp32 -fPIC -DDEBUGGING
optimize:   
ld:         
ldflags:    -L/usr/lib/hpux32 -L/pro/local/lib
libswanted: cl pthread cl pthread socket bind inet nsl ndbm gdbm dbm db malloc dl ld sun m crypt sec util c cposix posix ucb bsd BSD
libsdirs:    /usr/lib/hpux32  /lib /pro/local/lib
locincpth:  /pro/local/include
loclibpth:  /usr/lib/hpux32
useshrplib: 
===== PROCURA Policy done ===============================
[2020-04-05 16:01:26+0200] Skip tests from '/pro/3gl/CPAN/smoke/p59.skip'
[2020-04-05 16:01:26+0200] 
[2020-04-05 16:01:26+0200]  Tests start here:
[2020-04-05 16:01:26+0200] TSTENV = stdio	
op.c: In function 'Perl_ck_eval':
op.c:12795:9: warning: value computed is not used [-Wunused-value]
op.c: In function 'S_pmtrans':
op.c:7445:15: warning: 't_cp' may be used uninitialized in this function [-Wmaybe-uninitialized]
op.c:7487:28: warning: 'r_cp' may be used uninitialized in this function [-Wmaybe-uninitialized]
toke.c: In function 'Perl_scan_num':
toke.c:11631:54: warning: 'b' may be used uninitialized in this function [-Wmaybe-uninitialized]
pp.c: In function 'Perl_pp_argelem':
pp.c:7025:13: warning: value computed is not used [-Wunused-value]
regexec.c: In function 'S_dump_exec_pos':
regexec.c:4170:21: warning: format '%u' expects argument of type 'unsigned int', but argument 13 has type 'U32' [-Wformat]
regexec.c: In function 'S_regtry':
regexec.c:6539:30: warning: 'fold_array' may be used uninitialized in this function [-Wmaybe-uninitialized]
regexec.c:6443:17: note: 'fold_array' was declared here
regexec.c:6545:28: warning: 'folder' may be used uninitialized in this function [-Wmaybe-uninitialized]
regexec.c:6442:16: note: 'folder' was declared here
time64.c: In function 'Perl_localtime64_r':
time64.c:573:30: warning: 'orig_year' may be used uninitialized in this function [-Wmaybe-uninitialized]
op.c: In function 'Perl_ck_eval':
op.c:12795:9: warning: value computed is not used [-Wunused-value]
op.c: In function 'S_pmtrans':
op.c:7445:15: warning: 't_cp' may be used uninitialized in this function [-Wmaybe-uninitialized]
op.c:7487:28: warning: 'r_cp' may be used uninitialized in this function [-Wmaybe-uninitialized]
RealPPPort.xs: In function 'XS_Devel__PPPort_check_HeUTF8':
RealPPPort.xs:1990:17: warning: value computed is not used [-Wunused-value]
Warning (mostly harmless): No library found for -lposix
Warning (mostly harmless): No library found for -lcposix
./const-xs.inc: In function 'boot_Socket':
./const-xs.inc:986:20: warning: missing braces around initializer [-Wmissing-braces]
./const-xs.inc:986:20: warning: (near initialization for 'ip6_address._s6_un') [-Wmissing-braces]
./const-xs.inc:995:20: warning: missing braces around initializer [-Wmissing-braces]
./const-xs.inc:995:20: warning: (near initialization for 'ip6_address._s6_un') [-Wmissing-braces]
Storable.xs: In function 'store_hook':
Storable.xs:4087:17: warning: format '%d' expects argument of type 'int', but argument 3 has type 'I32' [-Wformat]
Storable.xs: In function 'store':
Storable.xs:4462:6: warning: format '%d' expects argument of type 'int', but argument 3 has type 'I32' [-Wformat]
In file included from HiRes.xs:1047:0:
const-c.inc: In function 'constant_19':
const-c.inc:351:42: warning: unused parameter 'iv_return' [-Wunused-parameter]
Making header files for XS...
APItest.xs: In function 'XS_XS__APItest__HvMacro_u8_to_u16_le':
APItest.xs:6895:13: warning: unused variable 'u64' [-Wunused-variable]
re_exec.c: In function 'S_dump_exec_pos':
re_exec.c:4170:21: warning: format '%u' expects argument of type 'unsigned int', but argument 13 has type 'U32' [-Wformat]
re_exec.c: In function 'S_regtry':
re_exec.c:6539:30: warning: 'fold_array' may be used uninitialized in this function [-Wmaybe-uninitialized]
re_exec.c:6443:17: note: 'fold_array' was declared here
re_exec.c:6545:28: warning: 'folder' may be used uninitialized in this function [-Wmaybe-uninitialized]
re_exec.c:6442:16: note: 'folder' was declared here
shared.xs: In function 'sharedsv_scalar_store':
shared.xs:830:13: warning: value computed is not used [-Wunused-value]
No saved state, selection will be empty
Cannot figure out an encoding to use at t/use-Encode-Alias.t line 5.
# Connected to 127.0.0.1
# Connected to 127.0.0.1
Integer overflow in hexadecimal number at t/broken_univ_can.t line 7.
Redefining sub xChild::foo at xChild--27922 line 2.
Redefining sub Data::ok at -e line 1.
# Will use Digest::MD5
make: *** [test_harness] Error 2

error while running harness target 'test_harness': 2 at /pro/3gl/CPAN/smoke/lib/Test/Smoke/App/RunSmoke.pm line 118.
[2020-04-05 16:37:00+0200] 
[2020-04-05 16:37:00+0200] ../dist/Devel-PPPort/t/exception.t..........................FAILED
[2020-04-05 16:37:00+0200]     Bad plan.  You planned 7 tests but ran 4.
[2020-04-05 16:37:00+0200] ../dist/Net-Ping/t/450_service.t............................PASSED
[2020-04-05 16:37:00+0200]     9, 18
[2020-04-05 16:37:00+0200] ../ext/XS-APItest/t/exception.t.............................FAILED
[2020-04-05 16:37:00+0200]     Bad plan.  You planned 12 tests but ran 5.
[2020-04-05 16:37:00+0200] Archived results...
[2020-04-05 16:37:00+0200] TSTENV = perlio	
# Will use Digest::MD5
# Connected to 127.0.0.1
# Connected to 127.0.0.1
Cannot figure out an encoding to use at t/use-Encode-Alias.t line 5.
Integer overflow in hexadecimal number at t/broken_univ_can.t line 7.
make: *** [test_harness] Error 2

error while running harness target 'test_harness': 2 at /pro/3gl/CPAN/smoke/lib/Test/Smoke/App/RunSmoke.pm line 118.
[2020-04-05 17:07:23+0200] 
[2020-04-05 17:07:23+0200] ../dist/Devel-PPPort/t/exception.t..........................FAILED
[2020-04-05 17:07:23+0200]     Bad plan.  You planned 7 tests but ran 4.
[2020-04-05 17:07:23+0200] ../dist/Net-Ping/t/450_service.t............................PASSED
[2020-04-05 17:07:23+0200]     9, 18
[2020-04-05 17:07:23+0200] ../ext/XS-APItest/t/exception.t.............................FAILED
[2020-04-05 17:07:23+0200]     Bad plan.  You planned 12 tests but ran 5.
[2020-04-05 17:07:23+0200] Archived results...
[2020-04-05 17:07:23+0200] TSTENV = locale:en_US.utf8	
# Will use Digest::MD5
Integer overflow in hexadecimal number at t/broken_univ_can.t line 7.
# Connected to 127.0.0.1
syswrite() isn't allowed on :utf8 handles at t/Socket.t line 47.
# Looks like your test exited with 255 just after 2.
make: *** [test_harness] Error 3

error while running harness target 'test_harness': 2 at /pro/3gl/CPAN/smoke/lib/Test/Smoke/App/RunSmoke.pm line 118.
[2020-04-05 17:37:51+0200] 
[2020-04-05 17:37:51+0200] ../dist/Devel-PPPort/t/exception.t..........................FAILED
[2020-04-05 17:37:51+0200]     Bad plan.  You planned 7 tests but ran 4.
[2020-04-05 17:37:51+0200] ../dist/Net-Ping/t/450_service.t............................PASSED
[2020-04-05 17:37:51+0200]     9, 18
[2020-04-05 17:37:51+0200] ../ext/XS-APItest/t/exception.t.............................FAILED
[2020-04-05 17:37:51+0200]     Bad plan.  You planned 12 tests but ran 5.
[2020-04-05 17:37:51+0200] ../cpan/Socket/t/Socket.t...................................FAILED
[2020-04-05 17:37:51+0200]     Non-zero exit status: 255
[2020-04-05 17:37:51+0200] ../cpan/Socket/t/Socket.t...................................FAILED
[2020-04-05 17:37:51+0200]     Bad plan.  You planned 6 tests but ran 2.
[2020-04-05 17:37:51+0200] Archived results...
[2020-04-05 17:37:51+0200] Unskip tests from '/pro/3gl/CPAN/smoke/p59.skip'
[2020-04-05 17:37:51+0200] 
[2020-04-05 17:37:51+0200] Configuration: -Dcc=gcc -Dusedevel -Duseithreads -Duse64bitall
[2020-04-05 17:37:51+0200] ------------------------------------------------------------------------------
[2020-04-05 17:37:51+0200] make distclean ...
[2020-04-05 17:39:04+0200] 
[2020-04-05 17:39:04+0200] Copy Policy.sh ...
[2020-04-05 17:39:04+0200] 
[2020-04-05 17:39:04+0200] Configure ...
[2020-04-05 17:40:33+0200] 
[2020-04-05 17:40:33+0200] make ...
===== PROCURA Policy for hpux/ccache gcc ========================
===== PROCURA Policy results ============================
cc:         ccache gcc
ccversion:  -
gccversion: -
ccflags:    -mlp64 -fPIC 
optimize:   
ld:         
ldflags:    -mlp64 -L/pro/local/lib -L/usr/lib/hpux64
libswanted: cl pthread cl pthread socket bind inet nsl ndbm gdbm dbm db malloc dl ld sun m crypt sec util c cposix posix ucb bsd BSD
libsdirs:     /lib /pro/local/lib /usr/lib/hpux64
locincpth:  /pro/local/include
loclibpth:  /usr/lib/hpux64
useshrplib: 
===== PROCURA Policy done ===============================
[2020-04-05 17:56:39+0200] Skip tests from '/pro/3gl/CPAN/smoke/p59.skip'
[2020-04-05 17:56:39+0200] 
[2020-04-05 17:56:39+0200]  Tests start here:
[2020-04-05 17:56:39+0200] TSTENV = stdio	
op.c: In function 'Perl_ck_eval':
op.c:12795:9: warning: value computed is not used [-Wunused-value]
op.c: In function 'Perl_pmruntime':
op.c:7445:15: warning: 't_cp' may be used uninitialized in this function [-Wmaybe-uninitialized]
op.c:7039:14: note: 't_cp' was declared here
op.c:7487:28: warning: 'r_cp' may be used uninitialized in this function [-Wmaybe-uninitialized]
op.c:7039:8: note: 'r_cp' was declared here
pp.c: In function 'Perl_pp_argelem':
pp.c:7025:13: warning: value computed is not used [-Wunused-value]
time64.c: In function 'Perl_localtime64_r':
time64.c:573:30: warning: 'orig_year' may be used uninitialized in this function [-Wmaybe-uninitialized]
op.c: In function 'Perl_ck_eval':
op.c:12795:9: warning: value computed is not used [-Wunused-value]
op.c: In function 'Perl_pmruntime':
op.c:7445:15: warning: 't_cp' may be used uninitialized in this function [-Wmaybe-uninitialized]
op.c:7039:14: note: 't_cp' was declared here
op.c:7487:28: warning: 'r_cp' may be used uninitialized in this function [-Wmaybe-uninitialized]
op.c:7039:8: note: 'r_cp' was declared here
RealPPPort.xs: In function 'XS_Devel__PPPort_check_HeUTF8':
RealPPPort.xs:1990:17: warning: value computed is not used [-Wunused-value]
Warning (mostly harmless): No library found for -lposix
Warning (mostly harmless): No library found for -lcposix
./const-xs.inc: In function 'boot_Socket':
./const-xs.inc:986:20: warning: missing braces around initializer [-Wmissing-braces]
./const-xs.inc:986:20: warning: (near initialization for 'ip6_address._s6_un') [-Wmissing-braces]
./const-xs.inc:995:20: warning: missing braces around initializer [-Wmissing-braces]
./const-xs.inc:995:20: warning: (near initialization for 'ip6_address._s6_un') [-Wmissing-braces]
In file included from HiRes.xs:1047:0:
const-c.inc: In function 'constant_19':
const-c.inc:351:42: warning: unused parameter 'iv_return' [-Wunused-parameter]
Making header files for XS...
re_exec.c: In function 'S_regtry':
re_exec.c:6539:30: warning: 'fold_array' may be used uninitialized in this function [-Wmaybe-uninitialized]
re_exec.c:6443:17: note: 'fold_array' was declared here
re_exec.c:6545:28: warning: 'folder' may be used uninitialized in this function [-Wmaybe-uninitialized]
re_exec.c:6442:16: note: 'folder' was declared here
shared.xs: In function 'sharedsv_scalar_store':
shared.xs:830:13: warning: value computed is not used [-Wunused-value]
No saved state, selection will be empty
Cannot figure out an encoding to use at t/use-Encode-Alias.t line 5.
# Connected to 127.0.0.1
# Connected to 127.0.0.1
Redefining sub xChild::foo at xChild--3871 line 2.
Redefining sub Data::ok at -e line 1.
# Will use Digest::MD5
make: *** [test_harness] Error 1

error while running harness target 'test_harness': 2 at /pro/3gl/CPAN/smoke/lib/Test/Smoke/App/RunSmoke.pm line 118.
[2020-04-05 18:16:27+0200] 
[2020-04-05 18:16:27+0200] ../dist/Net-Ping/t/450_service.t............................PASSED
[2020-04-05 18:16:27+0200]     9, 18
[2020-04-05 18:16:27+0200] ../lib/locale.t.............................................FAILED
[2020-04-05 18:16:27+0200]     448
[2020-04-05 18:16:27+0200] Archived results...
[2020-04-05 18:16:27+0200] TSTENV = perlio	
# Will use Digest::MD5
# Connected to 127.0.0.1
# Connected to 127.0.0.1
Cannot figure out an encoding to use at t/use-Encode-Alias.t line 5.
[2020-04-05 18:33:39+0200] 
[2020-04-05 18:33:39+0200] All tests successful.
[2020-04-05 18:33:39+0200] ../dist/Net-Ping/t/450_service.t............................PASSED
[2020-04-05 18:33:39+0200]     9, 18
[2020-04-05 18:33:39+0200] Archived results...
[2020-04-05 18:33:39+0200] TSTENV = locale:en_US.utf8	
# Will use Digest::MD5
# Connected to 127.0.0.1
syswrite() isn't allowed on :utf8 handles at t/Socket.t line 47.
# Looks like your test exited with 255 just after 2.
make: *** [test_harness] Error 1

error while running harness target 'test_harness': 2 at /pro/3gl/CPAN/smoke/lib/Test/Smoke/App/RunSmoke.pm line 118.
[2020-04-05 18:51:08+0200] 
[2020-04-05 18:51:08+0200] ../dist/Net-Ping/t/450_service.t............................PASSED
[2020-04-05 18:51:08+0200]     9, 18
[2020-04-05 18:51:08+0200] ../cpan/Socket/t/Socket.t...................................FAILED
[2020-04-05 18:51:08+0200]     Non-zero exit status: 255
[2020-04-05 18:51:08+0200] ../cpan/Socket/t/Socket.t...................................FAILED
[2020-04-05 18:51:08+0200]     Bad plan.  You planned 6 tests but ran 2.
[2020-04-05 18:51:08+0200] Archived results...
[2020-04-05 18:51:08+0200] Unskip tests from '/pro/3gl/CPAN/smoke/p59.skip'
[2020-04-05 18:51:08+0200] 
[2020-04-05 18:51:08+0200] Configuration: -Dcc=gcc -Dusedevel -Duseithreads -Duse64bitall -DDEBUGGING
[2020-04-05 18:51:08+0200] ------------------------------------------------------------------------------
[2020-04-05 18:51:08+0200] make distclean ...
[2020-04-05 18:51:55+0200] 
[2020-04-05 18:51:55+0200] Copy Policy.sh ...
[2020-04-05 18:51:55+0200] 
[2020-04-05 18:51:55+0200] Configure ...
[2020-04-05 18:53:24+0200] 
[2020-04-05 18:53:24+0200] make ...
===== PROCURA Policy for hpux/ccache gcc ========================
===== PROCURA Policy results ============================
cc:         ccache gcc
ccversion:  -
gccversion: -
ccflags:    -mlp64 -fPIC -DDEBUGGING
optimize:   
ld:         
ldflags:    -mlp64 -L/pro/local/lib -L/usr/lib/hpux64
libswanted: cl pthread cl pthread socket bind inet nsl ndbm gdbm dbm db malloc dl ld sun m crypt sec util c cposix posix ucb bsd BSD
libsdirs:     /lib /pro/local/lib /usr/lib/hpux64
locincpth:  /pro/local/include
loclibpth:  /usr/lib/hpux64
useshrplib: 
===== PROCURA Policy done ===============================
[2020-04-05 19:21:00+0200] Skip tests from '/pro/3gl/CPAN/smoke/p59.skip'
[2020-04-05 19:21:00+0200] 
[2020-04-05 19:21:00+0200]  Tests start here:
[2020-04-05 19:21:00+0200] TSTENV = stdio	
op.c: In function 'Perl_ck_eval':
op.c:12795:9: warning: value computed is not used [-Wunused-value]
op.c: In function 'S_pmtrans':
op.c:7445:15: warning: 't_cp' may be used uninitialized in this function [-Wmaybe-uninitialized]
op.c:7487:28: warning: 'r_cp' may be used uninitialized in this function [-Wmaybe-uninitialized]
toke.c: In function 'Perl_scan_num':
toke.c:11631:54: warning: 'b' may be used uninitialized in this function [-Wmaybe-uninitialized]
pp.c: In function 'Perl_pp_argelem':
pp.c:7025:13: warning: value computed is not used [-Wunused-value]
regexec.c: In function 'S_regtry':
regexec.c:6539:30: warning: 'fold_array' may be used uninitialized in this function [-Wmaybe-uninitialized]
regexec.c:6443:17: note: 'fold_array' was declared here
regexec.c:6545:28: warning: 'folder' may be used uninitialized in this function [-Wmaybe-uninitialized]
regexec.c:6442:16: note: 'folder' was declared here
time64.c: In function 'Perl_localtime64_r':
time64.c:573:30: warning: 'orig_year' may be used uninitialized in this function [-Wmaybe-uninitialized]
op.c: In function 'Perl_ck_eval':
op.c:12795:9: warning: value computed is not used [-Wunused-value]
op.c: In function 'S_pmtrans':
op.c:7445:15: warning: 't_cp' may be used uninitialized in this function [-Wmaybe-uninitialized]
op.c:7487:28: warning: 'r_cp' may be used uninitialized in this function [-Wmaybe-uninitialized]
RealPPPort.xs: In function 'XS_Devel__PPPort_check_HeUTF8':
RealPPPort.xs:1990:17: warning: value computed is not used [-Wunused-value]
Warning (mostly harmless): No library found for -lposix
Warning (mostly harmless): No library found for -lcposix
./const-xs.inc: In function 'boot_Socket':
./const-xs.inc:986:20: warning: missing braces around initializer [-Wmissing-braces]
./const-xs.inc:986:20: warning: (near initialization for 'ip6_address._s6_un') [-Wmissing-braces]
./const-xs.inc:995:20: warning: missing braces around initializer [-Wmissing-braces]
./const-xs.inc:995:20: warning: (near initialization for 'ip6_address._s6_un') [-Wmissing-braces]
In file included from HiRes.xs:1047:0:
const-c.inc: In function 'constant_19':
const-c.inc:351:42: warning: unused parameter 'iv_return' [-Wunused-parameter]
Making header files for XS...
re_exec.c: In function 'S_regtry':
re_exec.c:6539:30: warning: 'fold_array' may be used uninitialized in this function [-Wmaybe-uninitialized]
re_exec.c:6443:17: note: 'fold_array' was declared here
re_exec.c:6545:28: warning: 'folder' may be used uninitialized in this function [-Wmaybe-uninitialized]
re_exec.c:6442:16: note: 'folder' was declared here
shared.xs: In function 'sharedsv_scalar_store':
shared.xs:830:13: warning: value computed is not used [-Wunused-value]
No saved state, selection will be empty
Cannot figure out an encoding to use at t/use-Encode-Alias.t line 5.
# Connected to 127.0.0.1
# Connected to 127.0.0.1
Redefining sub xChild::foo at xChild--8479 line 2.
Redefining sub Data::ok at -e line 1.
# Will use Digest::MD5
make: *** [test_harness] Error 2

error while running harness target 'test_harness': 2 at /pro/3gl/CPAN/smoke/lib/Test/Smoke/App/RunSmoke.pm line 118.
[2020-04-05 19:55:21+0200] 
[2020-04-05 19:55:21+0200] ../dist/Devel-PPPort/t/exception.t..........................FAILED
[2020-04-05 19:55:21+0200]     Bad plan.  You planned 7 tests but ran 4.
[2020-04-05 19:55:21+0200] ../dist/Net-Ping/t/450_service.t............................PASSED
[2020-04-05 19:55:21+0200]     9, 18
[2020-04-05 19:55:21+0200] ../ext/XS-APItest/t/exception.t.............................FAILED
[2020-04-05 19:55:21+0200]     Bad plan.  You planned 12 tests but ran 5.
[2020-04-05 19:55:21+0200] Archived results...
[2020-04-05 19:55:21+0200] TSTENV = perlio	
# Connected to 127.0.0.1
# Connected to 127.0.0.1
Cannot figure out an encoding to use at t/use-Encode-Alias.t line 5.
# Will use Digest::MD5
make: *** [test_harness] Error 2

error while running harness target 'test_harness': 2 at /pro/3gl/CPAN/smoke/lib/Test/Smoke/App/RunSmoke.pm line 118.
[2020-04-05 20:24:50+0200] 
[2020-04-05 20:24:50+0200] ../dist/Devel-PPPort/t/exception.t..........................FAILED
[2020-04-05 20:24:50+0200]     Bad plan.  You planned 7 tests but ran 4.
[2020-04-05 20:24:50+0200] ../ext/XS-APItest/t/exception.t.............................FAILED
[2020-04-05 20:24:50+0200]     Bad plan.  You planned 12 tests but ran 5.
[2020-04-05 20:24:50+0200] ../dist/Net-Ping/t/450_service.t............................PASSED
[2020-04-05 20:24:50+0200]     9, 18
[2020-04-05 20:24:50+0200] Archived results...
[2020-04-05 20:24:50+0200] TSTENV = locale:en_US.utf8	
# Will use Digest::MD5
# Connected to 127.0.0.1
syswrite() isn't allowed on :utf8 handles at t/Socket.t line 47.
# Looks like your test exited with 255 just after 2.
make: *** [test_harness] Error 3

error while running harness target 'test_harness': 2 at /pro/3gl/CPAN/smoke/lib/Test/Smoke/App/RunSmoke.pm line 118.
[2020-04-05 20:54:42+0200] 
[2020-04-05 20:54:42+0200] ../dist/Devel-PPPort/t/exception.t..........................FAILED
[2020-04-05 20:54:42+0200]     Bad plan.  You planned 7 tests but ran 4.
[2020-04-05 20:54:42+0200] ../dist/Net-Ping/t/450_service.t............................PASSED
[2020-04-05 20:54:42+0200]     9, 18
[2020-04-05 20:54:42+0200] ../ext/XS-APItest/t/exception.t.............................FAILED
[2020-04-05 20:54:42+0200]     Bad plan.  You planned 12 tests but ran 5.
[2020-04-05 20:54:42+0200] ../cpan/Socket/t/Socket.t...................................FAILED
[2020-04-05 20:54:42+0200]     Non-zero exit status: 255
[2020-04-05 20:54:42+0200] ../cpan/Socket/t/Socket.t...................................FAILED
[2020-04-05 20:54:42+0200]     Bad plan.  You planned 6 tests but ran 2.
[2020-04-05 20:54:42+0200] Archived results...
[2020-04-05 20:54:42+0200] Unskip tests from '/pro/3gl/CPAN/smoke/p59.skip'
[2020-04-05 20:54:42+0200] Finished smoking 0d547987b4a450dd159c70d568bebe35f87b6f0d v5.31.10-36-g0d54798 blead
[2020-04-05 20:54:42+0200] Reading smokeresult from /pro/3gl/CPAN/perl-current/mktest.out
[2020-04-05 20:54:42+0200] Processing [-Dcc=gcc]
[2020-04-05 20:54:42+0200] Processing [-DDEBUGGING -Dcc=gcc]
[2020-04-05 20:54:42+0200] Processing [-Dcc=gcc -Duse64bitall]
[2020-04-05 20:54:42+0200] Processing [-DDEBUGGING -Dcc=gcc -Duse64bitall]
[2020-04-05 20:54:42+0200] Processing [-Dcc=gcc -Duseithreads]
[2020-04-05 20:54:42+0200] Processing [-DDEBUGGING -Dcc=gcc -Duseithreads]
[2020-04-05 20:54:42+0200] Processing [-Dcc=gcc -Duseithreads -Duse64bitall]
[2020-04-05 20:54:42+0200] Processing [-DDEBUGGING -Dcc=gcc -Duseithreads -Duse64bitall]
[2020-04-05 20:54:42+0200] ==> Starting reporter
[2020-04-05 20:54:42+0200] Writing report to '/pro/3gl/CPAN/perl-current/mktest.rpt'
[2020-04-05 20:54:43+0200] Locally applied patches from '/pro/3gl/CPAN/perl-current/patchlevel.h'
[2020-04-05 20:54:43+0200] Patches: 'RC0;uncommitted-changes;SMOKE0d547987b4a450dd159c70d568bebe35f87b6f0d'
[2020-04-05 20:54:43+0200] Looking for cc messages: 'gcc'
-- 
Report generated by Test::Smoke::Gateway v0.09_01