Show report
[2020-03-25 08:23:54+0100] ==> Skipping synctree
[2020-03-25 08:23:54+0100] ==> Starting runsmoke
[2020-03-25 08:23:54+0100] [tssmokeperl.pl] chdir(/pro/3gl/CPAN/perl-current)
[2020-03-25 08:23:54+0100] Setup alarm: Thu Mar 26 07:53:54 2020
[2020-03-25 08:23:54+0100] qx[/pro/bin/perl -e "require q[/pro/3gl/CPAN/perl-current/cpan/Test-Harness/lib/Test/Harness.pm];print Test::Harness->VERSION" 2>&1]
[2020-03-25 08:23:54+0100] Found: Test::Harness version 3.42.
[2020-03-25 08:23:54+0100] Reading build configurations from /pro/3gl/CPAN/smoke/p59.cfg
[2020-03-25 08:23:54+0100] Reading 'Policy.sh' from ../Policy.sh (v=1)
[2020-03-25 08:23:54+0100] Running test suite only with 'harness'
[2020-03-25 08:23:54+0100] make distclean ...
[2020-03-25 08:23:54+0100] Smoking patch afd41ae4e769eb6f4f106977edabdca9ab36b497 v5.31.10-14-gafd41ae
[2020-03-25 08:23:54+0100] Smoking branch blead
[2020-03-25 08:23:55+0100] Locally applied patches from '/pro/3gl/CPAN/perl-current/patchlevel.h'
[2020-03-25 08:23:55+0100] Patches: 'RC0;uncommitted-changes;SMOKEafd41ae4e769eb6f4f106977edabdca9ab36b497'
[2020-03-25 08:23:55+0100] 
[2020-03-25 08:23:55+0100] Configuration: -Dcc=gcc -Dusedevel
[2020-03-25 08:23:55+0100] ------------------------------------------------------------------------------
[2020-03-25 08:23:55+0100] make distclean ...
[2020-03-25 08:23:55+0100] 
[2020-03-25 08:23:55+0100] Copy Policy.sh ...
[2020-03-25 08:23:55+0100] 
[2020-03-25 08:23:55+0100] Configure ...
[2020-03-25 08:25:22+0100] 
[2020-03-25 08:25:22+0100] make ...
===== PROCURA Policy for hpux/ccache gcc ========================
===== PROCURA Policy results ============================
cc:         ccache gcc
ccversion:  -
gccversion: -
ccflags:    -milp32 -fPIC 
optimize:   
ld:         
ldflags:    -L/usr/lib/hpux32 -L/pro/local/lib
libswanted: cl pthread cl pthread socket bind inet nsl ndbm gdbm dbm db malloc dl ld sun m crypt sec util c cposix posix ucb bsd BSD
libsdirs:    /usr/lib/hpux32  /lib /pro/local/lib
locincpth:  /pro/local/include
loclibpth:  /usr/lib/hpux32
useshrplib: 
===== PROCURA Policy done ===============================
[2020-03-25 08:40:48+0100] Skip tests from '/pro/3gl/CPAN/smoke/p59.skip'
[2020-03-25 08:40:48+0100] 
[2020-03-25 08:40:48+0100]  Tests start here:
[2020-03-25 08:40:48+0100] TSTENV = stdio	
op.c: In function 'Perl_ck_eval':
op.c:12772:9: warning: value computed is not used [-Wunused-value]
op.c: In function 'Perl_pmruntime':
op.c:7444:15: warning: 't_cp' may be used uninitialized in this function [-Wmaybe-uninitialized]
op.c:7038:14: note: 't_cp' was declared here
op.c:7481:28: warning: 'r_cp' may be used uninitialized in this function [-Wmaybe-uninitialized]
op.c:7038:8: note: 'r_cp' was declared here
pp.c: In function 'Perl_pp_argelem':
pp.c:7025:13: warning: value computed is not used [-Wunused-value]
op.c: In function 'Perl_ck_eval':
op.c:12772:9: warning: value computed is not used [-Wunused-value]
op.c: In function 'Perl_pmruntime':
op.c:7444:15: warning: 't_cp' may be used uninitialized in this function [-Wmaybe-uninitialized]
op.c:7038:14: note: 't_cp' was declared here
op.c:7481:28: warning: 'r_cp' may be used uninitialized in this function [-Wmaybe-uninitialized]
op.c:7038:8: note: 'r_cp' was declared here
RealPPPort.xs: In function 'XS_Devel__PPPort_check_HeUTF8':
RealPPPort.xs:1990:17: warning: value computed is not used [-Wunused-value]
Opcode.xs: In function 'XS_Opcode_invert_opset':
Opcode.xs:363:2: warning: overflow in implicit constant conversion [-Woverflow]
Warning (mostly harmless): No library found for -lposix
Warning (mostly harmless): No library found for -lcposix
./const-xs.inc: In function 'boot_Socket':
./const-xs.inc:986:20: warning: missing braces around initializer [-Wmissing-braces]
./const-xs.inc:986:20: warning: (near initialization for 'ip6_address._s6_un') [-Wmissing-braces]
./const-xs.inc:995:20: warning: missing braces around initializer [-Wmissing-braces]
./const-xs.inc:995:20: warning: (near initialization for 'ip6_address._s6_un') [-Wmissing-braces]
In file included from HiRes.xs:1047:0:
const-c.inc: In function 'constant_19':
const-c.inc:351:42: warning: unused parameter 'iv_return' [-Wunused-parameter]
Making header files for XS...
APItest.xs: In function 'XS_XS__APItest__HvMacro_u8_to_u16_le':
APItest.xs:6895:13: warning: unused variable 'u64' [-Wunused-variable]
re_exec.c: In function 'S_dump_exec_pos':
re_exec.c:4170:21: warning: format '%u' expects argument of type 'unsigned int', but argument 12 has type 'U32' [-Wformat]
re_exec.c: In function 'S_regtry':
re_exec.c:6539:30: warning: 'fold_array' may be used uninitialized in this function [-Wmaybe-uninitialized]
re_exec.c:6443:17: note: 'fold_array' was declared here
re_exec.c:6545:28: warning: 'folder' may be used uninitialized in this function [-Wmaybe-uninitialized]
re_exec.c:6442:16: note: 'folder' was declared here
No saved state, selection will be empty
Cannot figure out an encoding to use at t/use-Encode-Alias.t line 5.
# Connected to 127.0.0.1
# Connected to 127.0.0.1
Integer overflow in hexadecimal number at t/broken_univ_can.t line 7.
Redefining sub xChild::foo at xChild--14049 line 2.
Redefining sub Data::ok at -e line 1.

#   Failed test 'protocol defined'
#   at t/cachepropagate-unix.t line 54.

#   Failed test 'protocol defined'
#   at t/cachepropagate-unix.t line 109.
# Looks like you failed 2 tests of 15.
# Will use Digest::MD5

#   Failed test 'U8TO16_LE works as expected (hex bytes:12 34)'
#   at t/hv_macro.t line 65.
#          got: '0x1234'
#     expected: '0x3412'

#   Failed test 'U8TO32_LE works as expected (hex bytes:12 34 56 78)'
#   at t/hv_macro.t line 71.
#          got: '0x12345678'
#     expected: '0x78563412'

#   Failed test 'U8TO16_LE works as expected (hex bytes:34 56)'
#   at t/hv_macro.t line 65.
#          got: '0x3456'
#     expected: '0x5634'

#   Failed test 'U8TO32_LE works as expected (hex bytes:34 56 78 9a)'
#   at t/hv_macro.t line 71.
#          got: '0x3456789a'
#     expected: '0x9a785634'

#   Failed test 'U8TO16_LE works as expected (hex bytes:56 78)'
#   at t/hv_macro.t line 65.
#          got: '0x5678'
#     expected: '0x7856'

#   Failed test 'U8TO32_LE works as expected (hex bytes:56 78 9a bc)'
#   at t/hv_macro.t line 71.
#          got: '0x56789abc'
#     expected: '0xbc9a7856'

#   Failed test 'U8TO16_LE works as expected (hex bytes:78 9a)'
#   at t/hv_macro.t line 65.
#          got: '0x789a'
#     expected: '0x9a78'

#   Failed test 'U8TO32_LE works as expected (hex bytes:78 9a bc de)'
#   at t/hv_macro.t line 71.
#          got: '0x789abcde'
#     expected: '0xdebc9a78'

#   Failed test 'U8TO16_LE works as expected (hex bytes:9a bc)'
#   at t/hv_macro.t line 65.
#          got: '0x9abc'
#     expected: '0xbc9a'

#   Failed test 'U8TO32_LE works as expected (hex bytes:9a bc de f0)'
#   at t/hv_macro.t line 71.
#          got: '0x9abcdef0'
#     expected: '0xf0debc9a'

#   Failed test 'U8TO16_LE works as expected (hex bytes:bc de)'
#   at t/hv_macro.t line 65.
#          got: '0xbcde'
#     expected: '0xdebc'

#   Failed test 'U8TO32_LE works as expected (hex bytes:bc de f0 12)'
#   at t/hv_macro.t line 71.
#          got: '0xbcdef012'
#     expected: '0x12f0debc'

#   Failed test 'U8TO16_LE works as expected (hex bytes:de f0)'
#   at t/hv_macro.t line 65.
#          got: '0xdef0'
#     expected: '0xf0de'

#   Failed test 'U8TO32_LE works as expected (hex bytes:de f0 12 34)'
#   at t/hv_macro.t line 71.
#          got: '0xdef01234'
#     expected: '0x3412f0de'

#   Failed test 'U8TO16_LE works as expected (hex bytes:f0 12)'
#   at t/hv_macro.t line 65.
#          got: '0xf012'
#     expected: '0x12f0'

#   Failed test 'U8TO32_LE works as expected (hex bytes:f0 12 34 56)'
#   at t/hv_macro.t line 71.
#          got: '0xf0123456'
#     expected: '0x563412f0'

#   Failed test 'U8TO16_LE works as expected (hex bytes:f0 e1)'
#   at t/hv_macro.t line 65.
#          got: '0xf0e1'
#     expected: '0xe1f0'

#   Failed test 'U8TO32_LE works as expected (hex bytes:f0 e1 d2 c3)'
#   at t/hv_macro.t line 71.
#          got: '0xf0e1d2c3'
#     expected: '0xc3d2e1f0'

#   Failed test 'U8TO16_LE works as expected (hex bytes:e1 d2)'
#   at t/hv_macro.t line 65.
#          got: '0xe1d2'
#     expected: '0xd2e1'

#   Failed test 'U8TO32_LE works as expected (hex bytes:e1 d2 c3 b4)'
#   at t/hv_macro.t line 71.
#          got: '0xe1d2c3b4'
#     expected: '0xb4c3d2e1'

#   Failed test 'U8TO16_LE works as expected (hex bytes:d2 c3)'
#   at t/hv_macro.t line 65.
#          got: '0xd2c3'
#     expected: '0xc3d2'

#   Failed test 'U8TO32_LE works as expected (hex bytes:d2 c3 b4 a5)'
#   at t/hv_macro.t line 71.
#          got: '0xd2c3b4a5'
#     expected: '0xa5b4c3d2'

#   Failed test 'U8TO16_LE works as expected (hex bytes:c3 b4)'
#   at t/hv_macro.t line 65.
#          got: '0xc3b4'
#     expected: '0xb4c3'

#   Failed test 'U8TO32_LE works as expected (hex bytes:c3 b4 a5 96)'
#   at t/hv_macro.t line 71.
#          got: '0xc3b4a596'
#     expected: '0x96a5b4c3'

#   Failed test 'U8TO16_LE works as expected (hex bytes:b4 a5)'
#   at t/hv_macro.t line 65.
#          got: '0xb4a5'
#     expected: '0xa5b4'

#   Failed test 'U8TO32_LE works as expected (hex bytes:b4 a5 96 87)'
#   at t/hv_macro.t line 71.
#          got: '0xb4a59687'
#     expected: '0x8796a5b4'

#   Failed test 'U8TO16_LE works as expected (hex bytes:a5 96)'
#   at t/hv_macro.t line 65.
#          got: '0xa596'
#     expected: '0x96a5'

#   Failed test 'U8TO32_LE works as expected (hex bytes:a5 96 87 f0)'
#   at t/hv_macro.t line 71.
#          got: '0xa59687f0'
#     expected: '0xf08796a5'

#   Failed test 'U8TO16_LE works as expected (hex bytes:96 87)'
#   at t/hv_macro.t line 65.
#          got: '0x9687'
#     expected: '0x8796'

#   Failed test 'U8TO32_LE works as expected (hex bytes:96 87 f0 e1)'
#   at t/hv_macro.t line 71.
#          got: '0x9687f0e1'
#     expected: '0xe1f08796'

#   Failed test 'U8TO16_LE works as expected (hex bytes:87 f0)'
#   at t/hv_macro.t line 65.
#          got: '0x87f0'
#     expected: '0xf087'

#   Failed test 'U8TO32_LE works as expected (hex bytes:87 f0 e1 d2)'
#   at t/hv_macro.t line 71.
#          got: '0x87f0e1d2'
#     expected: '0xd2e1f087'
# Looks like you failed 32 tests of 38.
make: *** [test_harness] Error 34

error while running harness target 'test_harness': 2 at /pro/3gl/CPAN/smoke/lib/Test/Smoke/App/RunSmoke.pm line 118.
[2020-03-25 08:58:42+0100] 
[2020-03-25 08:58:42+0100] ../dist/IO/t/cachepropagate-unix.t..........................FAILED
[2020-03-25 08:58:42+0100]     2, 10
[2020-03-25 08:58:42+0100] ../dist/IO/t/cachepropagate-unix.t..........................FAILED
[2020-03-25 08:58:42+0100]     Non-zero exit status: 2
[2020-03-25 08:58:42+0100] ../dist/Net-Ping/t/450_service.t............................PASSED
[2020-03-25 08:58:42+0100]     9, 18
[2020-03-25 08:58:42+0100] ../ext/XS-APItest/t/hv_macro.t..............................FAILED
[2020-03-25 08:58:42+0100]     2-33
[2020-03-25 08:58:42+0100] ../ext/XS-APItest/t/hv_macro.t..............................FAILED
[2020-03-25 08:58:42+0100]     Non-zero exit status: 32
[2020-03-25 08:58:42+0100] Archived results...
[2020-03-25 08:58:42+0100] TSTENV = perlio	

#   Failed test 'protocol defined'
#   at t/cachepropagate-unix.t line 54.

#   Failed test 'protocol defined'
#   at t/cachepropagate-unix.t line 109.
# Looks like you failed 2 tests of 15.

#   Failed test 'U8TO16_LE works as expected (hex bytes:12 34)'
#   at t/hv_macro.t line 65.
#          got: '0x1234'
#     expected: '0x3412'

#   Failed test 'U8TO32_LE works as expected (hex bytes:12 34 56 78)'
#   at t/hv_macro.t line 71.
#          got: '0x12345678'
#     expected: '0x78563412'

#   Failed test 'U8TO16_LE works as expected (hex bytes:34 56)'
#   at t/hv_macro.t line 65.
#          got: '0x3456'
#     expected: '0x5634'

#   Failed test 'U8TO32_LE works as expected (hex bytes:34 56 78 9a)'
#   at t/hv_macro.t line 71.
#          got: '0x3456789a'
#     expected: '0x9a785634'

#   Failed test 'U8TO16_LE works as expected (hex bytes:56 78)'
#   at t/hv_macro.t line 65.
#          got: '0x5678'
#     expected: '0x7856'

#   Failed test 'U8TO32_LE works as expected (hex bytes:56 78 9a bc)'
#   at t/hv_macro.t line 71.
#          got: '0x56789abc'
#     expected: '0xbc9a7856'

#   Failed test 'U8TO16_LE works as expected (hex bytes:78 9a)'
#   at t/hv_macro.t line 65.
#          got: '0x789a'
#     expected: '0x9a78'

#   Failed test 'U8TO32_LE works as expected (hex bytes:78 9a bc de)'
#   at t/hv_macro.t line 71.
#          got: '0x789abcde'
#     expected: '0xdebc9a78'

#   Failed test 'U8TO16_LE works as expected (hex bytes:9a bc)'
#   at t/hv_macro.t line 65.
#          got: '0x9abc'
#     expected: '0xbc9a'

#   Failed test 'U8TO32_LE works as expected (hex bytes:9a bc de f0)'
#   at t/hv_macro.t line 71.
#          got: '0x9abcdef0'
#     expected: '0xf0debc9a'

#   Failed test 'U8TO16_LE works as expected (hex bytes:bc de)'
#   at t/hv_macro.t line 65.
#          got: '0xbcde'
#     expected: '0xdebc'

#   Failed test 'U8TO32_LE works as expected (hex bytes:bc de f0 12)'
#   at t/hv_macro.t line 71.
#          got: '0xbcdef012'
#     expected: '0x12f0debc'

#   Failed test 'U8TO16_LE works as expected (hex bytes:de f0)'
#   at t/hv_macro.t line 65.
#          got: '0xdef0'
#     expected: '0xf0de'

#   Failed test 'U8TO32_LE works as expected (hex bytes:de f0 12 34)'
#   at t/hv_macro.t line 71.
#          got: '0xdef01234'
#     expected: '0x3412f0de'

#   Failed test 'U8TO16_LE works as expected (hex bytes:f0 12)'
#   at t/hv_macro.t line 65.
#          got: '0xf012'
#     expected: '0x12f0'

#   Failed test 'U8TO32_LE works as expected (hex bytes:f0 12 34 56)'
#   at t/hv_macro.t line 71.
#          got: '0xf0123456'
#     expected: '0x563412f0'

#   Failed test 'U8TO16_LE works as expected (hex bytes:f0 e1)'
#   at t/hv_macro.t line 65.
#          got: '0xf0e1'
#     expected: '0xe1f0'

#   Failed test 'U8TO32_LE works as expected (hex bytes:f0 e1 d2 c3)'
#   at t/hv_macro.t line 71.
#          got: '0xf0e1d2c3'
#     expected: '0xc3d2e1f0'

#   Failed test 'U8TO16_LE works as expected (hex bytes:e1 d2)'
#   at t/hv_macro.t line 65.
#          got: '0xe1d2'
#     expected: '0xd2e1'

#   Failed test 'U8TO32_LE works as expected (hex bytes:e1 d2 c3 b4)'
#   at t/hv_macro.t line 71.
#          got: '0xe1d2c3b4'
#     expected: '0xb4c3d2e1'

#   Failed test 'U8TO16_LE works as expected (hex bytes:d2 c3)'
#   at t/hv_macro.t line 65.
#          got: '0xd2c3'
#     expected: '0xc3d2'

#   Failed test 'U8TO32_LE works as expected (hex bytes:d2 c3 b4 a5)'
#   at t/hv_macro.t line 71.
#          got: '0xd2c3b4a5'
#     expected: '0xa5b4c3d2'

#   Failed test 'U8TO16_LE works as expected (hex bytes:c3 b4)'
#   at t/hv_macro.t line 65.
#          got: '0xc3b4'
#     expected: '0xb4c3'

#   Failed test 'U8TO32_LE works as expected (hex bytes:c3 b4 a5 96)'
#   at t/hv_macro.t line 71.
#          got: '0xc3b4a596'
#     expected: '0x96a5b4c3'

#   Failed test 'U8TO16_LE works as expected (hex bytes:b4 a5)'
#   at t/hv_macro.t line 65.
#          got: '0xb4a5'
#     expected: '0xa5b4'

#   Failed test 'U8TO32_LE works as expected (hex bytes:b4 a5 96 87)'
#   at t/hv_macro.t line 71.
#          got: '0xb4a59687'
#     expected: '0x8796a5b4'

#   Failed test 'U8TO16_LE works as expected (hex bytes:a5 96)'
#   at t/hv_macro.t line 65.
#          got: '0xa596'
#     expected: '0x96a5'

#   Failed test 'U8TO32_LE works as expected (hex bytes:a5 96 87 f0)'
#   at t/hv_macro.t line 71.
#          got: '0xa59687f0'
#     expected: '0xf08796a5'

#   Failed test 'U8TO16_LE works as expected (hex bytes:96 87)'
#   at t/hv_macro.t line 65.
#          got: '0x9687'
#     expected: '0x8796'

#   Failed test 'U8TO32_LE works as expected (hex bytes:96 87 f0 e1)'
#   at t/hv_macro.t line 71.
#          got: '0x9687f0e1'
#     expected: '0xe1f08796'

#   Failed test 'U8TO16_LE works as expected (hex bytes:87 f0)'
#   at t/hv_macro.t line 65.
#          got: '0x87f0'
#     expected: '0xf087'

#   Failed test 'U8TO32_LE works as expected (hex bytes:87 f0 e1 d2)'
#   at t/hv_macro.t line 71.
#          got: '0x87f0e1d2'
#     expected: '0xd2e1f087'
# Looks like you failed 32 tests of 38.
# Will use Digest::MD5
Integer overflow in hexadecimal number at t/broken_univ_can.t line 7.
# Connected to 127.0.0.1
# Connected to 127.0.0.1
Cannot figure out an encoding to use at t/use-Encode-Alias.t line 5.
make: *** [test_harness] Error 34

error while running harness target 'test_harness': 2 at /pro/3gl/CPAN/smoke/lib/Test/Smoke/App/RunSmoke.pm line 118.
[2020-03-25 09:14:11+0100] 
[2020-03-25 09:14:11+0100] ../dist/IO/t/cachepropagate-unix.t..........................FAILED
[2020-03-25 09:14:11+0100]     2, 10
[2020-03-25 09:14:11+0100] ../dist/IO/t/cachepropagate-unix.t..........................FAILED
[2020-03-25 09:14:11+0100]     Non-zero exit status: 2
[2020-03-25 09:14:11+0100] ../dist/Net-Ping/t/450_service.t............................PASSED
[2020-03-25 09:14:11+0100]     9, 18
[2020-03-25 09:14:11+0100] ../ext/XS-APItest/t/hv_macro.t..............................FAILED
[2020-03-25 09:14:11+0100]     2-33
[2020-03-25 09:14:11+0100] ../ext/XS-APItest/t/hv_macro.t..............................FAILED
[2020-03-25 09:14:11+0100]     Non-zero exit status: 32
[2020-03-25 09:14:11+0100] Archived results...
[2020-03-25 09:14:11+0100] TSTENV = locale:en_US.utf8	

#   Failed test 'protocol defined'
#   at t/cachepropagate-unix.t line 54.

#   Failed test 'protocol defined'
#   at t/cachepropagate-unix.t line 109.
# Looks like you failed 2 tests of 15.

#   Failed test 'U8TO16_LE works as expected (hex bytes:12 34)'
#   at t/hv_macro.t line 65.
#          got: '0x1234'
#     expected: '0x3412'

#   Failed test 'U8TO32_LE works as expected (hex bytes:12 34 56 78)'
#   at t/hv_macro.t line 71.
#          got: '0x12345678'
#     expected: '0x78563412'

#   Failed test 'U8TO16_LE works as expected (hex bytes:34 56)'
#   at t/hv_macro.t line 65.
#          got: '0x3456'
#     expected: '0x5634'

#   Failed test 'U8TO32_LE works as expected (hex bytes:34 56 78 9a)'
#   at t/hv_macro.t line 71.
#          got: '0x3456789a'
#     expected: '0x9a785634'

#   Failed test 'U8TO16_LE works as expected (hex bytes:56 78)'
#   at t/hv_macro.t line 65.
#          got: '0x5678'
#     expected: '0x7856'

#   Failed test 'U8TO32_LE works as expected (hex bytes:56 78 9a bc)'
#   at t/hv_macro.t line 71.
#          got: '0x56789abc'
#     expected: '0xbc9a7856'

#   Failed test 'U8TO16_LE works as expected (hex bytes:78 9a)'
#   at t/hv_macro.t line 65.
#          got: '0x789a'
#     expected: '0x9a78'

#   Failed test 'U8TO32_LE works as expected (hex bytes:78 9a bc de)'
#   at t/hv_macro.t line 71.
#          got: '0x789abcde'
#     expected: '0xdebc9a78'

#   Failed test 'U8TO16_LE works as expected (hex bytes:9a bc)'
#   at t/hv_macro.t line 65.
#          got: '0x9abc'
#     expected: '0xbc9a'

#   Failed test 'U8TO32_LE works as expected (hex bytes:9a bc de f0)'
#   at t/hv_macro.t line 71.
#          got: '0x9abcdef0'
#     expected: '0xf0debc9a'

#   Failed test 'U8TO16_LE works as expected (hex bytes:bc de)'
#   at t/hv_macro.t line 65.
#          got: '0xbcde'
#     expected: '0xdebc'

#   Failed test 'U8TO32_LE works as expected (hex bytes:bc de f0 12)'
#   at t/hv_macro.t line 71.
#          got: '0xbcdef012'
#     expected: '0x12f0debc'

#   Failed test 'U8TO16_LE works as expected (hex bytes:de f0)'
#   at t/hv_macro.t line 65.
#          got: '0xdef0'
#     expected: '0xf0de'

#   Failed test 'U8TO32_LE works as expected (hex bytes:de f0 12 34)'
#   at t/hv_macro.t line 71.
#          got: '0xdef01234'
#     expected: '0x3412f0de'

#   Failed test 'U8TO16_LE works as expected (hex bytes:f0 12)'
#   at t/hv_macro.t line 65.
#          got: '0xf012'
#     expected: '0x12f0'

#   Failed test 'U8TO32_LE works as expected (hex bytes:f0 12 34 56)'
#   at t/hv_macro.t line 71.
#          got: '0xf0123456'
#     expected: '0x563412f0'

#   Failed test 'U8TO16_LE works as expected (hex bytes:f0 e1)'
#   at t/hv_macro.t line 65.
#          got: '0xf0e1'
#     expected: '0xe1f0'

#   Failed test 'U8TO32_LE works as expected (hex bytes:f0 e1 d2 c3)'
#   at t/hv_macro.t line 71.
#          got: '0xf0e1d2c3'
#     expected: '0xc3d2e1f0'

#   Failed test 'U8TO16_LE works as expected (hex bytes:e1 d2)'
#   at t/hv_macro.t line 65.
#          got: '0xe1d2'
#     expected: '0xd2e1'

#   Failed test 'U8TO32_LE works as expected (hex bytes:e1 d2 c3 b4)'
#   at t/hv_macro.t line 71.
#          got: '0xe1d2c3b4'
#     expected: '0xb4c3d2e1'

#   Failed test 'U8TO16_LE works as expected (hex bytes:d2 c3)'
#   at t/hv_macro.t line 65.
#          got: '0xd2c3'
#     expected: '0xc3d2'

#   Failed test 'U8TO32_LE works as expected (hex bytes:d2 c3 b4 a5)'
#   at t/hv_macro.t line 71.
#          got: '0xd2c3b4a5'
#     expected: '0xa5b4c3d2'

#   Failed test 'U8TO16_LE works as expected (hex bytes:c3 b4)'
#   at t/hv_macro.t line 65.
#          got: '0xc3b4'
#     expected: '0xb4c3'

#   Failed test 'U8TO32_LE works as expected (hex bytes:c3 b4 a5 96)'
#   at t/hv_macro.t line 71.
#          got: '0xc3b4a596'
#     expected: '0x96a5b4c3'

#   Failed test 'U8TO16_LE works as expected (hex bytes:b4 a5)'
#   at t/hv_macro.t line 65.
#          got: '0xb4a5'
#     expected: '0xa5b4'

#   Failed test 'U8TO32_LE works as expected (hex bytes:b4 a5 96 87)'
#   at t/hv_macro.t line 71.
#          got: '0xb4a59687'
#     expected: '0x8796a5b4'

#   Failed test 'U8TO16_LE works as expected (hex bytes:a5 96)'
#   at t/hv_macro.t line 65.
#          got: '0xa596'
#     expected: '0x96a5'

#   Failed test 'U8TO32_LE works as expected (hex bytes:a5 96 87 f0)'
#   at t/hv_macro.t line 71.
#          got: '0xa59687f0'
#     expected: '0xf08796a5'

#   Failed test 'U8TO16_LE works as expected (hex bytes:96 87)'
#   at t/hv_macro.t line 65.
#          got: '0x9687'
#     expected: '0x8796'

#   Failed test 'U8TO32_LE works as expected (hex bytes:96 87 f0 e1)'
#   at t/hv_macro.t line 71.
#          got: '0x9687f0e1'
#     expected: '0xe1f08796'

#   Failed test 'U8TO16_LE works as expected (hex bytes:87 f0)'
#   at t/hv_macro.t line 65.
#          got: '0x87f0'
#     expected: '0xf087'

#   Failed test 'U8TO32_LE works as expected (hex bytes:87 f0 e1 d2)'
#   at t/hv_macro.t line 71.
#          got: '0x87f0e1d2'
#     expected: '0xd2e1f087'
# Looks like you failed 32 tests of 38.
# Will use Digest::MD5
# Connected to 127.0.0.1
syswrite() isn't allowed on :utf8 handles at t/Socket.t line 47.
# Looks like your test exited with 255 just after 2.
Integer overflow in hexadecimal number at t/broken_univ_can.t line 7.
make: *** [test_harness] Error 34

error while running harness target 'test_harness': 2 at /pro/3gl/CPAN/smoke/lib/Test/Smoke/App/RunSmoke.pm line 118.
[2020-03-25 09:29:51+0100] 
[2020-03-25 09:29:51+0100] ../dist/IO/t/cachepropagate-unix.t..........................FAILED
[2020-03-25 09:29:51+0100]     2, 10
[2020-03-25 09:29:51+0100] ../dist/IO/t/cachepropagate-unix.t..........................FAILED
[2020-03-25 09:29:51+0100]     Non-zero exit status: 2
[2020-03-25 09:29:51+0100] ../dist/Net-Ping/t/450_service.t............................PASSED
[2020-03-25 09:29:51+0100]     9, 18
[2020-03-25 09:29:51+0100] ../ext/XS-APItest/t/hv_macro.t..............................FAILED
[2020-03-25 09:29:51+0100]     2-33
[2020-03-25 09:29:51+0100] ../ext/XS-APItest/t/hv_macro.t..............................FAILED
[2020-03-25 09:29:51+0100]     Non-zero exit status: 32
[2020-03-25 09:29:51+0100] ../cpan/Socket/t/Socket.t...................................FAILED
[2020-03-25 09:29:51+0100]     Non-zero exit status: 255
[2020-03-25 09:29:51+0100] ../cpan/Socket/t/Socket.t...................................FAILED
[2020-03-25 09:29:51+0100]     Bad plan.  You planned 6 tests but ran 2.
[2020-03-25 09:29:51+0100] Archived results...
[2020-03-25 09:29:51+0100] Unskip tests from '/pro/3gl/CPAN/smoke/p59.skip'
[2020-03-25 09:29:51+0100] 
[2020-03-25 09:29:51+0100] Configuration: -Dcc=gcc -Dusedevel -DDEBUGGING
[2020-03-25 09:29:51+0100] ------------------------------------------------------------------------------
[2020-03-25 09:29:51+0100] make distclean ...
[2020-03-25 09:30:36+0100] 
[2020-03-25 09:30:36+0100] Copy Policy.sh ...
[2020-03-25 09:30:36+0100] 
[2020-03-25 09:30:36+0100] Configure ...
[2020-03-25 09:32:01+0100] 
[2020-03-25 09:32:01+0100] make ...
===== PROCURA Policy for hpux/ccache gcc ========================
===== PROCURA Policy results ============================
cc:         ccache gcc
ccversion:  -
gccversion: -
ccflags:    -milp32 -fPIC -DDEBUGGING
optimize:   
ld:         
ldflags:    -L/usr/lib/hpux32 -L/pro/local/lib
libswanted: cl pthread cl pthread socket bind inet nsl ndbm gdbm dbm db malloc dl ld sun m crypt sec util c cposix posix ucb bsd BSD
libsdirs:    /usr/lib/hpux32  /lib /pro/local/lib
locincpth:  /pro/local/include
loclibpth:  /usr/lib/hpux32
useshrplib: 
===== PROCURA Policy done ===============================
[2020-03-25 09:58:36+0100] Skip tests from '/pro/3gl/CPAN/smoke/p59.skip'
[2020-03-25 09:58:36+0100] 
[2020-03-25 09:58:36+0100]  Tests start here:
[2020-03-25 09:58:36+0100] TSTENV = stdio	
op.c: In function 'Perl_ck_eval':
op.c:12772:9: warning: value computed is not used [-Wunused-value]
op.c: In function 'S_pmtrans':
op.c:7444:15: warning: 't_cp' may be used uninitialized in this function [-Wmaybe-uninitialized]
op.c:7481:28: warning: 'r_cp' may be used uninitialized in this function [-Wmaybe-uninitialized]
toke.c: In function 'Perl_scan_num':
toke.c:11631:54: warning: 'b' may be used uninitialized in this function [-Wmaybe-uninitialized]
pp.c: In function 'Perl_pp_argelem':
pp.c:7025:13: warning: value computed is not used [-Wunused-value]
regexec.c: In function 'S_dump_exec_pos':
regexec.c:4170:21: warning: format '%u' expects argument of type 'unsigned int', but argument 12 has type 'U32' [-Wformat]
regexec.c: In function 'S_regtry':
regexec.c:6539:30: warning: 'fold_array' may be used uninitialized in this function [-Wmaybe-uninitialized]
regexec.c:6443:17: note: 'fold_array' was declared here
regexec.c:6545:28: warning: 'folder' may be used uninitialized in this function [-Wmaybe-uninitialized]
regexec.c:6442:16: note: 'folder' was declared here
time64.c: In function 'Perl_localtime64_r':
time64.c:573:30: warning: 'orig_year' may be used uninitialized in this function [-Wmaybe-uninitialized]
op.c: In function 'Perl_ck_eval':
op.c:12772:9: warning: value computed is not used [-Wunused-value]
op.c: In function 'S_pmtrans':
op.c:7444:15: warning: 't_cp' may be used uninitialized in this function [-Wmaybe-uninitialized]
op.c:7481:28: warning: 'r_cp' may be used uninitialized in this function [-Wmaybe-uninitialized]
RealPPPort.xs: In function 'XS_Devel__PPPort_check_HeUTF8':
RealPPPort.xs:1990:17: warning: value computed is not used [-Wunused-value]
Opcode.xs: In function 'XS_Opcode_invert_opset':
Opcode.xs:363:2: warning: overflow in implicit constant conversion [-Woverflow]
Warning (mostly harmless): No library found for -lposix
Warning (mostly harmless): No library found for -lcposix
./const-xs.inc: In function 'boot_Socket':
./const-xs.inc:986:20: warning: missing braces around initializer [-Wmissing-braces]
./const-xs.inc:986:20: warning: (near initialization for 'ip6_address._s6_un') [-Wmissing-braces]
./const-xs.inc:995:20: warning: missing braces around initializer [-Wmissing-braces]
./const-xs.inc:995:20: warning: (near initialization for 'ip6_address._s6_un') [-Wmissing-braces]
Storable.xs: In function 'store_hook':
Storable.xs:4087:17: warning: format '%d' expects argument of type 'int', but argument 3 has type 'I32' [-Wformat]
Storable.xs: In function 'store':
Storable.xs:4462:6: warning: format '%d' expects argument of type 'int', but argument 3 has type 'I32' [-Wformat]
In file included from HiRes.xs:1047:0:
const-c.inc: In function 'constant_19':
const-c.inc:351:42: warning: unused parameter 'iv_return' [-Wunused-parameter]
Making header files for XS...
APItest.xs: In function 'XS_XS__APItest__HvMacro_u8_to_u16_le':
APItest.xs:6895:13: warning: unused variable 'u64' [-Wunused-variable]
re_exec.c: In function 'S_dump_exec_pos':
re_exec.c:4170:21: warning: format '%u' expects argument of type 'unsigned int', but argument 12 has type 'U32' [-Wformat]
re_exec.c: In function 'S_regtry':
re_exec.c:6539:30: warning: 'fold_array' may be used uninitialized in this function [-Wmaybe-uninitialized]
re_exec.c:6443:17: note: 'fold_array' was declared here
re_exec.c:6545:28: warning: 'folder' may be used uninitialized in this function [-Wmaybe-uninitialized]
re_exec.c:6442:16: note: 'folder' was declared here
No saved state, selection will be empty
Cannot figure out an encoding to use at t/use-Encode-Alias.t line 5.
# Connected to 127.0.0.1
# Connected to 127.0.0.1
Integer overflow in hexadecimal number at t/broken_univ_can.t line 7.
Redefining sub xChild::foo at xChild--17812 line 2.
Redefining sub Data::ok at -e line 1.

#   Failed test 'protocol defined'
#   at t/cachepropagate-unix.t line 54.

#   Failed test 'protocol defined'
#   at t/cachepropagate-unix.t line 109.
# Looks like you failed 2 tests of 15.
# Will use Digest::MD5

#   Failed test 'U8TO16_LE works as expected (hex bytes:12 34)'
#   at t/hv_macro.t line 65.
#          got: '0x1234'
#     expected: '0x3412'

#   Failed test 'U8TO32_LE works as expected (hex bytes:12 34 56 78)'
#   at t/hv_macro.t line 71.
#          got: '0x12345678'
#     expected: '0x78563412'

#   Failed test 'U8TO16_LE works as expected (hex bytes:34 56)'
#   at t/hv_macro.t line 65.
#          got: '0x3456'
#     expected: '0x5634'

#   Failed test 'U8TO32_LE works as expected (hex bytes:34 56 78 9a)'
#   at t/hv_macro.t line 71.
#          got: '0x3456789a'
#     expected: '0x9a785634'

#   Failed test 'U8TO16_LE works as expected (hex bytes:56 78)'
#   at t/hv_macro.t line 65.
#          got: '0x5678'
#     expected: '0x7856'

#   Failed test 'U8TO32_LE works as expected (hex bytes:56 78 9a bc)'
#   at t/hv_macro.t line 71.
#          got: '0x56789abc'
#     expected: '0xbc9a7856'

#   Failed test 'U8TO16_LE works as expected (hex bytes:78 9a)'
#   at t/hv_macro.t line 65.
#          got: '0x789a'
#     expected: '0x9a78'

#   Failed test 'U8TO32_LE works as expected (hex bytes:78 9a bc de)'
#   at t/hv_macro.t line 71.
#          got: '0x789abcde'
#     expected: '0xdebc9a78'

#   Failed test 'U8TO16_LE works as expected (hex bytes:9a bc)'
#   at t/hv_macro.t line 65.
#          got: '0x9abc'
#     expected: '0xbc9a'

#   Failed test 'U8TO32_LE works as expected (hex bytes:9a bc de f0)'
#   at t/hv_macro.t line 71.
#          got: '0x9abcdef0'
#     expected: '0xf0debc9a'

#   Failed test 'U8TO16_LE works as expected (hex bytes:bc de)'
#   at t/hv_macro.t line 65.
#          got: '0xbcde'
#     expected: '0xdebc'

#   Failed test 'U8TO32_LE works as expected (hex bytes:bc de f0 12)'
#   at t/hv_macro.t line 71.
#          got: '0xbcdef012'
#     expected: '0x12f0debc'

#   Failed test 'U8TO16_LE works as expected (hex bytes:de f0)'
#   at t/hv_macro.t line 65.
#          got: '0xdef0'
#     expected: '0xf0de'

#   Failed test 'U8TO32_LE works as expected (hex bytes:de f0 12 34)'
#   at t/hv_macro.t line 71.
#          got: '0xdef01234'
#     expected: '0x3412f0de'

#   Failed test 'U8TO16_LE works as expected (hex bytes:f0 12)'
#   at t/hv_macro.t line 65.
#          got: '0xf012'
#     expected: '0x12f0'

#   Failed test 'U8TO32_LE works as expected (hex bytes:f0 12 34 56)'
#   at t/hv_macro.t line 71.
#          got: '0xf0123456'
#     expected: '0x563412f0'

#   Failed test 'U8TO16_LE works as expected (hex bytes:f0 e1)'
#   at t/hv_macro.t line 65.
#          got: '0xf0e1'
#     expected: '0xe1f0'

#   Failed test 'U8TO32_LE works as expected (hex bytes:f0 e1 d2 c3)'
#   at t/hv_macro.t line 71.
#          got: '0xf0e1d2c3'
#     expected: '0xc3d2e1f0'

#   Failed test 'U8TO16_LE works as expected (hex bytes:e1 d2)'
#   at t/hv_macro.t line 65.
#          got: '0xe1d2'
#     expected: '0xd2e1'

#   Failed test 'U8TO32_LE works as expected (hex bytes:e1 d2 c3 b4)'
#   at t/hv_macro.t line 71.
#          got: '0xe1d2c3b4'
#     expected: '0xb4c3d2e1'

#   Failed test 'U8TO16_LE works as expected (hex bytes:d2 c3)'
#   at t/hv_macro.t line 65.
#          got: '0xd2c3'
#     expected: '0xc3d2'

#   Failed test 'U8TO32_LE works as expected (hex bytes:d2 c3 b4 a5)'
#   at t/hv_macro.t line 71.
#          got: '0xd2c3b4a5'
#     expected: '0xa5b4c3d2'

#   Failed test 'U8TO16_LE works as expected (hex bytes:c3 b4)'
#   at t/hv_macro.t line 65.
#          got: '0xc3b4'
#     expected: '0xb4c3'

#   Failed test 'U8TO32_LE works as expected (hex bytes:c3 b4 a5 96)'
#   at t/hv_macro.t line 71.
#          got: '0xc3b4a596'
#     expected: '0x96a5b4c3'

#   Failed test 'U8TO16_LE works as expected (hex bytes:b4 a5)'
#   at t/hv_macro.t line 65.
#          got: '0xb4a5'
#     expected: '0xa5b4'

#   Failed test 'U8TO32_LE works as expected (hex bytes:b4 a5 96 87)'
#   at t/hv_macro.t line 71.
#          got: '0xb4a59687'
#     expected: '0x8796a5b4'

#   Failed test 'U8TO16_LE works as expected (hex bytes:a5 96)'
#   at t/hv_macro.t line 65.
#          got: '0xa596'
#     expected: '0x96a5'

#   Failed test 'U8TO32_LE works as expected (hex bytes:a5 96 87 f0)'
#   at t/hv_macro.t line 71.
#          got: '0xa59687f0'
#     expected: '0xf08796a5'

#   Failed test 'U8TO16_LE works as expected (hex bytes:96 87)'
#   at t/hv_macro.t line 65.
#          got: '0x9687'
#     expected: '0x8796'

#   Failed test 'U8TO32_LE works as expected (hex bytes:96 87 f0 e1)'
#   at t/hv_macro.t line 71.
#          got: '0x9687f0e1'
#     expected: '0xe1f08796'

#   Failed test 'U8TO16_LE works as expected (hex bytes:87 f0)'
#   at t/hv_macro.t line 65.
#          got: '0x87f0'
#     expected: '0xf087'

#   Failed test 'U8TO32_LE works as expected (hex bytes:87 f0 e1 d2)'
#   at t/hv_macro.t line 71.
#          got: '0x87f0e1d2'
#     expected: '0xd2e1f087'
# Looks like you failed 32 tests of 38.
make: *** [test_harness] Error 34

error while running harness target 'test_harness': 2 at /pro/3gl/CPAN/smoke/lib/Test/Smoke/App/RunSmoke.pm line 118.
[2020-03-25 10:29:56+0100] 
[2020-03-25 10:29:56+0100] ../dist/IO/t/cachepropagate-unix.t..........................FAILED
[2020-03-25 10:29:56+0100]     2, 10
[2020-03-25 10:29:56+0100] ../dist/IO/t/cachepropagate-unix.t..........................FAILED
[2020-03-25 10:29:56+0100]     Non-zero exit status: 2
[2020-03-25 10:29:56+0100] ../dist/Net-Ping/t/450_service.t............................PASSED
[2020-03-25 10:29:56+0100]     9, 18
[2020-03-25 10:29:56+0100] ../ext/XS-APItest/t/hv_macro.t..............................FAILED
[2020-03-25 10:29:56+0100]     2-33
[2020-03-25 10:29:56+0100] ../ext/XS-APItest/t/hv_macro.t..............................FAILED
[2020-03-25 10:29:56+0100]     Non-zero exit status: 32
[2020-03-25 10:29:56+0100] Archived results...
[2020-03-25 10:29:56+0100] TSTENV = perlio	

#   Failed test 'protocol defined'
#   at t/cachepropagate-unix.t line 54.

#   Failed test 'protocol defined'
#   at t/cachepropagate-unix.t line 109.
# Looks like you failed 2 tests of 15.

#   Failed test 'U8TO16_LE works as expected (hex bytes:12 34)'
#   at t/hv_macro.t line 65.
#          got: '0x1234'
#     expected: '0x3412'

#   Failed test 'U8TO32_LE works as expected (hex bytes:12 34 56 78)'
#   at t/hv_macro.t line 71.
#          got: '0x12345678'
#     expected: '0x78563412'

#   Failed test 'U8TO16_LE works as expected (hex bytes:34 56)'
#   at t/hv_macro.t line 65.
#          got: '0x3456'
#     expected: '0x5634'

#   Failed test 'U8TO32_LE works as expected (hex bytes:34 56 78 9a)'
#   at t/hv_macro.t line 71.
#          got: '0x3456789a'
#     expected: '0x9a785634'

#   Failed test 'U8TO16_LE works as expected (hex bytes:56 78)'
#   at t/hv_macro.t line 65.
#          got: '0x5678'
#     expected: '0x7856'

#   Failed test 'U8TO32_LE works as expected (hex bytes:56 78 9a bc)'
#   at t/hv_macro.t line 71.
#          got: '0x56789abc'
#     expected: '0xbc9a7856'

#   Failed test 'U8TO16_LE works as expected (hex bytes:78 9a)'
#   at t/hv_macro.t line 65.
#          got: '0x789a'
#     expected: '0x9a78'

#   Failed test 'U8TO32_LE works as expected (hex bytes:78 9a bc de)'
#   at t/hv_macro.t line 71.
#          got: '0x789abcde'
#     expected: '0xdebc9a78'

#   Failed test 'U8TO16_LE works as expected (hex bytes:9a bc)'
#   at t/hv_macro.t line 65.
#          got: '0x9abc'
#     expected: '0xbc9a'

#   Failed test 'U8TO32_LE works as expected (hex bytes:9a bc de f0)'
#   at t/hv_macro.t line 71.
#          got: '0x9abcdef0'
#     expected: '0xf0debc9a'

#   Failed test 'U8TO16_LE works as expected (hex bytes:bc de)'
#   at t/hv_macro.t line 65.
#          got: '0xbcde'
#     expected: '0xdebc'

#   Failed test 'U8TO32_LE works as expected (hex bytes:bc de f0 12)'
#   at t/hv_macro.t line 71.
#          got: '0xbcdef012'
#     expected: '0x12f0debc'

#   Failed test 'U8TO16_LE works as expected (hex bytes:de f0)'
#   at t/hv_macro.t line 65.
#          got: '0xdef0'
#     expected: '0xf0de'

#   Failed test 'U8TO32_LE works as expected (hex bytes:de f0 12 34)'
#   at t/hv_macro.t line 71.
#          got: '0xdef01234'
#     expected: '0x3412f0de'

#   Failed test 'U8TO16_LE works as expected (hex bytes:f0 12)'
#   at t/hv_macro.t line 65.
#          got: '0xf012'
#     expected: '0x12f0'

#   Failed test 'U8TO32_LE works as expected (hex bytes:f0 12 34 56)'
#   at t/hv_macro.t line 71.
#          got: '0xf0123456'
#     expected: '0x563412f0'

#   Failed test 'U8TO16_LE works as expected (hex bytes:f0 e1)'
#   at t/hv_macro.t line 65.
#          got: '0xf0e1'
#     expected: '0xe1f0'

#   Failed test 'U8TO32_LE works as expected (hex bytes:f0 e1 d2 c3)'
#   at t/hv_macro.t line 71.
#          got: '0xf0e1d2c3'
#     expected: '0xc3d2e1f0'

#   Failed test 'U8TO16_LE works as expected (hex bytes:e1 d2)'
#   at t/hv_macro.t line 65.
#          got: '0xe1d2'
#     expected: '0xd2e1'

#   Failed test 'U8TO32_LE works as expected (hex bytes:e1 d2 c3 b4)'
#   at t/hv_macro.t line 71.
#          got: '0xe1d2c3b4'
#     expected: '0xb4c3d2e1'

#   Failed test 'U8TO16_LE works as expected (hex bytes:d2 c3)'
#   at t/hv_macro.t line 65.
#          got: '0xd2c3'
#     expected: '0xc3d2'

#   Failed test 'U8TO32_LE works as expected (hex bytes:d2 c3 b4 a5)'
#   at t/hv_macro.t line 71.
#          got: '0xd2c3b4a5'
#     expected: '0xa5b4c3d2'

#   Failed test 'U8TO16_LE works as expected (hex bytes:c3 b4)'
#   at t/hv_macro.t line 65.
#          got: '0xc3b4'
#     expected: '0xb4c3'

#   Failed test 'U8TO32_LE works as expected (hex bytes:c3 b4 a5 96)'
#   at t/hv_macro.t line 71.
#          got: '0xc3b4a596'
#     expected: '0x96a5b4c3'

#   Failed test 'U8TO16_LE works as expected (hex bytes:b4 a5)'
#   at t/hv_macro.t line 65.
#          got: '0xb4a5'
#     expected: '0xa5b4'

#   Failed test 'U8TO32_LE works as expected (hex bytes:b4 a5 96 87)'
#   at t/hv_macro.t line 71.
#          got: '0xb4a59687'
#     expected: '0x8796a5b4'

#   Failed test 'U8TO16_LE works as expected (hex bytes:a5 96)'
#   at t/hv_macro.t line 65.
#          got: '0xa596'
#     expected: '0x96a5'

#   Failed test 'U8TO32_LE works as expected (hex bytes:a5 96 87 f0)'
#   at t/hv_macro.t line 71.
#          got: '0xa59687f0'
#     expected: '0xf08796a5'

#   Failed test 'U8TO16_LE works as expected (hex bytes:96 87)'
#   at t/hv_macro.t line 65.
#          got: '0x9687'
#     expected: '0x8796'

#   Failed test 'U8TO32_LE works as expected (hex bytes:96 87 f0 e1)'
#   at t/hv_macro.t line 71.
#          got: '0x9687f0e1'
#     expected: '0xe1f08796'

#   Failed test 'U8TO16_LE works as expected (hex bytes:87 f0)'
#   at t/hv_macro.t line 65.
#          got: '0x87f0'
#     expected: '0xf087'

#   Failed test 'U8TO32_LE works as expected (hex bytes:87 f0 e1 d2)'
#   at t/hv_macro.t line 71.
#          got: '0x87f0e1d2'
#     expected: '0xd2e1f087'
# Looks like you failed 32 tests of 38.
Integer overflow in hexadecimal number at t/broken_univ_can.t line 7.
# Connected to 127.0.0.1
# Connected to 127.0.0.1
# Will use Digest::MD5
Cannot figure out an encoding to use at t/use-Encode-Alias.t line 5.
make: *** [test_harness] Error 34

error while running harness target 'test_harness': 2 at /pro/3gl/CPAN/smoke/lib/Test/Smoke/App/RunSmoke.pm line 118.
[2020-03-25 10:56:18+0100] 
[2020-03-25 10:56:18+0100] ../dist/IO/t/cachepropagate-unix.t..........................FAILED
[2020-03-25 10:56:18+0100]     2, 10
[2020-03-25 10:56:18+0100] ../dist/IO/t/cachepropagate-unix.t..........................FAILED
[2020-03-25 10:56:18+0100]     Non-zero exit status: 2
[2020-03-25 10:56:18+0100] ../dist/Net-Ping/t/450_service.t............................PASSED
[2020-03-25 10:56:18+0100]     9, 18
[2020-03-25 10:56:18+0100] ../ext/XS-APItest/t/hv_macro.t..............................FAILED
[2020-03-25 10:56:18+0100]     2-33
[2020-03-25 10:56:18+0100] ../ext/XS-APItest/t/hv_macro.t..............................FAILED
[2020-03-25 10:56:18+0100]     Non-zero exit status: 32
[2020-03-25 10:56:18+0100] Archived results...
[2020-03-25 10:56:18+0100] TSTENV = locale:en_US.utf8	

#   Failed test 'protocol defined'
#   at t/cachepropagate-unix.t line 54.

#   Failed test 'protocol defined'
#   at t/cachepropagate-unix.t line 109.
# Looks like you failed 2 tests of 15.

#   Failed test 'U8TO16_LE works as expected (hex bytes:12 34)'
#   at t/hv_macro.t line 65.
#          got: '0x1234'
#     expected: '0x3412'

#   Failed test 'U8TO32_LE works as expected (hex bytes:12 34 56 78)'
#   at t/hv_macro.t line 71.
#          got: '0x12345678'
#     expected: '0x78563412'

#   Failed test 'U8TO16_LE works as expected (hex bytes:34 56)'
#   at t/hv_macro.t line 65.
#          got: '0x3456'
#     expected: '0x5634'

#   Failed test 'U8TO32_LE works as expected (hex bytes:34 56 78 9a)'
#   at t/hv_macro.t line 71.
#          got: '0x3456789a'
#     expected: '0x9a785634'

#   Failed test 'U8TO16_LE works as expected (hex bytes:56 78)'
#   at t/hv_macro.t line 65.
#          got: '0x5678'
#     expected: '0x7856'

#   Failed test 'U8TO32_LE works as expected (hex bytes:56 78 9a bc)'
#   at t/hv_macro.t line 71.
#          got: '0x56789abc'
#     expected: '0xbc9a7856'

#   Failed test 'U8TO16_LE works as expected (hex bytes:78 9a)'
#   at t/hv_macro.t line 65.
#          got: '0x789a'
#     expected: '0x9a78'

#   Failed test 'U8TO32_LE works as expected (hex bytes:78 9a bc de)'
#   at t/hv_macro.t line 71.
#          got: '0x789abcde'
#     expected: '0xdebc9a78'

#   Failed test 'U8TO16_LE works as expected (hex bytes:9a bc)'
#   at t/hv_macro.t line 65.
#          got: '0x9abc'
#     expected: '0xbc9a'

#   Failed test 'U8TO32_LE works as expected (hex bytes:9a bc de f0)'
#   at t/hv_macro.t line 71.
#          got: '0x9abcdef0'
#     expected: '0xf0debc9a'

#   Failed test 'U8TO16_LE works as expected (hex bytes:bc de)'
#   at t/hv_macro.t line 65.
#          got: '0xbcde'
#     expected: '0xdebc'

#   Failed test 'U8TO32_LE works as expected (hex bytes:bc de f0 12)'
#   at t/hv_macro.t line 71.
#          got: '0xbcdef012'
#     expected: '0x12f0debc'

#   Failed test 'U8TO16_LE works as expected (hex bytes:de f0)'
#   at t/hv_macro.t line 65.
#          got: '0xdef0'
#     expected: '0xf0de'

#   Failed test 'U8TO32_LE works as expected (hex bytes:de f0 12 34)'
#   at t/hv_macro.t line 71.
#          got: '0xdef01234'
#     expected: '0x3412f0de'

#   Failed test 'U8TO16_LE works as expected (hex bytes:f0 12)'
#   at t/hv_macro.t line 65.
#          got: '0xf012'
#     expected: '0x12f0'

#   Failed test 'U8TO32_LE works as expected (hex bytes:f0 12 34 56)'
#   at t/hv_macro.t line 71.
#          got: '0xf0123456'
#     expected: '0x563412f0'

#   Failed test 'U8TO16_LE works as expected (hex bytes:f0 e1)'
#   at t/hv_macro.t line 65.
#          got: '0xf0e1'
#     expected: '0xe1f0'

#   Failed test 'U8TO32_LE works as expected (hex bytes:f0 e1 d2 c3)'
#   at t/hv_macro.t line 71.
#          got: '0xf0e1d2c3'
#     expected: '0xc3d2e1f0'

#   Failed test 'U8TO16_LE works as expected (hex bytes:e1 d2)'
#   at t/hv_macro.t line 65.
#          got: '0xe1d2'
#     expected: '0xd2e1'

#   Failed test 'U8TO32_LE works as expected (hex bytes:e1 d2 c3 b4)'
#   at t/hv_macro.t line 71.
#          got: '0xe1d2c3b4'
#     expected: '0xb4c3d2e1'

#   Failed test 'U8TO16_LE works as expected (hex bytes:d2 c3)'
#   at t/hv_macro.t line 65.
#          got: '0xd2c3'
#     expected: '0xc3d2'

#   Failed test 'U8TO32_LE works as expected (hex bytes:d2 c3 b4 a5)'
#   at t/hv_macro.t line 71.
#          got: '0xd2c3b4a5'
#     expected: '0xa5b4c3d2'

#   Failed test 'U8TO16_LE works as expected (hex bytes:c3 b4)'
#   at t/hv_macro.t line 65.
#          got: '0xc3b4'
#     expected: '0xb4c3'

#   Failed test 'U8TO32_LE works as expected (hex bytes:c3 b4 a5 96)'
#   at t/hv_macro.t line 71.
#          got: '0xc3b4a596'
#     expected: '0x96a5b4c3'

#   Failed test 'U8TO16_LE works as expected (hex bytes:b4 a5)'
#   at t/hv_macro.t line 65.
#          got: '0xb4a5'
#     expected: '0xa5b4'

#   Failed test 'U8TO32_LE works as expected (hex bytes:b4 a5 96 87)'
#   at t/hv_macro.t line 71.
#          got: '0xb4a59687'
#     expected: '0x8796a5b4'

#   Failed test 'U8TO16_LE works as expected (hex bytes:a5 96)'
#   at t/hv_macro.t line 65.
#          got: '0xa596'
#     expected: '0x96a5'

#   Failed test 'U8TO32_LE works as expected (hex bytes:a5 96 87 f0)'
#   at t/hv_macro.t line 71.
#          got: '0xa59687f0'
#     expected: '0xf08796a5'

#   Failed test 'U8TO16_LE works as expected (hex bytes:96 87)'
#   at t/hv_macro.t line 65.
#          got: '0x9687'
#     expected: '0x8796'

#   Failed test 'U8TO32_LE works as expected (hex bytes:96 87 f0 e1)'
#   at t/hv_macro.t line 71.
#          got: '0x9687f0e1'
#     expected: '0xe1f08796'

#   Failed test 'U8TO16_LE works as expected (hex bytes:87 f0)'
#   at t/hv_macro.t line 65.
#          got: '0x87f0'
#     expected: '0xf087'

#   Failed test 'U8TO32_LE works as expected (hex bytes:87 f0 e1 d2)'
#   at t/hv_macro.t line 71.
#          got: '0x87f0e1d2'
#     expected: '0xd2e1f087'
# Looks like you failed 32 tests of 38.
# Will use Digest::MD5
# Connected to 127.0.0.1
syswrite() isn't allowed on :utf8 handles at t/Socket.t line 47.
# Looks like your test exited with 255 just after 2.
Integer overflow in hexadecimal number at t/broken_univ_can.t line 7.
make: *** [test_harness] Error 34

error while running harness target 'test_harness': 2 at /pro/3gl/CPAN/smoke/lib/Test/Smoke/App/RunSmoke.pm line 118.
[2020-03-25 11:22:43+0100] 
[2020-03-25 11:22:43+0100] ../dist/IO/t/cachepropagate-unix.t..........................FAILED
[2020-03-25 11:22:43+0100]     2, 10
[2020-03-25 11:22:43+0100] ../dist/IO/t/cachepropagate-unix.t..........................FAILED
[2020-03-25 11:22:43+0100]     Non-zero exit status: 2
[2020-03-25 11:22:43+0100] ../dist/Net-Ping/t/450_service.t............................PASSED
[2020-03-25 11:22:43+0100]     9, 18
[2020-03-25 11:22:43+0100] ../ext/XS-APItest/t/hv_macro.t..............................FAILED
[2020-03-25 11:22:43+0100]     2-33
[2020-03-25 11:22:43+0100] ../ext/XS-APItest/t/hv_macro.t..............................FAILED
[2020-03-25 11:22:43+0100]     Non-zero exit status: 32
[2020-03-25 11:22:43+0100] ../cpan/Socket/t/Socket.t...................................FAILED
[2020-03-25 11:22:43+0100]     Non-zero exit status: 255
[2020-03-25 11:22:43+0100] ../cpan/Socket/t/Socket.t...................................FAILED
[2020-03-25 11:22:43+0100]     Bad plan.  You planned 6 tests but ran 2.
[2020-03-25 11:22:43+0100] Archived results...
[2020-03-25 11:22:43+0100] Unskip tests from '/pro/3gl/CPAN/smoke/p59.skip'
[2020-03-25 11:22:43+0100] 
[2020-03-25 11:22:43+0100] Configuration: -Dcc=gcc -Dusedevel -Duse64bitall
[2020-03-25 11:22:43+0100] ------------------------------------------------------------------------------
[2020-03-25 11:22:43+0100] make distclean ...
[2020-03-25 11:23:50+0100] 
[2020-03-25 11:23:50+0100] Copy Policy.sh ...
[2020-03-25 11:23:50+0100] 
[2020-03-25 11:23:50+0100] Configure ...
[2020-03-25 11:25:15+0100] 
[2020-03-25 11:25:15+0100] make ...
===== PROCURA Policy for hpux/ccache gcc ========================
===== PROCURA Policy results ============================
cc:         ccache gcc
ccversion:  -
gccversion: -
ccflags:    -mlp64 -fPIC 
optimize:   
ld:         
ldflags:    -mlp64 -L/pro/local/lib -L/usr/lib/hpux64
libswanted: cl pthread cl pthread socket bind inet nsl ndbm gdbm dbm db malloc dl ld sun m crypt sec util c cposix posix ucb bsd BSD
libsdirs:     /lib /pro/local/lib /usr/lib/hpux64
locincpth:  /pro/local/include
loclibpth:  /usr/lib/hpux64
useshrplib: 
===== PROCURA Policy done ===============================
[2020-03-25 11:40:22+0100] Skip tests from '/pro/3gl/CPAN/smoke/p59.skip'
[2020-03-25 11:40:22+0100] 
[2020-03-25 11:40:22+0100]  Tests start here:
[2020-03-25 11:40:22+0100] TSTENV = stdio	
op.c: In function 'Perl_ck_eval':
op.c:12772:9: warning: value computed is not used [-Wunused-value]
op.c: In function 'Perl_pmruntime':
op.c:7444:15: warning: 't_cp' may be used uninitialized in this function [-Wmaybe-uninitialized]
op.c:7038:14: note: 't_cp' was declared here
op.c:7481:28: warning: 'r_cp' may be used uninitialized in this function [-Wmaybe-uninitialized]
op.c:7038:8: note: 'r_cp' was declared here
pp.c: In function 'Perl_pp_argelem':
pp.c:7025:13: warning: value computed is not used [-Wunused-value]
op.c: In function 'Perl_ck_eval':
op.c:12772:9: warning: value computed is not used [-Wunused-value]
op.c: In function 'Perl_pmruntime':
op.c:7444:15: warning: 't_cp' may be used uninitialized in this function [-Wmaybe-uninitialized]
op.c:7038:14: note: 't_cp' was declared here
op.c:7481:28: warning: 'r_cp' may be used uninitialized in this function [-Wmaybe-uninitialized]
op.c:7038:8: note: 'r_cp' was declared here
RealPPPort.xs: In function 'XS_Devel__PPPort_check_HeUTF8':
RealPPPort.xs:1990:17: warning: value computed is not used [-Wunused-value]
Opcode.xs: In function 'XS_Opcode_invert_opset':
Opcode.xs:363:2: warning: overflow in implicit constant conversion [-Woverflow]
Warning (mostly harmless): No library found for -lposix
Warning (mostly harmless): No library found for -lcposix
./const-xs.inc: In function 'boot_Socket':
./const-xs.inc:986:20: warning: missing braces around initializer [-Wmissing-braces]
./const-xs.inc:986:20: warning: (near initialization for 'ip6_address._s6_un') [-Wmissing-braces]
./const-xs.inc:995:20: warning: missing braces around initializer [-Wmissing-braces]
./const-xs.inc:995:20: warning: (near initialization for 'ip6_address._s6_un') [-Wmissing-braces]
In file included from HiRes.xs:1047:0:
const-c.inc: In function 'constant_19':
const-c.inc:351:42: warning: unused parameter 'iv_return' [-Wunused-parameter]
Making header files for XS...
re_exec.c: In function 'S_regtry':
re_exec.c:6539:30: warning: 'fold_array' may be used uninitialized in this function [-Wmaybe-uninitialized]
re_exec.c:6443:17: note: 'fold_array' was declared here
re_exec.c:6545:28: warning: 'folder' may be used uninitialized in this function [-Wmaybe-uninitialized]
re_exec.c:6442:16: note: 'folder' was declared here
No saved state, selection will be empty
Cannot figure out an encoding to use at t/use-Encode-Alias.t line 5.
# Connected to 127.0.0.1
# Connected to 127.0.0.1
Redefining sub xChild::foo at xChild--21355 line 2.
Redefining sub Data::ok at -e line 1.

#   Failed test 'protocol defined'
#   at t/cachepropagate-unix.t line 54.

#   Failed test 'protocol defined'
#   at t/cachepropagate-unix.t line 109.
# Looks like you failed 2 tests of 15.
# Will use Digest::MD5

#   Failed test 'U8TO16_LE works as expected (hex bytes:12 34)'
#   at t/hv_macro.t line 65.
#          got: '0x1234'
#     expected: '0x3412'

#   Failed test 'U8TO32_LE works as expected (hex bytes:12 34 56 78)'
#   at t/hv_macro.t line 71.
#          got: '0x12345678'
#     expected: '0x78563412'

#   Failed test 'U8TO64_LE works as expected (hex bytes:12 34 56 78 9a bc de f0)'
#   at t/hv_macro.t line 78.
#          got: '0x123456789abcdef0'
#     expected: '0xf0debc9a78563412'

#   Failed test 'U8TO16_LE works as expected (hex bytes:34 56)'
#   at t/hv_macro.t line 65.
#          got: '0x3456'
#     expected: '0x5634'

#   Failed test 'U8TO32_LE works as expected (hex bytes:34 56 78 9a)'
#   at t/hv_macro.t line 71.
#          got: '0x3456789a'
#     expected: '0x9a785634'

#   Failed test 'U8TO64_LE works as expected (hex bytes:34 56 78 9a bc de f0 12)'
#   at t/hv_macro.t line 78.
#          got: '0x3456789abcdef012'
#     expected: '0x12f0debc9a785634'

#   Failed test 'U8TO16_LE works as expected (hex bytes:56 78)'
#   at t/hv_macro.t line 65.
#          got: '0x5678'
#     expected: '0x7856'

#   Failed test 'U8TO32_LE works as expected (hex bytes:56 78 9a bc)'
#   at t/hv_macro.t line 71.
#          got: '0x56789abc'
#     expected: '0xbc9a7856'

#   Failed test 'U8TO64_LE works as expected (hex bytes:56 78 9a bc de f0 12 34)'
#   at t/hv_macro.t line 78.
#          got: '0x56789abcdef01234'
#     expected: '0x3412f0debc9a7856'

#   Failed test 'U8TO16_LE works as expected (hex bytes:78 9a)'
#   at t/hv_macro.t line 65.
#          got: '0x789a'
#     expected: '0x9a78'

#   Failed test 'U8TO32_LE works as expected (hex bytes:78 9a bc de)'
#   at t/hv_macro.t line 71.
#          got: '0x789abcde'
#     expected: '0xdebc9a78'

#   Failed test 'U8TO64_LE works as expected (hex bytes:78 9a bc de f0 12 34 56)'
#   at t/hv_macro.t line 78.
#          got: '0x789abcdef0123456'
#     expected: '0x563412f0debc9a78'

#   Failed test 'U8TO16_LE works as expected (hex bytes:9a bc)'
#   at t/hv_macro.t line 65.
#          got: '0x9abc'
#     expected: '0xbc9a'

#   Failed test 'U8TO32_LE works as expected (hex bytes:9a bc de f0)'
#   at t/hv_macro.t line 71.
#          got: '0x9abcdef0'
#     expected: '0xf0debc9a'

#   Failed test 'U8TO64_LE works as expected (hex bytes:9a bc de f0 12 34 56 78)'
#   at t/hv_macro.t line 78.
#          got: '0x9abcdef012345678'
#     expected: '0x78563412f0debc9a'

#   Failed test 'U8TO16_LE works as expected (hex bytes:bc de)'
#   at t/hv_macro.t line 65.
#          got: '0xbcde'
#     expected: '0xdebc'

#   Failed test 'U8TO32_LE works as expected (hex bytes:bc de f0 12)'
#   at t/hv_macro.t line 71.
#          got: '0xbcdef012'
#     expected: '0x12f0debc'

#   Failed test 'U8TO64_LE works as expected (hex bytes:bc de f0 12 34 56 78 9a)'
#   at t/hv_macro.t line 78.
#          got: '0xbcdef0123456789a'
#     expected: '0x9a78563412f0debc'

#   Failed test 'U8TO16_LE works as expected (hex bytes:de f0)'
#   at t/hv_macro.t line 65.
#          got: '0xdef0'
#     expected: '0xf0de'

#   Failed test 'U8TO32_LE works as expected (hex bytes:de f0 12 34)'
#   at t/hv_macro.t line 71.
#          got: '0xdef01234'
#     expected: '0x3412f0de'

#   Failed test 'U8TO64_LE works as expected (hex bytes:de f0 12 34 56 78 9a bc)'
#   at t/hv_macro.t line 78.
#          got: '0xdef0123456789abc'
#     expected: '0xbc9a78563412f0de'

#   Failed test 'U8TO16_LE works as expected (hex bytes:f0 12)'
#   at t/hv_macro.t line 65.
#          got: '0xf012'
#     expected: '0x12f0'

#   Failed test 'U8TO32_LE works as expected (hex bytes:f0 12 34 56)'
#   at t/hv_macro.t line 71.
#          got: '0xf0123456'
#     expected: '0x563412f0'

#   Failed test 'U8TO64_LE works as expected (hex bytes:f0 12 34 56 78 9a bc de)'
#   at t/hv_macro.t line 78.
#          got: '0xf0123456789abcde'
#     expected: '0xdebc9a78563412f0'

#   Failed test 'U8TO16_LE works as expected (hex bytes:f0 e1)'
#   at t/hv_macro.t line 65.
#          got: '0xf0e1'
#     expected: '0xe1f0'

#   Failed test 'U8TO32_LE works as expected (hex bytes:f0 e1 d2 c3)'
#   at t/hv_macro.t line 71.
#          got: '0xf0e1d2c3'
#     expected: '0xc3d2e1f0'

#   Failed test 'U8TO64_LE works as expected (hex bytes:f0 e1 d2 c3 b4 a5 96 87)'
#   at t/hv_macro.t line 78.
#          got: '0xf0e1d2c3b4a59687'
#     expected: '0x8796a5b4c3d2e1f0'

#   Failed test 'U8TO16_LE works as expected (hex bytes:e1 d2)'
#   at t/hv_macro.t line 65.
#          got: '0xe1d2'
#     expected: '0xd2e1'

#   Failed test 'U8TO32_LE works as expected (hex bytes:e1 d2 c3 b4)'
#   at t/hv_macro.t line 71.
#          got: '0xe1d2c3b4'
#     expected: '0xb4c3d2e1'

#   Failed test 'U8TO64_LE works as expected (hex bytes:e1 d2 c3 b4 a5 96 87 f0)'
#   at t/hv_macro.t line 78.
#          got: '0xe1d2c3b4a59687f0'
#     expected: '0xf08796a5b4c3d2e1'

#   Failed test 'U8TO16_LE works as expected (hex bytes:d2 c3)'
#   at t/hv_macro.t line 65.
#          got: '0xd2c3'
#     expected: '0xc3d2'

#   Failed test 'U8TO32_LE works as expected (hex bytes:d2 c3 b4 a5)'
#   at t/hv_macro.t line 71.
#          got: '0xd2c3b4a5'
#     expected: '0xa5b4c3d2'

#   Failed test 'U8TO64_LE works as expected (hex bytes:d2 c3 b4 a5 96 87 f0 e1)'
#   at t/hv_macro.t line 78.
#          got: '0xd2c3b4a59687f0e1'
#     expected: '0xe1f08796a5b4c3d2'

#   Failed test 'U8TO16_LE works as expected (hex bytes:c3 b4)'
#   at t/hv_macro.t line 65.
#          got: '0xc3b4'
#     expected: '0xb4c3'

#   Failed test 'U8TO32_LE works as expected (hex bytes:c3 b4 a5 96)'
#   at t/hv_macro.t line 71.
#          got: '0xc3b4a596'
#     expected: '0x96a5b4c3'

#   Failed test 'U8TO64_LE works as expected (hex bytes:c3 b4 a5 96 87 f0 e1 d2)'
#   at t/hv_macro.t line 78.
#          got: '0xc3b4a59687f0e1d2'
#     expected: '0xd2e1f08796a5b4c3'

#   Failed test 'U8TO16_LE works as expected (hex bytes:b4 a5)'
#   at t/hv_macro.t line 65.
#          got: '0xb4a5'
#     expected: '0xa5b4'

#   Failed test 'U8TO32_LE works as expected (hex bytes:b4 a5 96 87)'
#   at t/hv_macro.t line 71.
#          got: '0xb4a59687'
#     expected: '0x8796a5b4'

#   Failed test 'U8TO64_LE works as expected (hex bytes:b4 a5 96 87 f0 e1 d2 c3)'
#   at t/hv_macro.t line 78.
#          got: '0xb4a59687f0e1d2c3'
#     expected: '0xc3d2e1f08796a5b4'

#   Failed test 'U8TO16_LE works as expected (hex bytes:a5 96)'
#   at t/hv_macro.t line 65.
#          got: '0xa596'
#     expected: '0x96a5'

#   Failed test 'U8TO32_LE works as expected (hex bytes:a5 96 87 f0)'
#   at t/hv_macro.t line 71.
#          got: '0xa59687f0'
#     expected: '0xf08796a5'

#   Failed test 'U8TO64_LE works as expected (hex bytes:a5 96 87 f0 e1 d2 c3 b4)'
#   at t/hv_macro.t line 78.
#          got: '0xa59687f0e1d2c3b4'
#     expected: '0xb4c3d2e1f08796a5'

#   Failed test 'U8TO16_LE works as expected (hex bytes:96 87)'
#   at t/hv_macro.t line 65.
#          got: '0x9687'
#     expected: '0x8796'

#   Failed test 'U8TO32_LE works as expected (hex bytes:96 87 f0 e1)'
#   at t/hv_macro.t line 71.
#          got: '0x9687f0e1'
#     expected: '0xe1f08796'

#   Failed test 'U8TO64_LE works as expected (hex bytes:96 87 f0 e1 d2 c3 b4 a5)'
#   at t/hv_macro.t line 78.
#          got: '0x9687f0e1d2c3b4a5'
#     expected: '0xa5b4c3d2e1f08796'

#   Failed test 'U8TO16_LE works as expected (hex bytes:87 f0)'
#   at t/hv_macro.t line 65.
#          got: '0x87f0'
#     expected: '0xf087'

#   Failed test 'U8TO32_LE works as expected (hex bytes:87 f0 e1 d2)'
#   at t/hv_macro.t line 71.
#          got: '0x87f0e1d2'
#     expected: '0xd2e1f087'

#   Failed test 'U8TO64_LE works as expected (hex bytes:87 f0 e1 d2 c3 b4 a5 96)'
#   at t/hv_macro.t line 78.
#          got: '0x87f0e1d2c3b4a596'
#     expected: '0x96a5b4c3d2e1f087'

#   Failed test 'Siphash24 seems to work'
#   at t/hv_macro.t line 207.
#          got: '6c021bba2aad2555'
#     expected: '71a11e065cefc12c'

#   Failed test 'Siphash13 seems to work'
#   at t/hv_macro.t line 213.
#          got: 'e33b5015709212d2'
#     expected: 'adee71f47e49757a'

#   Failed test 'siphash24 test vectors check'
#   at t/hv_macro.t line 219.
#          got: '128'
#     expected: '0'

#   Failed test 'siphash13 test vectors check'
#   at t/hv_macro.t line 220.
#          got: '128'
#     expected: '0'
# Looks like you failed 52 tests of 63.
make: *** [test_harness] Error 52

error while running harness target 'test_harness': 2 at /pro/3gl/CPAN/smoke/lib/Test/Smoke/App/RunSmoke.pm line 118.
[2020-03-25 11:58:35+0100] 
[2020-03-25 11:58:35+0100] ../dist/IO/t/cachepropagate-unix.t..........................FAILED
[2020-03-25 11:58:35+0100]     2, 10
[2020-03-25 11:58:35+0100] ../dist/IO/t/cachepropagate-unix.t..........................FAILED
[2020-03-25 11:58:35+0100]     Non-zero exit status: 2
[2020-03-25 11:58:35+0100] ../dist/Net-Ping/t/450_service.t............................PASSED
[2020-03-25 11:58:35+0100]     9, 18
[2020-03-25 11:58:35+0100] ../ext/XS-APItest/t/hv_macro.t..............................FAILED
[2020-03-25 11:58:35+0100]     2-49, 60-61
[2020-03-25 11:58:35+0100] ../ext/XS-APItest/t/hv_macro.t..............................FAILED
[2020-03-25 11:58:35+0100]     Non-zero exit status: 52
[2020-03-25 11:58:35+0100] ../ext/XS-APItest/t/hv_macro.t..............................FAILED
[2020-03-25 11:58:35+0100]     Bad plan.  You planned 63 tests but ran 61.
[2020-03-25 11:58:35+0100] Archived results...
[2020-03-25 11:58:35+0100] TSTENV = perlio	

#   Failed test 'protocol defined'
#   at t/cachepropagate-unix.t line 54.

#   Failed test 'protocol defined'
#   at t/cachepropagate-unix.t line 109.
# Looks like you failed 2 tests of 15.

#   Failed test 'U8TO16_LE works as expected (hex bytes:12 34)'
#   at t/hv_macro.t line 65.
#          got: '0x1234'
#     expected: '0x3412'

#   Failed test 'U8TO32_LE works as expected (hex bytes:12 34 56 78)'
#   at t/hv_macro.t line 71.
#          got: '0x12345678'
#     expected: '0x78563412'

#   Failed test 'U8TO64_LE works as expected (hex bytes:12 34 56 78 9a bc de f0)'
#   at t/hv_macro.t line 78.
#          got: '0x123456789abcdef0'
#     expected: '0xf0debc9a78563412'

#   Failed test 'U8TO16_LE works as expected (hex bytes:34 56)'
#   at t/hv_macro.t line 65.
#          got: '0x3456'
#     expected: '0x5634'

#   Failed test 'U8TO32_LE works as expected (hex bytes:34 56 78 9a)'
#   at t/hv_macro.t line 71.
#          got: '0x3456789a'
#     expected: '0x9a785634'

#   Failed test 'U8TO64_LE works as expected (hex bytes:34 56 78 9a bc de f0 12)'
#   at t/hv_macro.t line 78.
#          got: '0x3456789abcdef012'
#     expected: '0x12f0debc9a785634'

#   Failed test 'U8TO16_LE works as expected (hex bytes:56 78)'
#   at t/hv_macro.t line 65.
#          got: '0x5678'
#     expected: '0x7856'

#   Failed test 'U8TO32_LE works as expected (hex bytes:56 78 9a bc)'
#   at t/hv_macro.t line 71.
#          got: '0x56789abc'
#     expected: '0xbc9a7856'

#   Failed test 'U8TO64_LE works as expected (hex bytes:56 78 9a bc de f0 12 34)'
#   at t/hv_macro.t line 78.
#          got: '0x56789abcdef01234'
#     expected: '0x3412f0debc9a7856'

#   Failed test 'U8TO16_LE works as expected (hex bytes:78 9a)'
#   at t/hv_macro.t line 65.
#          got: '0x789a'
#     expected: '0x9a78'

#   Failed test 'U8TO32_LE works as expected (hex bytes:78 9a bc de)'
#   at t/hv_macro.t line 71.
#          got: '0x789abcde'
#     expected: '0xdebc9a78'

#   Failed test 'U8TO64_LE works as expected (hex bytes:78 9a bc de f0 12 34 56)'
#   at t/hv_macro.t line 78.
#          got: '0x789abcdef0123456'
#     expected: '0x563412f0debc9a78'

#   Failed test 'U8TO16_LE works as expected (hex bytes:9a bc)'
#   at t/hv_macro.t line 65.
#          got: '0x9abc'
#     expected: '0xbc9a'

#   Failed test 'U8TO32_LE works as expected (hex bytes:9a bc de f0)'
#   at t/hv_macro.t line 71.
#          got: '0x9abcdef0'
#     expected: '0xf0debc9a'

#   Failed test 'U8TO64_LE works as expected (hex bytes:9a bc de f0 12 34 56 78)'
#   at t/hv_macro.t line 78.
#          got: '0x9abcdef012345678'
#     expected: '0x78563412f0debc9a'

#   Failed test 'U8TO16_LE works as expected (hex bytes:bc de)'
#   at t/hv_macro.t line 65.
#          got: '0xbcde'
#     expected: '0xdebc'

#   Failed test 'U8TO32_LE works as expected (hex bytes:bc de f0 12)'
#   at t/hv_macro.t line 71.
#          got: '0xbcdef012'
#     expected: '0x12f0debc'

#   Failed test 'U8TO64_LE works as expected (hex bytes:bc de f0 12 34 56 78 9a)'
#   at t/hv_macro.t line 78.
#          got: '0xbcdef0123456789a'
#     expected: '0x9a78563412f0debc'

#   Failed test 'U8TO16_LE works as expected (hex bytes:de f0)'
#   at t/hv_macro.t line 65.
#          got: '0xdef0'
#     expected: '0xf0de'

#   Failed test 'U8TO32_LE works as expected (hex bytes:de f0 12 34)'
#   at t/hv_macro.t line 71.
#          got: '0xdef01234'
#     expected: '0x3412f0de'

#   Failed test 'U8TO64_LE works as expected (hex bytes:de f0 12 34 56 78 9a bc)'
#   at t/hv_macro.t line 78.
#          got: '0xdef0123456789abc'
#     expected: '0xbc9a78563412f0de'

#   Failed test 'U8TO16_LE works as expected (hex bytes:f0 12)'
#   at t/hv_macro.t line 65.
#          got: '0xf012'
#     expected: '0x12f0'

#   Failed test 'U8TO32_LE works as expected (hex bytes:f0 12 34 56)'
#   at t/hv_macro.t line 71.
#          got: '0xf0123456'
#     expected: '0x563412f0'

#   Failed test 'U8TO64_LE works as expected (hex bytes:f0 12 34 56 78 9a bc de)'
#   at t/hv_macro.t line 78.
#          got: '0xf0123456789abcde'
#     expected: '0xdebc9a78563412f0'

#   Failed test 'U8TO16_LE works as expected (hex bytes:f0 e1)'
#   at t/hv_macro.t line 65.
#          got: '0xf0e1'
#     expected: '0xe1f0'

#   Failed test 'U8TO32_LE works as expected (hex bytes:f0 e1 d2 c3)'
#   at t/hv_macro.t line 71.
#          got: '0xf0e1d2c3'
#     expected: '0xc3d2e1f0'

#   Failed test 'U8TO64_LE works as expected (hex bytes:f0 e1 d2 c3 b4 a5 96 87)'
#   at t/hv_macro.t line 78.
#          got: '0xf0e1d2c3b4a59687'
#     expected: '0x8796a5b4c3d2e1f0'

#   Failed test 'U8TO16_LE works as expected (hex bytes:e1 d2)'
#   at t/hv_macro.t line 65.
#          got: '0xe1d2'
#     expected: '0xd2e1'

#   Failed test 'U8TO32_LE works as expected (hex bytes:e1 d2 c3 b4)'
#   at t/hv_macro.t line 71.
#          got: '0xe1d2c3b4'
#     expected: '0xb4c3d2e1'

#   Failed test 'U8TO64_LE works as expected (hex bytes:e1 d2 c3 b4 a5 96 87 f0)'
#   at t/hv_macro.t line 78.
#          got: '0xe1d2c3b4a59687f0'
#     expected: '0xf08796a5b4c3d2e1'

#   Failed test 'U8TO16_LE works as expected (hex bytes:d2 c3)'
#   at t/hv_macro.t line 65.
#          got: '0xd2c3'
#     expected: '0xc3d2'

#   Failed test 'U8TO32_LE works as expected (hex bytes:d2 c3 b4 a5)'
#   at t/hv_macro.t line 71.
#          got: '0xd2c3b4a5'
#     expected: '0xa5b4c3d2'

#   Failed test 'U8TO64_LE works as expected (hex bytes:d2 c3 b4 a5 96 87 f0 e1)'
#   at t/hv_macro.t line 78.
#          got: '0xd2c3b4a59687f0e1'
#     expected: '0xe1f08796a5b4c3d2'

#   Failed test 'U8TO16_LE works as expected (hex bytes:c3 b4)'
#   at t/hv_macro.t line 65.
#          got: '0xc3b4'
#     expected: '0xb4c3'

#   Failed test 'U8TO32_LE works as expected (hex bytes:c3 b4 a5 96)'
#   at t/hv_macro.t line 71.
#          got: '0xc3b4a596'
#     expected: '0x96a5b4c3'

#   Failed test 'U8TO64_LE works as expected (hex bytes:c3 b4 a5 96 87 f0 e1 d2)'
#   at t/hv_macro.t line 78.
#          got: '0xc3b4a59687f0e1d2'
#     expected: '0xd2e1f08796a5b4c3'

#   Failed test 'U8TO16_LE works as expected (hex bytes:b4 a5)'
#   at t/hv_macro.t line 65.
#          got: '0xb4a5'
#     expected: '0xa5b4'

#   Failed test 'U8TO32_LE works as expected (hex bytes:b4 a5 96 87)'
#   at t/hv_macro.t line 71.
#          got: '0xb4a59687'
#     expected: '0x8796a5b4'

#   Failed test 'U8TO64_LE works as expected (hex bytes:b4 a5 96 87 f0 e1 d2 c3)'
#   at t/hv_macro.t line 78.
#          got: '0xb4a59687f0e1d2c3'
#     expected: '0xc3d2e1f08796a5b4'

#   Failed test 'U8TO16_LE works as expected (hex bytes:a5 96)'
#   at t/hv_macro.t line 65.
#          got: '0xa596'
#     expected: '0x96a5'

#   Failed test 'U8TO32_LE works as expected (hex bytes:a5 96 87 f0)'
#   at t/hv_macro.t line 71.
#          got: '0xa59687f0'
#     expected: '0xf08796a5'

#   Failed test 'U8TO64_LE works as expected (hex bytes:a5 96 87 f0 e1 d2 c3 b4)'
#   at t/hv_macro.t line 78.
#          got: '0xa59687f0e1d2c3b4'
#     expected: '0xb4c3d2e1f08796a5'

#   Failed test 'U8TO16_LE works as expected (hex bytes:96 87)'
#   at t/hv_macro.t line 65.
#          got: '0x9687'
#     expected: '0x8796'

#   Failed test 'U8TO32_LE works as expected (hex bytes:96 87 f0 e1)'
#   at t/hv_macro.t line 71.
#          got: '0x9687f0e1'
#     expected: '0xe1f08796'

#   Failed test 'U8TO64_LE works as expected (hex bytes:96 87 f0 e1 d2 c3 b4 a5)'
#   at t/hv_macro.t line 78.
#          got: '0x9687f0e1d2c3b4a5'
#     expected: '0xa5b4c3d2e1f08796'

#   Failed test 'U8TO16_LE works as expected (hex bytes:87 f0)'
#   at t/hv_macro.t line 65.
#          got: '0x87f0'
#     expected: '0xf087'

#   Failed test 'U8TO32_LE works as expected (hex bytes:87 f0 e1 d2)'
#   at t/hv_macro.t line 71.
#          got: '0x87f0e1d2'
#     expected: '0xd2e1f087'

#   Failed test 'U8TO64_LE works as expected (hex bytes:87 f0 e1 d2 c3 b4 a5 96)'
#   at t/hv_macro.t line 78.
#          got: '0x87f0e1d2c3b4a596'
#     expected: '0x96a5b4c3d2e1f087'

#   Failed test 'Siphash24 seems to work'
#   at t/hv_macro.t line 207.
#          got: '6c021bba2aad2555'
#     expected: '71a11e065cefc12c'

#   Failed test 'Siphash13 seems to work'
#   at t/hv_macro.t line 213.
#          got: 'e33b5015709212d2'
#     expected: 'adee71f47e49757a'

#   Failed test 'siphash24 test vectors check'
#   at t/hv_macro.t line 219.
#          got: '128'
#     expected: '0'

#   Failed test 'siphash13 test vectors check'
#   at t/hv_macro.t line 220.
#          got: '128'
#     expected: '0'
# Looks like you failed 52 tests of 63.
# Connected to 127.0.0.1
# Connected to 127.0.0.1
# Will use Digest::MD5
Cannot figure out an encoding to use at t/use-Encode-Alias.t line 5.
make: *** [test_harness] Error 52

error while running harness target 'test_harness': 2 at /pro/3gl/CPAN/smoke/lib/Test/Smoke/App/RunSmoke.pm line 118.
[2020-03-25 12:14:02+0100] 
[2020-03-25 12:14:02+0100] ../dist/IO/t/cachepropagate-unix.t..........................FAILED
[2020-03-25 12:14:02+0100]     2, 10
[2020-03-25 12:14:02+0100] ../dist/IO/t/cachepropagate-unix.t..........................FAILED
[2020-03-25 12:14:02+0100]     Non-zero exit status: 2
[2020-03-25 12:14:02+0100] ../dist/Net-Ping/t/450_service.t............................PASSED
[2020-03-25 12:14:02+0100]     9, 18
[2020-03-25 12:14:02+0100] ../ext/XS-APItest/t/hv_macro.t..............................FAILED
[2020-03-25 12:14:02+0100]     2-49, 60-61
[2020-03-25 12:14:02+0100] ../ext/XS-APItest/t/hv_macro.t..............................FAILED
[2020-03-25 12:14:02+0100]     Non-zero exit status: 52
[2020-03-25 12:14:02+0100] ../ext/XS-APItest/t/hv_macro.t..............................FAILED
[2020-03-25 12:14:02+0100]     Bad plan.  You planned 63 tests but ran 61.
[2020-03-25 12:14:02+0100] Archived results...
[2020-03-25 12:14:02+0100] TSTENV = locale:en_US.utf8	

#   Failed test 'protocol defined'
#   at t/cachepropagate-unix.t line 54.

#   Failed test 'protocol defined'
#   at t/cachepropagate-unix.t line 109.
# Looks like you failed 2 tests of 15.

#   Failed test 'U8TO16_LE works as expected (hex bytes:12 34)'
#   at t/hv_macro.t line 65.
#          got: '0x1234'
#     expected: '0x3412'

#   Failed test 'U8TO32_LE works as expected (hex bytes:12 34 56 78)'
#   at t/hv_macro.t line 71.
#          got: '0x12345678'
#     expected: '0x78563412'

#   Failed test 'U8TO64_LE works as expected (hex bytes:12 34 56 78 9a bc de f0)'
#   at t/hv_macro.t line 78.
#          got: '0x123456789abcdef0'
#     expected: '0xf0debc9a78563412'

#   Failed test 'U8TO16_LE works as expected (hex bytes:34 56)'
#   at t/hv_macro.t line 65.
#          got: '0x3456'
#     expected: '0x5634'

#   Failed test 'U8TO32_LE works as expected (hex bytes:34 56 78 9a)'
#   at t/hv_macro.t line 71.
#          got: '0x3456789a'
#     expected: '0x9a785634'

#   Failed test 'U8TO64_LE works as expected (hex bytes:34 56 78 9a bc de f0 12)'
#   at t/hv_macro.t line 78.
#          got: '0x3456789abcdef012'
#     expected: '0x12f0debc9a785634'

#   Failed test 'U8TO16_LE works as expected (hex bytes:56 78)'
#   at t/hv_macro.t line 65.
#          got: '0x5678'
#     expected: '0x7856'

#   Failed test 'U8TO32_LE works as expected (hex bytes:56 78 9a bc)'
#   at t/hv_macro.t line 71.
#          got: '0x56789abc'
#     expected: '0xbc9a7856'

#   Failed test 'U8TO64_LE works as expected (hex bytes:56 78 9a bc de f0 12 34)'
#   at t/hv_macro.t line 78.
#          got: '0x56789abcdef01234'
#     expected: '0x3412f0debc9a7856'

#   Failed test 'U8TO16_LE works as expected (hex bytes:78 9a)'
#   at t/hv_macro.t line 65.
#          got: '0x789a'
#     expected: '0x9a78'

#   Failed test 'U8TO32_LE works as expected (hex bytes:78 9a bc de)'
#   at t/hv_macro.t line 71.
#          got: '0x789abcde'
#     expected: '0xdebc9a78'

#   Failed test 'U8TO64_LE works as expected (hex bytes:78 9a bc de f0 12 34 56)'
#   at t/hv_macro.t line 78.
#          got: '0x789abcdef0123456'
#     expected: '0x563412f0debc9a78'

#   Failed test 'U8TO16_LE works as expected (hex bytes:9a bc)'
#   at t/hv_macro.t line 65.
#          got: '0x9abc'
#     expected: '0xbc9a'

#   Failed test 'U8TO32_LE works as expected (hex bytes:9a bc de f0)'
#   at t/hv_macro.t line 71.
#          got: '0x9abcdef0'
#     expected: '0xf0debc9a'

#   Failed test 'U8TO64_LE works as expected (hex bytes:9a bc de f0 12 34 56 78)'
#   at t/hv_macro.t line 78.
#          got: '0x9abcdef012345678'
#     expected: '0x78563412f0debc9a'

#   Failed test 'U8TO16_LE works as expected (hex bytes:bc de)'
#   at t/hv_macro.t line 65.
#          got: '0xbcde'
#     expected: '0xdebc'

#   Failed test 'U8TO32_LE works as expected (hex bytes:bc de f0 12)'
#   at t/hv_macro.t line 71.
#          got: '0xbcdef012'
#     expected: '0x12f0debc'

#   Failed test 'U8TO64_LE works as expected (hex bytes:bc de f0 12 34 56 78 9a)'
#   at t/hv_macro.t line 78.
#          got: '0xbcdef0123456789a'
#     expected: '0x9a78563412f0debc'

#   Failed test 'U8TO16_LE works as expected (hex bytes:de f0)'
#   at t/hv_macro.t line 65.
#          got: '0xdef0'
#     expected: '0xf0de'

#   Failed test 'U8TO32_LE works as expected (hex bytes:de f0 12 34)'
#   at t/hv_macro.t line 71.
#          got: '0xdef01234'
#     expected: '0x3412f0de'

#   Failed test 'U8TO64_LE works as expected (hex bytes:de f0 12 34 56 78 9a bc)'
#   at t/hv_macro.t line 78.
#          got: '0xdef0123456789abc'
#     expected: '0xbc9a78563412f0de'

#   Failed test 'U8TO16_LE works as expected (hex bytes:f0 12)'
#   at t/hv_macro.t line 65.
#          got: '0xf012'
#     expected: '0x12f0'

#   Failed test 'U8TO32_LE works as expected (hex bytes:f0 12 34 56)'
#   at t/hv_macro.t line 71.
#          got: '0xf0123456'
#     expected: '0x563412f0'

#   Failed test 'U8TO64_LE works as expected (hex bytes:f0 12 34 56 78 9a bc de)'
#   at t/hv_macro.t line 78.
#          got: '0xf0123456789abcde'
#     expected: '0xdebc9a78563412f0'

#   Failed test 'U8TO16_LE works as expected (hex bytes:f0 e1)'
#   at t/hv_macro.t line 65.
#          got: '0xf0e1'
#     expected: '0xe1f0'

#   Failed test 'U8TO32_LE works as expected (hex bytes:f0 e1 d2 c3)'
#   at t/hv_macro.t line 71.
#          got: '0xf0e1d2c3'
#     expected: '0xc3d2e1f0'

#   Failed test 'U8TO64_LE works as expected (hex bytes:f0 e1 d2 c3 b4 a5 96 87)'
#   at t/hv_macro.t line 78.
#          got: '0xf0e1d2c3b4a59687'
#     expected: '0x8796a5b4c3d2e1f0'

#   Failed test 'U8TO16_LE works as expected (hex bytes:e1 d2)'
#   at t/hv_macro.t line 65.
#          got: '0xe1d2'
#     expected: '0xd2e1'

#   Failed test 'U8TO32_LE works as expected (hex bytes:e1 d2 c3 b4)'
#   at t/hv_macro.t line 71.
#          got: '0xe1d2c3b4'
#     expected: '0xb4c3d2e1'

#   Failed test 'U8TO64_LE works as expected (hex bytes:e1 d2 c3 b4 a5 96 87 f0)'
#   at t/hv_macro.t line 78.
#          got: '0xe1d2c3b4a59687f0'
#     expected: '0xf08796a5b4c3d2e1'

#   Failed test 'U8TO16_LE works as expected (hex bytes:d2 c3)'
#   at t/hv_macro.t line 65.
#          got: '0xd2c3'
#     expected: '0xc3d2'

#   Failed test 'U8TO32_LE works as expected (hex bytes:d2 c3 b4 a5)'
#   at t/hv_macro.t line 71.
#          got: '0xd2c3b4a5'
#     expected: '0xa5b4c3d2'

#   Failed test 'U8TO64_LE works as expected (hex bytes:d2 c3 b4 a5 96 87 f0 e1)'
#   at t/hv_macro.t line 78.
#          got: '0xd2c3b4a59687f0e1'
#     expected: '0xe1f08796a5b4c3d2'

#   Failed test 'U8TO16_LE works as expected (hex bytes:c3 b4)'
#   at t/hv_macro.t line 65.
#          got: '0xc3b4'
#     expected: '0xb4c3'

#   Failed test 'U8TO32_LE works as expected (hex bytes:c3 b4 a5 96)'
#   at t/hv_macro.t line 71.
#          got: '0xc3b4a596'
#     expected: '0x96a5b4c3'

#   Failed test 'U8TO64_LE works as expected (hex bytes:c3 b4 a5 96 87 f0 e1 d2)'
#   at t/hv_macro.t line 78.
#          got: '0xc3b4a59687f0e1d2'
#     expected: '0xd2e1f08796a5b4c3'

#   Failed test 'U8TO16_LE works as expected (hex bytes:b4 a5)'
#   at t/hv_macro.t line 65.
#          got: '0xb4a5'
#     expected: '0xa5b4'

#   Failed test 'U8TO32_LE works as expected (hex bytes:b4 a5 96 87)'
#   at t/hv_macro.t line 71.
#          got: '0xb4a59687'
#     expected: '0x8796a5b4'

#   Failed test 'U8TO64_LE works as expected (hex bytes:b4 a5 96 87 f0 e1 d2 c3)'
#   at t/hv_macro.t line 78.
#          got: '0xb4a59687f0e1d2c3'
#     expected: '0xc3d2e1f08796a5b4'

#   Failed test 'U8TO16_LE works as expected (hex bytes:a5 96)'
#   at t/hv_macro.t line 65.
#          got: '0xa596'
#     expected: '0x96a5'

#   Failed test 'U8TO32_LE works as expected (hex bytes:a5 96 87 f0)'
#   at t/hv_macro.t line 71.
#          got: '0xa59687f0'
#     expected: '0xf08796a5'

#   Failed test 'U8TO64_LE works as expected (hex bytes:a5 96 87 f0 e1 d2 c3 b4)'
#   at t/hv_macro.t line 78.
#          got: '0xa59687f0e1d2c3b4'
#     expected: '0xb4c3d2e1f08796a5'

#   Failed test 'U8TO16_LE works as expected (hex bytes:96 87)'
#   at t/hv_macro.t line 65.
#          got: '0x9687'
#     expected: '0x8796'

#   Failed test 'U8TO32_LE works as expected (hex bytes:96 87 f0 e1)'
#   at t/hv_macro.t line 71.
#          got: '0x9687f0e1'
#     expected: '0xe1f08796'

#   Failed test 'U8TO64_LE works as expected (hex bytes:96 87 f0 e1 d2 c3 b4 a5)'
#   at t/hv_macro.t line 78.
#          got: '0x9687f0e1d2c3b4a5'
#     expected: '0xa5b4c3d2e1f08796'

#   Failed test 'U8TO16_LE works as expected (hex bytes:87 f0)'
#   at t/hv_macro.t line 65.
#          got: '0x87f0'
#     expected: '0xf087'

#   Failed test 'U8TO32_LE works as expected (hex bytes:87 f0 e1 d2)'
#   at t/hv_macro.t line 71.
#          got: '0x87f0e1d2'
#     expected: '0xd2e1f087'

#   Failed test 'U8TO64_LE works as expected (hex bytes:87 f0 e1 d2 c3 b4 a5 96)'
#   at t/hv_macro.t line 78.
#          got: '0x87f0e1d2c3b4a596'
#     expected: '0x96a5b4c3d2e1f087'

#   Failed test 'Siphash24 seems to work'
#   at t/hv_macro.t line 207.
#          got: '6c021bba2aad2555'
#     expected: '71a11e065cefc12c'

#   Failed test 'Siphash13 seems to work'
#   at t/hv_macro.t line 213.
#          got: 'e33b5015709212d2'
#     expected: 'adee71f47e49757a'

#   Failed test 'siphash24 test vectors check'
#   at t/hv_macro.t line 219.
#          got: '128'
#     expected: '0'

#   Failed test 'siphash13 test vectors check'
#   at t/hv_macro.t line 220.
#          got: '128'
#     expected: '0'
# Looks like you failed 52 tests of 63.
# Will use Digest::MD5
# Connected to 127.0.0.1
syswrite() isn't allowed on :utf8 handles at t/Socket.t line 47.
# Looks like your test exited with 255 just after 2.
make: *** [test_harness] Error 52

error while running harness target 'test_harness': 2 at /pro/3gl/CPAN/smoke/lib/Test/Smoke/App/RunSmoke.pm line 118.
[2020-03-25 12:29:36+0100] 
[2020-03-25 12:29:36+0100] ../dist/IO/t/cachepropagate-unix.t..........................FAILED
[2020-03-25 12:29:36+0100]     2, 10
[2020-03-25 12:29:36+0100] ../dist/IO/t/cachepropagate-unix.t..........................FAILED
[2020-03-25 12:29:36+0100]     Non-zero exit status: 2
[2020-03-25 12:29:36+0100] ../dist/Net-Ping/t/450_service.t............................PASSED
[2020-03-25 12:29:36+0100]     9, 18
[2020-03-25 12:29:36+0100] ../ext/XS-APItest/t/hv_macro.t..............................FAILED
[2020-03-25 12:29:36+0100]     2-49, 60-61
[2020-03-25 12:29:36+0100] ../ext/XS-APItest/t/hv_macro.t..............................FAILED
[2020-03-25 12:29:36+0100]     Non-zero exit status: 52
[2020-03-25 12:29:36+0100] ../ext/XS-APItest/t/hv_macro.t..............................FAILED
[2020-03-25 12:29:36+0100]     Bad plan.  You planned 63 tests but ran 61.
[2020-03-25 12:29:36+0100] ../cpan/Socket/t/Socket.t...................................FAILED
[2020-03-25 12:29:36+0100]     Non-zero exit status: 255
[2020-03-25 12:29:36+0100] ../cpan/Socket/t/Socket.t...................................FAILED
[2020-03-25 12:29:36+0100]     Bad plan.  You planned 6 tests but ran 2.
[2020-03-25 12:29:36+0100] Archived results...
[2020-03-25 12:29:36+0100] Unskip tests from '/pro/3gl/CPAN/smoke/p59.skip'
[2020-03-25 12:29:36+0100] 
[2020-03-25 12:29:36+0100] Configuration: -Dcc=gcc -Dusedevel -Duse64bitall -DDEBUGGING
[2020-03-25 12:29:36+0100] ------------------------------------------------------------------------------
[2020-03-25 12:29:36+0100] make distclean ...
[2020-03-25 12:30:20+0100] 
[2020-03-25 12:30:20+0100] Copy Policy.sh ...
[2020-03-25 12:30:20+0100] 
[2020-03-25 12:30:20+0100] Configure ...
[2020-03-25 12:31:46+0100] 
[2020-03-25 12:31:46+0100] make ...
===== PROCURA Policy for hpux/ccache gcc ========================
===== PROCURA Policy results ============================
cc:         ccache gcc
ccversion:  -
gccversion: -
ccflags:    -mlp64 -fPIC -DDEBUGGING
optimize:   
ld:         
ldflags:    -mlp64 -L/pro/local/lib -L/usr/lib/hpux64
libswanted: cl pthread cl pthread socket bind inet nsl ndbm gdbm dbm db malloc dl ld sun m crypt sec util c cposix posix ucb bsd BSD
libsdirs:     /lib /pro/local/lib /usr/lib/hpux64
locincpth:  /pro/local/include
loclibpth:  /usr/lib/hpux64
useshrplib: 
===== PROCURA Policy done ===============================
[2020-03-25 12:57:29+0100] Skip tests from '/pro/3gl/CPAN/smoke/p59.skip'
[2020-03-25 12:57:29+0100] 
[2020-03-25 12:57:29+0100]  Tests start here:
[2020-03-25 12:57:29+0100] TSTENV = stdio	
op.c: In function 'Perl_ck_eval':
op.c:12772:9: warning: value computed is not used [-Wunused-value]
op.c: In function 'S_pmtrans':
op.c:7444:15: warning: 't_cp' may be used uninitialized in this function [-Wmaybe-uninitialized]
op.c:7481:28: warning: 'r_cp' may be used uninitialized in this function [-Wmaybe-uninitialized]
toke.c: In function 'Perl_scan_num':
toke.c:11631:54: warning: 'b' may be used uninitialized in this function [-Wmaybe-uninitialized]
pp.c: In function 'Perl_pp_argelem':
pp.c:7025:13: warning: value computed is not used [-Wunused-value]
regexec.c: In function 'S_regtry':
regexec.c:6539:30: warning: 'fold_array' may be used uninitialized in this function [-Wmaybe-uninitialized]
regexec.c:6443:17: note: 'fold_array' was declared here
regexec.c:6545:28: warning: 'folder' may be used uninitialized in this function [-Wmaybe-uninitialized]
regexec.c:6442:16: note: 'folder' was declared here
time64.c: In function 'Perl_localtime64_r':
time64.c:573:30: warning: 'orig_year' may be used uninitialized in this function [-Wmaybe-uninitialized]
op.c: In function 'Perl_ck_eval':
op.c:12772:9: warning: value computed is not used [-Wunused-value]
op.c: In function 'S_pmtrans':
op.c:7444:15: warning: 't_cp' may be used uninitialized in this function [-Wmaybe-uninitialized]
op.c:7481:28: warning: 'r_cp' may be used uninitialized in this function [-Wmaybe-uninitialized]
RealPPPort.xs: In function 'XS_Devel__PPPort_check_HeUTF8':
RealPPPort.xs:1990:17: warning: value computed is not used [-Wunused-value]
Opcode.xs: In function 'XS_Opcode_invert_opset':
Opcode.xs:363:2: warning: overflow in implicit constant conversion [-Woverflow]
Warning (mostly harmless): No library found for -lposix
Warning (mostly harmless): No library found for -lcposix
./const-xs.inc: In function 'boot_Socket':
./const-xs.inc:986:20: warning: missing braces around initializer [-Wmissing-braces]
./const-xs.inc:986:20: warning: (near initialization for 'ip6_address._s6_un') [-Wmissing-braces]
./const-xs.inc:995:20: warning: missing braces around initializer [-Wmissing-braces]
./const-xs.inc:995:20: warning: (near initialization for 'ip6_address._s6_un') [-Wmissing-braces]
In file included from HiRes.xs:1047:0:
const-c.inc: In function 'constant_19':
const-c.inc:351:42: warning: unused parameter 'iv_return' [-Wunused-parameter]
Making header files for XS...
re_exec.c: In function 'S_regtry':
re_exec.c:6539:30: warning: 'fold_array' may be used uninitialized in this function [-Wmaybe-uninitialized]
re_exec.c:6443:17: note: 'fold_array' was declared here
re_exec.c:6545:28: warning: 'folder' may be used uninitialized in this function [-Wmaybe-uninitialized]
re_exec.c:6442:16: note: 'folder' was declared here
No saved state, selection will be empty
Cannot figure out an encoding to use at t/use-Encode-Alias.t line 5.
# Connected to 127.0.0.1
# Connected to 127.0.0.1
Redefining sub xChild::foo at xChild--25161 line 2.
Redefining sub Data::ok at -e line 1.

#   Failed test 'protocol defined'
#   at t/cachepropagate-unix.t line 54.

#   Failed test 'protocol defined'
#   at t/cachepropagate-unix.t line 109.
# Looks like you failed 2 tests of 15.
# Will use Digest::MD5

#   Failed test 'U8TO16_LE works as expected (hex bytes:12 34)'
#   at t/hv_macro.t line 65.
#          got: '0x1234'
#     expected: '0x3412'

#   Failed test 'U8TO32_LE works as expected (hex bytes:12 34 56 78)'
#   at t/hv_macro.t line 71.
#          got: '0x12345678'
#     expected: '0x78563412'

#   Failed test 'U8TO64_LE works as expected (hex bytes:12 34 56 78 9a bc de f0)'
#   at t/hv_macro.t line 78.
#          got: '0x123456789abcdef0'
#     expected: '0xf0debc9a78563412'

#   Failed test 'U8TO16_LE works as expected (hex bytes:34 56)'
#   at t/hv_macro.t line 65.
#          got: '0x3456'
#     expected: '0x5634'

#   Failed test 'U8TO32_LE works as expected (hex bytes:34 56 78 9a)'
#   at t/hv_macro.t line 71.
#          got: '0x3456789a'
#     expected: '0x9a785634'

#   Failed test 'U8TO64_LE works as expected (hex bytes:34 56 78 9a bc de f0 12)'
#   at t/hv_macro.t line 78.
#          got: '0x3456789abcdef012'
#     expected: '0x12f0debc9a785634'

#   Failed test 'U8TO16_LE works as expected (hex bytes:56 78)'
#   at t/hv_macro.t line 65.
#          got: '0x5678'
#     expected: '0x7856'

#   Failed test 'U8TO32_LE works as expected (hex bytes:56 78 9a bc)'
#   at t/hv_macro.t line 71.
#          got: '0x56789abc'
#     expected: '0xbc9a7856'

#   Failed test 'U8TO64_LE works as expected (hex bytes:56 78 9a bc de f0 12 34)'
#   at t/hv_macro.t line 78.
#          got: '0x56789abcdef01234'
#     expected: '0x3412f0debc9a7856'

#   Failed test 'U8TO16_LE works as expected (hex bytes:78 9a)'
#   at t/hv_macro.t line 65.
#          got: '0x789a'
#     expected: '0x9a78'

#   Failed test 'U8TO32_LE works as expected (hex bytes:78 9a bc de)'
#   at t/hv_macro.t line 71.
#          got: '0x789abcde'
#     expected: '0xdebc9a78'

#   Failed test 'U8TO64_LE works as expected (hex bytes:78 9a bc de f0 12 34 56)'
#   at t/hv_macro.t line 78.
#          got: '0x789abcdef0123456'
#     expected: '0x563412f0debc9a78'

#   Failed test 'U8TO16_LE works as expected (hex bytes:9a bc)'
#   at t/hv_macro.t line 65.
#          got: '0x9abc'
#     expected: '0xbc9a'

#   Failed test 'U8TO32_LE works as expected (hex bytes:9a bc de f0)'
#   at t/hv_macro.t line 71.
#          got: '0x9abcdef0'
#     expected: '0xf0debc9a'

#   Failed test 'U8TO64_LE works as expected (hex bytes:9a bc de f0 12 34 56 78)'
#   at t/hv_macro.t line 78.
#          got: '0x9abcdef012345678'
#     expected: '0x78563412f0debc9a'

#   Failed test 'U8TO16_LE works as expected (hex bytes:bc de)'
#   at t/hv_macro.t line 65.
#          got: '0xbcde'
#     expected: '0xdebc'

#   Failed test 'U8TO32_LE works as expected (hex bytes:bc de f0 12)'
#   at t/hv_macro.t line 71.
#          got: '0xbcdef012'
#     expected: '0x12f0debc'

#   Failed test 'U8TO64_LE works as expected (hex bytes:bc de f0 12 34 56 78 9a)'
#   at t/hv_macro.t line 78.
#          got: '0xbcdef0123456789a'
#     expected: '0x9a78563412f0debc'

#   Failed test 'U8TO16_LE works as expected (hex bytes:de f0)'
#   at t/hv_macro.t line 65.
#          got: '0xdef0'
#     expected: '0xf0de'

#   Failed test 'U8TO32_LE works as expected (hex bytes:de f0 12 34)'
#   at t/hv_macro.t line 71.
#          got: '0xdef01234'
#     expected: '0x3412f0de'

#   Failed test 'U8TO64_LE works as expected (hex bytes:de f0 12 34 56 78 9a bc)'
#   at t/hv_macro.t line 78.
#          got: '0xdef0123456789abc'
#     expected: '0xbc9a78563412f0de'

#   Failed test 'U8TO16_LE works as expected (hex bytes:f0 12)'
#   at t/hv_macro.t line 65.
#          got: '0xf012'
#     expected: '0x12f0'

#   Failed test 'U8TO32_LE works as expected (hex bytes:f0 12 34 56)'
#   at t/hv_macro.t line 71.
#          got: '0xf0123456'
#     expected: '0x563412f0'

#   Failed test 'U8TO64_LE works as expected (hex bytes:f0 12 34 56 78 9a bc de)'
#   at t/hv_macro.t line 78.
#          got: '0xf0123456789abcde'
#     expected: '0xdebc9a78563412f0'

#   Failed test 'U8TO16_LE works as expected (hex bytes:f0 e1)'
#   at t/hv_macro.t line 65.
#          got: '0xf0e1'
#     expected: '0xe1f0'

#   Failed test 'U8TO32_LE works as expected (hex bytes:f0 e1 d2 c3)'
#   at t/hv_macro.t line 71.
#          got: '0xf0e1d2c3'
#     expected: '0xc3d2e1f0'

#   Failed test 'U8TO64_LE works as expected (hex bytes:f0 e1 d2 c3 b4 a5 96 87)'
#   at t/hv_macro.t line 78.
#          got: '0xf0e1d2c3b4a59687'
#     expected: '0x8796a5b4c3d2e1f0'

#   Failed test 'U8TO16_LE works as expected (hex bytes:e1 d2)'
#   at t/hv_macro.t line 65.
#          got: '0xe1d2'
#     expected: '0xd2e1'

#   Failed test 'U8TO32_LE works as expected (hex bytes:e1 d2 c3 b4)'
#   at t/hv_macro.t line 71.
#          got: '0xe1d2c3b4'
#     expected: '0xb4c3d2e1'

#   Failed test 'U8TO64_LE works as expected (hex bytes:e1 d2 c3 b4 a5 96 87 f0)'
#   at t/hv_macro.t line 78.
#          got: '0xe1d2c3b4a59687f0'
#     expected: '0xf08796a5b4c3d2e1'

#   Failed test 'U8TO16_LE works as expected (hex bytes:d2 c3)'
#   at t/hv_macro.t line 65.
#          got: '0xd2c3'
#     expected: '0xc3d2'

#   Failed test 'U8TO32_LE works as expected (hex bytes:d2 c3 b4 a5)'
#   at t/hv_macro.t line 71.
#          got: '0xd2c3b4a5'
#     expected: '0xa5b4c3d2'

#   Failed test 'U8TO64_LE works as expected (hex bytes:d2 c3 b4 a5 96 87 f0 e1)'
#   at t/hv_macro.t line 78.
#          got: '0xd2c3b4a59687f0e1'
#     expected: '0xe1f08796a5b4c3d2'

#   Failed test 'U8TO16_LE works as expected (hex bytes:c3 b4)'
#   at t/hv_macro.t line 65.
#          got: '0xc3b4'
#     expected: '0xb4c3'

#   Failed test 'U8TO32_LE works as expected (hex bytes:c3 b4 a5 96)'
#   at t/hv_macro.t line 71.
#          got: '0xc3b4a596'
#     expected: '0x96a5b4c3'

#   Failed test 'U8TO64_LE works as expected (hex bytes:c3 b4 a5 96 87 f0 e1 d2)'
#   at t/hv_macro.t line 78.
#          got: '0xc3b4a59687f0e1d2'
#     expected: '0xd2e1f08796a5b4c3'

#   Failed test 'U8TO16_LE works as expected (hex bytes:b4 a5)'
#   at t/hv_macro.t line 65.
#          got: '0xb4a5'
#     expected: '0xa5b4'

#   Failed test 'U8TO32_LE works as expected (hex bytes:b4 a5 96 87)'
#   at t/hv_macro.t line 71.
#          got: '0xb4a59687'
#     expected: '0x8796a5b4'

#   Failed test 'U8TO64_LE works as expected (hex bytes:b4 a5 96 87 f0 e1 d2 c3)'
#   at t/hv_macro.t line 78.
#          got: '0xb4a59687f0e1d2c3'
#     expected: '0xc3d2e1f08796a5b4'

#   Failed test 'U8TO16_LE works as expected (hex bytes:a5 96)'
#   at t/hv_macro.t line 65.
#          got: '0xa596'
#     expected: '0x96a5'

#   Failed test 'U8TO32_LE works as expected (hex bytes:a5 96 87 f0)'
#   at t/hv_macro.t line 71.
#          got: '0xa59687f0'
#     expected: '0xf08796a5'

#   Failed test 'U8TO64_LE works as expected (hex bytes:a5 96 87 f0 e1 d2 c3 b4)'
#   at t/hv_macro.t line 78.
#          got: '0xa59687f0e1d2c3b4'
#     expected: '0xb4c3d2e1f08796a5'

#   Failed test 'U8TO16_LE works as expected (hex bytes:96 87)'
#   at t/hv_macro.t line 65.
#          got: '0x9687'
#     expected: '0x8796'

#   Failed test 'U8TO32_LE works as expected (hex bytes:96 87 f0 e1)'
#   at t/hv_macro.t line 71.
#          got: '0x9687f0e1'
#     expected: '0xe1f08796'

#   Failed test 'U8TO64_LE works as expected (hex bytes:96 87 f0 e1 d2 c3 b4 a5)'
#   at t/hv_macro.t line 78.
#          got: '0x9687f0e1d2c3b4a5'
#     expected: '0xa5b4c3d2e1f08796'

#   Failed test 'U8TO16_LE works as expected (hex bytes:87 f0)'
#   at t/hv_macro.t line 65.
#          got: '0x87f0'
#     expected: '0xf087'

#   Failed test 'U8TO32_LE works as expected (hex bytes:87 f0 e1 d2)'
#   at t/hv_macro.t line 71.
#          got: '0x87f0e1d2'
#     expected: '0xd2e1f087'

#   Failed test 'U8TO64_LE works as expected (hex bytes:87 f0 e1 d2 c3 b4 a5 96)'
#   at t/hv_macro.t line 78.
#          got: '0x87f0e1d2c3b4a596'
#     expected: '0x96a5b4c3d2e1f087'

#   Failed test 'Siphash24 seems to work'
#   at t/hv_macro.t line 207.
#          got: '6c021bba2aad2555'
#     expected: '71a11e065cefc12c'

#   Failed test 'Siphash13 seems to work'
#   at t/hv_macro.t line 213.
#          got: 'e33b5015709212d2'
#     expected: 'adee71f47e49757a'

#   Failed test 'siphash24 test vectors check'
#   at t/hv_macro.t line 219.
#          got: '128'
#     expected: '0'

#   Failed test 'siphash13 test vectors check'
#   at t/hv_macro.t line 220.
#          got: '128'
#     expected: '0'
# Looks like you failed 52 tests of 63.
make: *** [test_harness] Error 52

error while running harness target 'test_harness': 2 at /pro/3gl/CPAN/smoke/lib/Test/Smoke/App/RunSmoke.pm line 118.
[2020-03-25 13:28:05+0100] 
[2020-03-25 13:28:05+0100] ../dist/IO/t/cachepropagate-unix.t..........................FAILED
[2020-03-25 13:28:05+0100]     2, 10
[2020-03-25 13:28:05+0100] ../dist/IO/t/cachepropagate-unix.t..........................FAILED
[2020-03-25 13:28:05+0100]     Non-zero exit status: 2
[2020-03-25 13:28:05+0100] ../dist/Net-Ping/t/450_service.t............................PASSED
[2020-03-25 13:28:05+0100]     9, 18
[2020-03-25 13:28:05+0100] ../ext/XS-APItest/t/hv_macro.t..............................FAILED
[2020-03-25 13:28:05+0100]     2-49, 60-61
[2020-03-25 13:28:05+0100] ../ext/XS-APItest/t/hv_macro.t..............................FAILED
[2020-03-25 13:28:05+0100]     Non-zero exit status: 52
[2020-03-25 13:28:05+0100] ../ext/XS-APItest/t/hv_macro.t..............................FAILED
[2020-03-25 13:28:05+0100]     Bad plan.  You planned 63 tests but ran 61.
[2020-03-25 13:28:05+0100] Archived results...
[2020-03-25 13:28:05+0100] TSTENV = perlio	

#   Failed test 'protocol defined'
#   at t/cachepropagate-unix.t line 54.

#   Failed test 'protocol defined'
#   at t/cachepropagate-unix.t line 109.
# Looks like you failed 2 tests of 15.

#   Failed test 'U8TO16_LE works as expected (hex bytes:12 34)'
#   at t/hv_macro.t line 65.
#          got: '0x1234'
#     expected: '0x3412'

#   Failed test 'U8TO32_LE works as expected (hex bytes:12 34 56 78)'
#   at t/hv_macro.t line 71.
#          got: '0x12345678'
#     expected: '0x78563412'

#   Failed test 'U8TO64_LE works as expected (hex bytes:12 34 56 78 9a bc de f0)'
#   at t/hv_macro.t line 78.
#          got: '0x123456789abcdef0'
#     expected: '0xf0debc9a78563412'

#   Failed test 'U8TO16_LE works as expected (hex bytes:34 56)'
#   at t/hv_macro.t line 65.
#          got: '0x3456'
#     expected: '0x5634'

#   Failed test 'U8TO32_LE works as expected (hex bytes:34 56 78 9a)'
#   at t/hv_macro.t line 71.
#          got: '0x3456789a'
#     expected: '0x9a785634'

#   Failed test 'U8TO64_LE works as expected (hex bytes:34 56 78 9a bc de f0 12)'
#   at t/hv_macro.t line 78.
#          got: '0x3456789abcdef012'
#     expected: '0x12f0debc9a785634'

#   Failed test 'U8TO16_LE works as expected (hex bytes:56 78)'
#   at t/hv_macro.t line 65.
#          got: '0x5678'
#     expected: '0x7856'

#   Failed test 'U8TO32_LE works as expected (hex bytes:56 78 9a bc)'
#   at t/hv_macro.t line 71.
#          got: '0x56789abc'
#     expected: '0xbc9a7856'

#   Failed test 'U8TO64_LE works as expected (hex bytes:56 78 9a bc de f0 12 34)'
#   at t/hv_macro.t line 78.
#          got: '0x56789abcdef01234'
#     expected: '0x3412f0debc9a7856'

#   Failed test 'U8TO16_LE works as expected (hex bytes:78 9a)'
#   at t/hv_macro.t line 65.
#          got: '0x789a'
#     expected: '0x9a78'

#   Failed test 'U8TO32_LE works as expected (hex bytes:78 9a bc de)'
#   at t/hv_macro.t line 71.
#          got: '0x789abcde'
#     expected: '0xdebc9a78'

#   Failed test 'U8TO64_LE works as expected (hex bytes:78 9a bc de f0 12 34 56)'
#   at t/hv_macro.t line 78.
#          got: '0x789abcdef0123456'
#     expected: '0x563412f0debc9a78'

#   Failed test 'U8TO16_LE works as expected (hex bytes:9a bc)'
#   at t/hv_macro.t line 65.
#          got: '0x9abc'
#     expected: '0xbc9a'

#   Failed test 'U8TO32_LE works as expected (hex bytes:9a bc de f0)'
#   at t/hv_macro.t line 71.
#          got: '0x9abcdef0'
#     expected: '0xf0debc9a'

#   Failed test 'U8TO64_LE works as expected (hex bytes:9a bc de f0 12 34 56 78)'
#   at t/hv_macro.t line 78.
#          got: '0x9abcdef012345678'
#     expected: '0x78563412f0debc9a'

#   Failed test 'U8TO16_LE works as expected (hex bytes:bc de)'
#   at t/hv_macro.t line 65.
#          got: '0xbcde'
#     expected: '0xdebc'

#   Failed test 'U8TO32_LE works as expected (hex bytes:bc de f0 12)'
#   at t/hv_macro.t line 71.
#          got: '0xbcdef012'
#     expected: '0x12f0debc'

#   Failed test 'U8TO64_LE works as expected (hex bytes:bc de f0 12 34 56 78 9a)'
#   at t/hv_macro.t line 78.
#          got: '0xbcdef0123456789a'
#     expected: '0x9a78563412f0debc'

#   Failed test 'U8TO16_LE works as expected (hex bytes:de f0)'
#   at t/hv_macro.t line 65.
#          got: '0xdef0'
#     expected: '0xf0de'

#   Failed test 'U8TO32_LE works as expected (hex bytes:de f0 12 34)'
#   at t/hv_macro.t line 71.
#          got: '0xdef01234'
#     expected: '0x3412f0de'

#   Failed test 'U8TO64_LE works as expected (hex bytes:de f0 12 34 56 78 9a bc)'
#   at t/hv_macro.t line 78.
#          got: '0xdef0123456789abc'
#     expected: '0xbc9a78563412f0de'

#   Failed test 'U8TO16_LE works as expected (hex bytes:f0 12)'
#   at t/hv_macro.t line 65.
#          got: '0xf012'
#     expected: '0x12f0'

#   Failed test 'U8TO32_LE works as expected (hex bytes:f0 12 34 56)'
#   at t/hv_macro.t line 71.
#          got: '0xf0123456'
#     expected: '0x563412f0'

#   Failed test 'U8TO64_LE works as expected (hex bytes:f0 12 34 56 78 9a bc de)'
#   at t/hv_macro.t line 78.
#          got: '0xf0123456789abcde'
#     expected: '0xdebc9a78563412f0'

#   Failed test 'U8TO16_LE works as expected (hex bytes:f0 e1)'
#   at t/hv_macro.t line 65.
#          got: '0xf0e1'
#     expected: '0xe1f0'

#   Failed test 'U8TO32_LE works as expected (hex bytes:f0 e1 d2 c3)'
#   at t/hv_macro.t line 71.
#          got: '0xf0e1d2c3'
#     expected: '0xc3d2e1f0'

#   Failed test 'U8TO64_LE works as expected (hex bytes:f0 e1 d2 c3 b4 a5 96 87)'
#   at t/hv_macro.t line 78.
#          got: '0xf0e1d2c3b4a59687'
#     expected: '0x8796a5b4c3d2e1f0'

#   Failed test 'U8TO16_LE works as expected (hex bytes:e1 d2)'
#   at t/hv_macro.t line 65.
#          got: '0xe1d2'
#     expected: '0xd2e1'

#   Failed test 'U8TO32_LE works as expected (hex bytes:e1 d2 c3 b4)'
#   at t/hv_macro.t line 71.
#          got: '0xe1d2c3b4'
#     expected: '0xb4c3d2e1'

#   Failed test 'U8TO64_LE works as expected (hex bytes:e1 d2 c3 b4 a5 96 87 f0)'
#   at t/hv_macro.t line 78.
#          got: '0xe1d2c3b4a59687f0'
#     expected: '0xf08796a5b4c3d2e1'

#   Failed test 'U8TO16_LE works as expected (hex bytes:d2 c3)'
#   at t/hv_macro.t line 65.
#          got: '0xd2c3'
#     expected: '0xc3d2'

#   Failed test 'U8TO32_LE works as expected (hex bytes:d2 c3 b4 a5)'
#   at t/hv_macro.t line 71.
#          got: '0xd2c3b4a5'
#     expected: '0xa5b4c3d2'

#   Failed test 'U8TO64_LE works as expected (hex bytes:d2 c3 b4 a5 96 87 f0 e1)'
#   at t/hv_macro.t line 78.
#          got: '0xd2c3b4a59687f0e1'
#     expected: '0xe1f08796a5b4c3d2'

#   Failed test 'U8TO16_LE works as expected (hex bytes:c3 b4)'
#   at t/hv_macro.t line 65.
#          got: '0xc3b4'
#     expected: '0xb4c3'

#   Failed test 'U8TO32_LE works as expected (hex bytes:c3 b4 a5 96)'
#   at t/hv_macro.t line 71.
#          got: '0xc3b4a596'
#     expected: '0x96a5b4c3'

#   Failed test 'U8TO64_LE works as expected (hex bytes:c3 b4 a5 96 87 f0 e1 d2)'
#   at t/hv_macro.t line 78.
#          got: '0xc3b4a59687f0e1d2'
#     expected: '0xd2e1f08796a5b4c3'

#   Failed test 'U8TO16_LE works as expected (hex bytes:b4 a5)'
#   at t/hv_macro.t line 65.
#          got: '0xb4a5'
#     expected: '0xa5b4'

#   Failed test 'U8TO32_LE works as expected (hex bytes:b4 a5 96 87)'
#   at t/hv_macro.t line 71.
#          got: '0xb4a59687'
#     expected: '0x8796a5b4'

#   Failed test 'U8TO64_LE works as expected (hex bytes:b4 a5 96 87 f0 e1 d2 c3)'
#   at t/hv_macro.t line 78.
#          got: '0xb4a59687f0e1d2c3'
#     expected: '0xc3d2e1f08796a5b4'

#   Failed test 'U8TO16_LE works as expected (hex bytes:a5 96)'
#   at t/hv_macro.t line 65.
#          got: '0xa596'
#     expected: '0x96a5'

#   Failed test 'U8TO32_LE works as expected (hex bytes:a5 96 87 f0)'
#   at t/hv_macro.t line 71.
#          got: '0xa59687f0'
#     expected: '0xf08796a5'

#   Failed test 'U8TO64_LE works as expected (hex bytes:a5 96 87 f0 e1 d2 c3 b4)'
#   at t/hv_macro.t line 78.
#          got: '0xa59687f0e1d2c3b4'
#     expected: '0xb4c3d2e1f08796a5'

#   Failed test 'U8TO16_LE works as expected (hex bytes:96 87)'
#   at t/hv_macro.t line 65.
#          got: '0x9687'
#     expected: '0x8796'

#   Failed test 'U8TO32_LE works as expected (hex bytes:96 87 f0 e1)'
#   at t/hv_macro.t line 71.
#          got: '0x9687f0e1'
#     expected: '0xe1f08796'

#   Failed test 'U8TO64_LE works as expected (hex bytes:96 87 f0 e1 d2 c3 b4 a5)'
#   at t/hv_macro.t line 78.
#          got: '0x9687f0e1d2c3b4a5'
#     expected: '0xa5b4c3d2e1f08796'

#   Failed test 'U8TO16_LE works as expected (hex bytes:87 f0)'
#   at t/hv_macro.t line 65.
#          got: '0x87f0'
#     expected: '0xf087'

#   Failed test 'U8TO32_LE works as expected (hex bytes:87 f0 e1 d2)'
#   at t/hv_macro.t line 71.
#          got: '0x87f0e1d2'
#     expected: '0xd2e1f087'

#   Failed test 'U8TO64_LE works as expected (hex bytes:87 f0 e1 d2 c3 b4 a5 96)'
#   at t/hv_macro.t line 78.
#          got: '0x87f0e1d2c3b4a596'
#     expected: '0x96a5b4c3d2e1f087'

#   Failed test 'Siphash24 seems to work'
#   at t/hv_macro.t line 207.
#          got: '6c021bba2aad2555'
#     expected: '71a11e065cefc12c'

#   Failed test 'Siphash13 seems to work'
#   at t/hv_macro.t line 213.
#          got: 'e33b5015709212d2'
#     expected: 'adee71f47e49757a'

#   Failed test 'siphash24 test vectors check'
#   at t/hv_macro.t line 219.
#          got: '128'
#     expected: '0'

#   Failed test 'siphash13 test vectors check'
#   at t/hv_macro.t line 220.
#          got: '128'
#     expected: '0'
# Looks like you failed 52 tests of 63.
# Connected to 127.0.0.1
# Connected to 127.0.0.1
# Will use Digest::MD5
Cannot figure out an encoding to use at t/use-Encode-Alias.t line 5.
make: *** [test_harness] Error 52

error while running harness target 'test_harness': 2 at /pro/3gl/CPAN/smoke/lib/Test/Smoke/App/RunSmoke.pm line 118.
[2020-03-25 13:53:52+0100] 
[2020-03-25 13:53:52+0100] ../dist/IO/t/cachepropagate-unix.t..........................FAILED
[2020-03-25 13:53:52+0100]     2, 10
[2020-03-25 13:53:52+0100] ../dist/IO/t/cachepropagate-unix.t..........................FAILED
[2020-03-25 13:53:52+0100]     Non-zero exit status: 2
[2020-03-25 13:53:52+0100] ../dist/Net-Ping/t/450_service.t............................PASSED
[2020-03-25 13:53:52+0100]     9, 18
[2020-03-25 13:53:52+0100] ../ext/XS-APItest/t/hv_macro.t..............................FAILED
[2020-03-25 13:53:52+0100]     2-49, 60-61
[2020-03-25 13:53:52+0100] ../ext/XS-APItest/t/hv_macro.t..............................FAILED
[2020-03-25 13:53:52+0100]     Non-zero exit status: 52
[2020-03-25 13:53:52+0100] ../ext/XS-APItest/t/hv_macro.t..............................FAILED
[2020-03-25 13:53:52+0100]     Bad plan.  You planned 63 tests but ran 61.
[2020-03-25 13:53:52+0100] Archived results...
[2020-03-25 13:53:52+0100] TSTENV = locale:en_US.utf8	

#   Failed test 'protocol defined'
#   at t/cachepropagate-unix.t line 54.

#   Failed test 'protocol defined'
#   at t/cachepropagate-unix.t line 109.
# Looks like you failed 2 tests of 15.

#   Failed test 'U8TO16_LE works as expected (hex bytes:12 34)'
#   at t/hv_macro.t line 65.
#          got: '0x1234'
#     expected: '0x3412'

#   Failed test 'U8TO32_LE works as expected (hex bytes:12 34 56 78)'
#   at t/hv_macro.t line 71.
#          got: '0x12345678'
#     expected: '0x78563412'

#   Failed test 'U8TO64_LE works as expected (hex bytes:12 34 56 78 9a bc de f0)'
#   at t/hv_macro.t line 78.
#          got: '0x123456789abcdef0'
#     expected: '0xf0debc9a78563412'

#   Failed test 'U8TO16_LE works as expected (hex bytes:34 56)'
#   at t/hv_macro.t line 65.
#          got: '0x3456'
#     expected: '0x5634'

#   Failed test 'U8TO32_LE works as expected (hex bytes:34 56 78 9a)'
#   at t/hv_macro.t line 71.
#          got: '0x3456789a'
#     expected: '0x9a785634'

#   Failed test 'U8TO64_LE works as expected (hex bytes:34 56 78 9a bc de f0 12)'
#   at t/hv_macro.t line 78.
#          got: '0x3456789abcdef012'
#     expected: '0x12f0debc9a785634'

#   Failed test 'U8TO16_LE works as expected (hex bytes:56 78)'
#   at t/hv_macro.t line 65.
#          got: '0x5678'
#     expected: '0x7856'

#   Failed test 'U8TO32_LE works as expected (hex bytes:56 78 9a bc)'
#   at t/hv_macro.t line 71.
#          got: '0x56789abc'
#     expected: '0xbc9a7856'

#   Failed test 'U8TO64_LE works as expected (hex bytes:56 78 9a bc de f0 12 34)'
#   at t/hv_macro.t line 78.
#          got: '0x56789abcdef01234'
#     expected: '0x3412f0debc9a7856'

#   Failed test 'U8TO16_LE works as expected (hex bytes:78 9a)'
#   at t/hv_macro.t line 65.
#          got: '0x789a'
#     expected: '0x9a78'

#   Failed test 'U8TO32_LE works as expected (hex bytes:78 9a bc de)'
#   at t/hv_macro.t line 71.
#          got: '0x789abcde'
#     expected: '0xdebc9a78'

#   Failed test 'U8TO64_LE works as expected (hex bytes:78 9a bc de f0 12 34 56)'
#   at t/hv_macro.t line 78.
#          got: '0x789abcdef0123456'
#     expected: '0x563412f0debc9a78'

#   Failed test 'U8TO16_LE works as expected (hex bytes:9a bc)'
#   at t/hv_macro.t line 65.
#          got: '0x9abc'
#     expected: '0xbc9a'

#   Failed test 'U8TO32_LE works as expected (hex bytes:9a bc de f0)'
#   at t/hv_macro.t line 71.
#          got: '0x9abcdef0'
#     expected: '0xf0debc9a'

#   Failed test 'U8TO64_LE works as expected (hex bytes:9a bc de f0 12 34 56 78)'
#   at t/hv_macro.t line 78.
#          got: '0x9abcdef012345678'
#     expected: '0x78563412f0debc9a'

#   Failed test 'U8TO16_LE works as expected (hex bytes:bc de)'
#   at t/hv_macro.t line 65.
#          got: '0xbcde'
#     expected: '0xdebc'

#   Failed test 'U8TO32_LE works as expected (hex bytes:bc de f0 12)'
#   at t/hv_macro.t line 71.
#          got: '0xbcdef012'
#     expected: '0x12f0debc'

#   Failed test 'U8TO64_LE works as expected (hex bytes:bc de f0 12 34 56 78 9a)'
#   at t/hv_macro.t line 78.
#          got: '0xbcdef0123456789a'
#     expected: '0x9a78563412f0debc'

#   Failed test 'U8TO16_LE works as expected (hex bytes:de f0)'
#   at t/hv_macro.t line 65.
#          got: '0xdef0'
#     expected: '0xf0de'

#   Failed test 'U8TO32_LE works as expected (hex bytes:de f0 12 34)'
#   at t/hv_macro.t line 71.
#          got: '0xdef01234'
#     expected: '0x3412f0de'

#   Failed test 'U8TO64_LE works as expected (hex bytes:de f0 12 34 56 78 9a bc)'
#   at t/hv_macro.t line 78.
#          got: '0xdef0123456789abc'
#     expected: '0xbc9a78563412f0de'

#   Failed test 'U8TO16_LE works as expected (hex bytes:f0 12)'
#   at t/hv_macro.t line 65.
#          got: '0xf012'
#     expected: '0x12f0'

#   Failed test 'U8TO32_LE works as expected (hex bytes:f0 12 34 56)'
#   at t/hv_macro.t line 71.
#          got: '0xf0123456'
#     expected: '0x563412f0'

#   Failed test 'U8TO64_LE works as expected (hex bytes:f0 12 34 56 78 9a bc de)'
#   at t/hv_macro.t line 78.
#          got: '0xf0123456789abcde'
#     expected: '0xdebc9a78563412f0'

#   Failed test 'U8TO16_LE works as expected (hex bytes:f0 e1)'
#   at t/hv_macro.t line 65.
#          got: '0xf0e1'
#     expected: '0xe1f0'

#   Failed test 'U8TO32_LE works as expected (hex bytes:f0 e1 d2 c3)'
#   at t/hv_macro.t line 71.
#          got: '0xf0e1d2c3'
#     expected: '0xc3d2e1f0'

#   Failed test 'U8TO64_LE works as expected (hex bytes:f0 e1 d2 c3 b4 a5 96 87)'
#   at t/hv_macro.t line 78.
#          got: '0xf0e1d2c3b4a59687'
#     expected: '0x8796a5b4c3d2e1f0'

#   Failed test 'U8TO16_LE works as expected (hex bytes:e1 d2)'
#   at t/hv_macro.t line 65.
#          got: '0xe1d2'
#     expected: '0xd2e1'

#   Failed test 'U8TO32_LE works as expected (hex bytes:e1 d2 c3 b4)'
#   at t/hv_macro.t line 71.
#          got: '0xe1d2c3b4'
#     expected: '0xb4c3d2e1'

#   Failed test 'U8TO64_LE works as expected (hex bytes:e1 d2 c3 b4 a5 96 87 f0)'
#   at t/hv_macro.t line 78.
#          got: '0xe1d2c3b4a59687f0'
#     expected: '0xf08796a5b4c3d2e1'

#   Failed test 'U8TO16_LE works as expected (hex bytes:d2 c3)'
#   at t/hv_macro.t line 65.
#          got: '0xd2c3'
#     expected: '0xc3d2'

#   Failed test 'U8TO32_LE works as expected (hex bytes:d2 c3 b4 a5)'
#   at t/hv_macro.t line 71.
#          got: '0xd2c3b4a5'
#     expected: '0xa5b4c3d2'

#   Failed test 'U8TO64_LE works as expected (hex bytes:d2 c3 b4 a5 96 87 f0 e1)'
#   at t/hv_macro.t line 78.
#          got: '0xd2c3b4a59687f0e1'
#     expected: '0xe1f08796a5b4c3d2'

#   Failed test 'U8TO16_LE works as expected (hex bytes:c3 b4)'
#   at t/hv_macro.t line 65.
#          got: '0xc3b4'
#     expected: '0xb4c3'

#   Failed test 'U8TO32_LE works as expected (hex bytes:c3 b4 a5 96)'
#   at t/hv_macro.t line 71.
#          got: '0xc3b4a596'
#     expected: '0x96a5b4c3'

#   Failed test 'U8TO64_LE works as expected (hex bytes:c3 b4 a5 96 87 f0 e1 d2)'
#   at t/hv_macro.t line 78.
#          got: '0xc3b4a59687f0e1d2'
#     expected: '0xd2e1f08796a5b4c3'

#   Failed test 'U8TO16_LE works as expected (hex bytes:b4 a5)'
#   at t/hv_macro.t line 65.
#          got: '0xb4a5'
#     expected: '0xa5b4'

#   Failed test 'U8TO32_LE works as expected (hex bytes:b4 a5 96 87)'
#   at t/hv_macro.t line 71.
#          got: '0xb4a59687'
#     expected: '0x8796a5b4'

#   Failed test 'U8TO64_LE works as expected (hex bytes:b4 a5 96 87 f0 e1 d2 c3)'
#   at t/hv_macro.t line 78.
#          got: '0xb4a59687f0e1d2c3'
#     expected: '0xc3d2e1f08796a5b4'

#   Failed test 'U8TO16_LE works as expected (hex bytes:a5 96)'
#   at t/hv_macro.t line 65.
#          got: '0xa596'
#     expected: '0x96a5'

#   Failed test 'U8TO32_LE works as expected (hex bytes:a5 96 87 f0)'
#   at t/hv_macro.t line 71.
#          got: '0xa59687f0'
#     expected: '0xf08796a5'

#   Failed test 'U8TO64_LE works as expected (hex bytes:a5 96 87 f0 e1 d2 c3 b4)'
#   at t/hv_macro.t line 78.
#          got: '0xa59687f0e1d2c3b4'
#     expected: '0xb4c3d2e1f08796a5'

#   Failed test 'U8TO16_LE works as expected (hex bytes:96 87)'
#   at t/hv_macro.t line 65.
#          got: '0x9687'
#     expected: '0x8796'

#   Failed test 'U8TO32_LE works as expected (hex bytes:96 87 f0 e1)'
#   at t/hv_macro.t line 71.
#          got: '0x9687f0e1'
#     expected: '0xe1f08796'

#   Failed test 'U8TO64_LE works as expected (hex bytes:96 87 f0 e1 d2 c3 b4 a5)'
#   at t/hv_macro.t line 78.
#          got: '0x9687f0e1d2c3b4a5'
#     expected: '0xa5b4c3d2e1f08796'

#   Failed test 'U8TO16_LE works as expected (hex bytes:87 f0)'
#   at t/hv_macro.t line 65.
#          got: '0x87f0'
#     expected: '0xf087'

#   Failed test 'U8TO32_LE works as expected (hex bytes:87 f0 e1 d2)'
#   at t/hv_macro.t line 71.
#          got: '0x87f0e1d2'
#     expected: '0xd2e1f087'

#   Failed test 'U8TO64_LE works as expected (hex bytes:87 f0 e1 d2 c3 b4 a5 96)'
#   at t/hv_macro.t line 78.
#          got: '0x87f0e1d2c3b4a596'
#     expected: '0x96a5b4c3d2e1f087'

#   Failed test 'Siphash24 seems to work'
#   at t/hv_macro.t line 207.
#          got: '6c021bba2aad2555'
#     expected: '71a11e065cefc12c'

#   Failed test 'Siphash13 seems to work'
#   at t/hv_macro.t line 213.
#          got: 'e33b5015709212d2'
#     expected: 'adee71f47e49757a'

#   Failed test 'siphash24 test vectors check'
#   at t/hv_macro.t line 219.
#          got: '128'
#     expected: '0'

#   Failed test 'siphash13 test vectors check'
#   at t/hv_macro.t line 220.
#          got: '128'
#     expected: '0'
# Looks like you failed 52 tests of 63.
# Will use Digest::MD5
# Connected to 127.0.0.1
syswrite() isn't allowed on :utf8 handles at t/Socket.t line 47.
# Looks like your test exited with 255 just after 2.
make: *** [test_harness] Error 52

error while running harness target 'test_harness': 2 at /pro/3gl/CPAN/smoke/lib/Test/Smoke/App/RunSmoke.pm line 118.
[2020-03-25 14:19:45+0100] 
[2020-03-25 14:19:45+0100] ../dist/IO/t/cachepropagate-unix.t..........................FAILED
[2020-03-25 14:19:45+0100]     2, 10
[2020-03-25 14:19:45+0100] ../dist/IO/t/cachepropagate-unix.t..........................FAILED
[2020-03-25 14:19:45+0100]     Non-zero exit status: 2
[2020-03-25 14:19:45+0100] ../dist/Net-Ping/t/450_service.t............................PASSED
[2020-03-25 14:19:45+0100]     9, 18
[2020-03-25 14:19:45+0100] ../ext/XS-APItest/t/hv_macro.t..............................FAILED
[2020-03-25 14:19:45+0100]     2-49, 60-61
[2020-03-25 14:19:45+0100] ../ext/XS-APItest/t/hv_macro.t..............................FAILED
[2020-03-25 14:19:45+0100]     Non-zero exit status: 52
[2020-03-25 14:19:45+0100] ../ext/XS-APItest/t/hv_macro.t..............................FAILED
[2020-03-25 14:19:45+0100]     Bad plan.  You planned 63 tests but ran 61.
[2020-03-25 14:19:45+0100] ../cpan/Socket/t/Socket.t...................................FAILED
[2020-03-25 14:19:45+0100]     Non-zero exit status: 255
[2020-03-25 14:19:45+0100] ../cpan/Socket/t/Socket.t...................................FAILED
[2020-03-25 14:19:45+0100]     Bad plan.  You planned 6 tests but ran 2.
[2020-03-25 14:19:45+0100] Archived results...
[2020-03-25 14:19:45+0100] Unskip tests from '/pro/3gl/CPAN/smoke/p59.skip'
[2020-03-25 14:19:45+0100] 
[2020-03-25 14:19:45+0100] Configuration: -Dcc=gcc -Dusedevel -Duseithreads
[2020-03-25 14:19:45+0100] ------------------------------------------------------------------------------
[2020-03-25 14:19:45+0100] make distclean ...
[2020-03-25 14:20:50+0100] 
[2020-03-25 14:20:50+0100] Copy Policy.sh ...
[2020-03-25 14:20:50+0100] 
[2020-03-25 14:20:50+0100] Configure ...
[2020-03-25 14:22:19+0100] 
[2020-03-25 14:22:19+0100] make ...
===== PROCURA Policy for hpux/ccache gcc ========================
===== PROCURA Policy results ============================
cc:         ccache gcc
ccversion:  -
gccversion: -
ccflags:    -milp32 -fPIC 
optimize:   
ld:         
ldflags:    -L/usr/lib/hpux32 -L/pro/local/lib
libswanted: cl pthread cl pthread socket bind inet nsl ndbm gdbm dbm db malloc dl ld sun m crypt sec util c cposix posix ucb bsd BSD
libsdirs:    /usr/lib/hpux32  /lib /pro/local/lib
locincpth:  /pro/local/include
loclibpth:  /usr/lib/hpux32
useshrplib: 
===== PROCURA Policy done ===============================
[2020-03-25 14:38:47+0100] Skip tests from '/pro/3gl/CPAN/smoke/p59.skip'
[2020-03-25 14:38:47+0100] 
[2020-03-25 14:38:47+0100]  Tests start here:
[2020-03-25 14:38:47+0100] TSTENV = stdio	
op.c: In function 'Perl_ck_eval':
op.c:12772:9: warning: value computed is not used [-Wunused-value]
op.c: In function 'Perl_pmruntime':
op.c:7444:15: warning: 't_cp' may be used uninitialized in this function [-Wmaybe-uninitialized]
op.c:7038:14: note: 't_cp' was declared here
op.c:7481:28: warning: 'r_cp' may be used uninitialized in this function [-Wmaybe-uninitialized]
op.c:7038:8: note: 'r_cp' was declared here
pp.c: In function 'Perl_pp_argelem':
pp.c:7025:13: warning: value computed is not used [-Wunused-value]
time64.c: In function 'Perl_localtime64_r':
time64.c:573:30: warning: 'orig_year' may be used uninitialized in this function [-Wmaybe-uninitialized]
op.c: In function 'Perl_ck_eval':
op.c:12772:9: warning: value computed is not used [-Wunused-value]
op.c: In function 'Perl_pmruntime':
op.c:7444:15: warning: 't_cp' may be used uninitialized in this function [-Wmaybe-uninitialized]
op.c:7038:14: note: 't_cp' was declared here
op.c:7481:28: warning: 'r_cp' may be used uninitialized in this function [-Wmaybe-uninitialized]
op.c:7038:8: note: 'r_cp' was declared here
RealPPPort.xs: In function 'XS_Devel__PPPort_check_HeUTF8':
RealPPPort.xs:1990:17: warning: value computed is not used [-Wunused-value]
Opcode.xs: In function 'XS_Opcode_invert_opset':
Opcode.xs:363:2: warning: overflow in implicit constant conversion [-Woverflow]
Warning (mostly harmless): No library found for -lposix
Warning (mostly harmless): No library found for -lcposix
./const-xs.inc: In function 'boot_Socket':
./const-xs.inc:986:20: warning: missing braces around initializer [-Wmissing-braces]
./const-xs.inc:986:20: warning: (near initialization for 'ip6_address._s6_un') [-Wmissing-braces]
./const-xs.inc:995:20: warning: missing braces around initializer [-Wmissing-braces]
./const-xs.inc:995:20: warning: (near initialization for 'ip6_address._s6_un') [-Wmissing-braces]
In file included from HiRes.xs:1047:0:
const-c.inc: In function 'constant_19':
const-c.inc:351:42: warning: unused parameter 'iv_return' [-Wunused-parameter]
Making header files for XS...
APItest.xs: In function 'XS_XS__APItest__HvMacro_u8_to_u16_le':
APItest.xs:6895:13: warning: unused variable 'u64' [-Wunused-variable]
re_exec.c: In function 'S_dump_exec_pos':
re_exec.c:4170:21: warning: format '%u' expects argument of type 'unsigned int', but argument 13 has type 'U32' [-Wformat]
re_exec.c: In function 'S_regtry':
re_exec.c:6539:30: warning: 'fold_array' may be used uninitialized in this function [-Wmaybe-uninitialized]
re_exec.c:6443:17: note: 'fold_array' was declared here
re_exec.c:6545:28: warning: 'folder' may be used uninitialized in this function [-Wmaybe-uninitialized]
re_exec.c:6442:16: note: 'folder' was declared here
shared.xs: In function 'sharedsv_scalar_store':
shared.xs:830:13: warning: value computed is not used [-Wunused-value]
No saved state, selection will be empty
Cannot figure out an encoding to use at t/use-Encode-Alias.t line 5.
# Connected to 127.0.0.1
# Connected to 127.0.0.1
Integer overflow in hexadecimal number at t/broken_univ_can.t line 7.
Redefining sub xChild::foo at xChild--29882 line 2.
Redefining sub Data::ok at -e line 1.

#   Failed test 'protocol defined'
#   at t/cachepropagate-unix.t line 54.

#   Failed test 'protocol defined'
#   at t/cachepropagate-unix.t line 109.
# Looks like you failed 2 tests of 15.
# Will use Digest::MD5

#   Failed test 'U8TO16_LE works as expected (hex bytes:12 34)'
#   at t/hv_macro.t line 65.
#          got: '0x1234'
#     expected: '0x3412'

#   Failed test 'U8TO32_LE works as expected (hex bytes:12 34 56 78)'
#   at t/hv_macro.t line 71.
#          got: '0x12345678'
#     expected: '0x78563412'

#   Failed test 'U8TO16_LE works as expected (hex bytes:34 56)'
#   at t/hv_macro.t line 65.
#          got: '0x3456'
#     expected: '0x5634'

#   Failed test 'U8TO32_LE works as expected (hex bytes:34 56 78 9a)'
#   at t/hv_macro.t line 71.
#          got: '0x3456789a'
#     expected: '0x9a785634'

#   Failed test 'U8TO16_LE works as expected (hex bytes:56 78)'
#   at t/hv_macro.t line 65.
#          got: '0x5678'
#     expected: '0x7856'

#   Failed test 'U8TO32_LE works as expected (hex bytes:56 78 9a bc)'
#   at t/hv_macro.t line 71.
#          got: '0x56789abc'
#     expected: '0xbc9a7856'

#   Failed test 'U8TO16_LE works as expected (hex bytes:78 9a)'
#   at t/hv_macro.t line 65.
#          got: '0x789a'
#     expected: '0x9a78'

#   Failed test 'U8TO32_LE works as expected (hex bytes:78 9a bc de)'
#   at t/hv_macro.t line 71.
#          got: '0x789abcde'
#     expected: '0xdebc9a78'

#   Failed test 'U8TO16_LE works as expected (hex bytes:9a bc)'
#   at t/hv_macro.t line 65.
#          got: '0x9abc'
#     expected: '0xbc9a'

#   Failed test 'U8TO32_LE works as expected (hex bytes:9a bc de f0)'
#   at t/hv_macro.t line 71.
#          got: '0x9abcdef0'
#     expected: '0xf0debc9a'

#   Failed test 'U8TO16_LE works as expected (hex bytes:bc de)'
#   at t/hv_macro.t line 65.
#          got: '0xbcde'
#     expected: '0xdebc'

#   Failed test 'U8TO32_LE works as expected (hex bytes:bc de f0 12)'
#   at t/hv_macro.t line 71.
#          got: '0xbcdef012'
#     expected: '0x12f0debc'

#   Failed test 'U8TO16_LE works as expected (hex bytes:de f0)'
#   at t/hv_macro.t line 65.
#          got: '0xdef0'
#     expected: '0xf0de'

#   Failed test 'U8TO32_LE works as expected (hex bytes:de f0 12 34)'
#   at t/hv_macro.t line 71.
#          got: '0xdef01234'
#     expected: '0x3412f0de'

#   Failed test 'U8TO16_LE works as expected (hex bytes:f0 12)'
#   at t/hv_macro.t line 65.
#          got: '0xf012'
#     expected: '0x12f0'

#   Failed test 'U8TO32_LE works as expected (hex bytes:f0 12 34 56)'
#   at t/hv_macro.t line 71.
#          got: '0xf0123456'
#     expected: '0x563412f0'

#   Failed test 'U8TO16_LE works as expected (hex bytes:f0 e1)'
#   at t/hv_macro.t line 65.
#          got: '0xf0e1'
#     expected: '0xe1f0'

#   Failed test 'U8TO32_LE works as expected (hex bytes:f0 e1 d2 c3)'
#   at t/hv_macro.t line 71.
#          got: '0xf0e1d2c3'
#     expected: '0xc3d2e1f0'

#   Failed test 'U8TO16_LE works as expected (hex bytes:e1 d2)'
#   at t/hv_macro.t line 65.
#          got: '0xe1d2'
#     expected: '0xd2e1'

#   Failed test 'U8TO32_LE works as expected (hex bytes:e1 d2 c3 b4)'
#   at t/hv_macro.t line 71.
#          got: '0xe1d2c3b4'
#     expected: '0xb4c3d2e1'

#   Failed test 'U8TO16_LE works as expected (hex bytes:d2 c3)'
#   at t/hv_macro.t line 65.
#          got: '0xd2c3'
#     expected: '0xc3d2'

#   Failed test 'U8TO32_LE works as expected (hex bytes:d2 c3 b4 a5)'
#   at t/hv_macro.t line 71.
#          got: '0xd2c3b4a5'
#     expected: '0xa5b4c3d2'

#   Failed test 'U8TO16_LE works as expected (hex bytes:c3 b4)'
#   at t/hv_macro.t line 65.
#          got: '0xc3b4'
#     expected: '0xb4c3'

#   Failed test 'U8TO32_LE works as expected (hex bytes:c3 b4 a5 96)'
#   at t/hv_macro.t line 71.
#          got: '0xc3b4a596'
#     expected: '0x96a5b4c3'

#   Failed test 'U8TO16_LE works as expected (hex bytes:b4 a5)'
#   at t/hv_macro.t line 65.
#          got: '0xb4a5'
#     expected: '0xa5b4'

#   Failed test 'U8TO32_LE works as expected (hex bytes:b4 a5 96 87)'
#   at t/hv_macro.t line 71.
#          got: '0xb4a59687'
#     expected: '0x8796a5b4'

#   Failed test 'U8TO16_LE works as expected (hex bytes:a5 96)'
#   at t/hv_macro.t line 65.
#          got: '0xa596'
#     expected: '0x96a5'

#   Failed test 'U8TO32_LE works as expected (hex bytes:a5 96 87 f0)'
#   at t/hv_macro.t line 71.
#          got: '0xa59687f0'
#     expected: '0xf08796a5'

#   Failed test 'U8TO16_LE works as expected (hex bytes:96 87)'
#   at t/hv_macro.t line 65.
#          got: '0x9687'
#     expected: '0x8796'

#   Failed test 'U8TO32_LE works as expected (hex bytes:96 87 f0 e1)'
#   at t/hv_macro.t line 71.
#          got: '0x9687f0e1'
#     expected: '0xe1f08796'

#   Failed test 'U8TO16_LE works as expected (hex bytes:87 f0)'
#   at t/hv_macro.t line 65.
#          got: '0x87f0'
#     expected: '0xf087'

#   Failed test 'U8TO32_LE works as expected (hex bytes:87 f0 e1 d2)'
#   at t/hv_macro.t line 71.
#          got: '0x87f0e1d2'
#     expected: '0xd2e1f087'
# Looks like you failed 32 tests of 38.
make: *** [test_harness] Error 34

error while running harness target 'test_harness': 2 at /pro/3gl/CPAN/smoke/lib/Test/Smoke/App/RunSmoke.pm line 118.
[2020-03-25 14:58:38+0100] 
[2020-03-25 14:58:38+0100] ../dist/IO/t/cachepropagate-unix.t..........................FAILED
[2020-03-25 14:58:38+0100]     2, 10
[2020-03-25 14:58:38+0100] ../dist/IO/t/cachepropagate-unix.t..........................FAILED
[2020-03-25 14:58:38+0100]     Non-zero exit status: 2
[2020-03-25 14:58:38+0100] ../dist/Net-Ping/t/450_service.t............................PASSED
[2020-03-25 14:58:38+0100]     9, 18
[2020-03-25 14:58:38+0100] ../ext/XS-APItest/t/hv_macro.t..............................FAILED
[2020-03-25 14:58:38+0100]     2-33
[2020-03-25 14:58:38+0100] ../ext/XS-APItest/t/hv_macro.t..............................FAILED
[2020-03-25 14:58:38+0100]     Non-zero exit status: 32
[2020-03-25 14:58:38+0100] Archived results...
[2020-03-25 14:58:38+0100] TSTENV = perlio	

#   Failed test 'protocol defined'
#   at t/cachepropagate-unix.t line 54.

#   Failed test 'protocol defined'
#   at t/cachepropagate-unix.t line 109.
# Looks like you failed 2 tests of 15.

#   Failed test 'U8TO16_LE works as expected (hex bytes:12 34)'
#   at t/hv_macro.t line 65.
#          got: '0x1234'
#     expected: '0x3412'

#   Failed test 'U8TO32_LE works as expected (hex bytes:12 34 56 78)'
#   at t/hv_macro.t line 71.
#          got: '0x12345678'
#     expected: '0x78563412'

#   Failed test 'U8TO16_LE works as expected (hex bytes:34 56)'
#   at t/hv_macro.t line 65.
#          got: '0x3456'
#     expected: '0x5634'

#   Failed test 'U8TO32_LE works as expected (hex bytes:34 56 78 9a)'
#   at t/hv_macro.t line 71.
#          got: '0x3456789a'
#     expected: '0x9a785634'

#   Failed test 'U8TO16_LE works as expected (hex bytes:56 78)'
#   at t/hv_macro.t line 65.
#          got: '0x5678'
#     expected: '0x7856'

#   Failed test 'U8TO32_LE works as expected (hex bytes:56 78 9a bc)'
#   at t/hv_macro.t line 71.
#          got: '0x56789abc'
#     expected: '0xbc9a7856'

#   Failed test 'U8TO16_LE works as expected (hex bytes:78 9a)'
#   at t/hv_macro.t line 65.
#          got: '0x789a'
#     expected: '0x9a78'

#   Failed test 'U8TO32_LE works as expected (hex bytes:78 9a bc de)'
#   at t/hv_macro.t line 71.
#          got: '0x789abcde'
#     expected: '0xdebc9a78'

#   Failed test 'U8TO16_LE works as expected (hex bytes:9a bc)'
#   at t/hv_macro.t line 65.
#          got: '0x9abc'
#     expected: '0xbc9a'

#   Failed test 'U8TO32_LE works as expected (hex bytes:9a bc de f0)'
#   at t/hv_macro.t line 71.
#          got: '0x9abcdef0'
#     expected: '0xf0debc9a'

#   Failed test 'U8TO16_LE works as expected (hex bytes:bc de)'
#   at t/hv_macro.t line 65.
#          got: '0xbcde'
#     expected: '0xdebc'

#   Failed test 'U8TO32_LE works as expected (hex bytes:bc de f0 12)'
#   at t/hv_macro.t line 71.
#          got: '0xbcdef012'
#     expected: '0x12f0debc'

#   Failed test 'U8TO16_LE works as expected (hex bytes:de f0)'
#   at t/hv_macro.t line 65.
#          got: '0xdef0'
#     expected: '0xf0de'

#   Failed test 'U8TO32_LE works as expected (hex bytes:de f0 12 34)'
#   at t/hv_macro.t line 71.
#          got: '0xdef01234'
#     expected: '0x3412f0de'

#   Failed test 'U8TO16_LE works as expected (hex bytes:f0 12)'
#   at t/hv_macro.t line 65.
#          got: '0xf012'
#     expected: '0x12f0'

#   Failed test 'U8TO32_LE works as expected (hex bytes:f0 12 34 56)'
#   at t/hv_macro.t line 71.
#          got: '0xf0123456'
#     expected: '0x563412f0'

#   Failed test 'U8TO16_LE works as expected (hex bytes:f0 e1)'
#   at t/hv_macro.t line 65.
#          got: '0xf0e1'
#     expected: '0xe1f0'

#   Failed test 'U8TO32_LE works as expected (hex bytes:f0 e1 d2 c3)'
#   at t/hv_macro.t line 71.
#          got: '0xf0e1d2c3'
#     expected: '0xc3d2e1f0'

#   Failed test 'U8TO16_LE works as expected (hex bytes:e1 d2)'
#   at t/hv_macro.t line 65.
#          got: '0xe1d2'
#     expected: '0xd2e1'

#   Failed test 'U8TO32_LE works as expected (hex bytes:e1 d2 c3 b4)'
#   at t/hv_macro.t line 71.
#          got: '0xe1d2c3b4'
#     expected: '0xb4c3d2e1'

#   Failed test 'U8TO16_LE works as expected (hex bytes:d2 c3)'
#   at t/hv_macro.t line 65.
#          got: '0xd2c3'
#     expected: '0xc3d2'

#   Failed test 'U8TO32_LE works as expected (hex bytes:d2 c3 b4 a5)'
#   at t/hv_macro.t line 71.
#          got: '0xd2c3b4a5'
#     expected: '0xa5b4c3d2'

#   Failed test 'U8TO16_LE works as expected (hex bytes:c3 b4)'
#   at t/hv_macro.t line 65.
#          got: '0xc3b4'
#     expected: '0xb4c3'

#   Failed test 'U8TO32_LE works as expected (hex bytes:c3 b4 a5 96)'
#   at t/hv_macro.t line 71.
#          got: '0xc3b4a596'
#     expected: '0x96a5b4c3'

#   Failed test 'U8TO16_LE works as expected (hex bytes:b4 a5)'
#   at t/hv_macro.t line 65.
#          got: '0xb4a5'
#     expected: '0xa5b4'

#   Failed test 'U8TO32_LE works as expected (hex bytes:b4 a5 96 87)'
#   at t/hv_macro.t line 71.
#          got: '0xb4a59687'
#     expected: '0x8796a5b4'

#   Failed test 'U8TO16_LE works as expected (hex bytes:a5 96)'
#   at t/hv_macro.t line 65.
#          got: '0xa596'
#     expected: '0x96a5'

#   Failed test 'U8TO32_LE works as expected (hex bytes:a5 96 87 f0)'
#   at t/hv_macro.t line 71.
#          got: '0xa59687f0'
#     expected: '0xf08796a5'

#   Failed test 'U8TO16_LE works as expected (hex bytes:96 87)'
#   at t/hv_macro.t line 65.
#          got: '0x9687'
#     expected: '0x8796'

#   Failed test 'U8TO32_LE works as expected (hex bytes:96 87 f0 e1)'
#   at t/hv_macro.t line 71.
#          got: '0x9687f0e1'
#     expected: '0xe1f08796'

#   Failed test 'U8TO16_LE works as expected (hex bytes:87 f0)'
#   at t/hv_macro.t line 65.
#          got: '0x87f0'
#     expected: '0xf087'

#   Failed test 'U8TO32_LE works as expected (hex bytes:87 f0 e1 d2)'
#   at t/hv_macro.t line 71.
#          got: '0x87f0e1d2'
#     expected: '0xd2e1f087'
# Looks like you failed 32 tests of 38.
# Will use Digest::MD5
Integer overflow in hexadecimal number at t/broken_univ_can.t line 7.
# Connected to 127.0.0.1
# Connected to 127.0.0.1
Cannot figure out an encoding to use at t/use-Encode-Alias.t line 5.
make: *** [test_harness] Error 34

error while running harness target 'test_harness': 2 at /pro/3gl/CPAN/smoke/lib/Test/Smoke/App/RunSmoke.pm line 118.
[2020-03-25 15:15:56+0100] 
[2020-03-25 15:15:56+0100] ../dist/IO/t/cachepropagate-unix.t..........................FAILED
[2020-03-25 15:15:56+0100]     2, 10
[2020-03-25 15:15:56+0100] ../dist/IO/t/cachepropagate-unix.t..........................FAILED
[2020-03-25 15:15:56+0100]     Non-zero exit status: 2
[2020-03-25 15:15:56+0100] ../dist/Net-Ping/t/450_service.t............................PASSED
[2020-03-25 15:15:56+0100]     9, 18
[2020-03-25 15:15:56+0100] ../ext/XS-APItest/t/hv_macro.t..............................FAILED
[2020-03-25 15:15:56+0100]     2-33
[2020-03-25 15:15:56+0100] ../ext/XS-APItest/t/hv_macro.t..............................FAILED
[2020-03-25 15:15:56+0100]     Non-zero exit status: 32
[2020-03-25 15:15:56+0100] Archived results...
[2020-03-25 15:15:56+0100] TSTENV = locale:en_US.utf8	

#   Failed test 'protocol defined'
#   at t/cachepropagate-unix.t line 54.

#   Failed test 'protocol defined'
#   at t/cachepropagate-unix.t line 109.
# Looks like you failed 2 tests of 15.

#   Failed test 'U8TO16_LE works as expected (hex bytes:12 34)'
#   at t/hv_macro.t line 65.
#          got: '0x1234'
#     expected: '0x3412'

#   Failed test 'U8TO32_LE works as expected (hex bytes:12 34 56 78)'
#   at t/hv_macro.t line 71.
#          got: '0x12345678'
#     expected: '0x78563412'

#   Failed test 'U8TO16_LE works as expected (hex bytes:34 56)'
#   at t/hv_macro.t line 65.
#          got: '0x3456'
#     expected: '0x5634'

#   Failed test 'U8TO32_LE works as expected (hex bytes:34 56 78 9a)'
#   at t/hv_macro.t line 71.
#          got: '0x3456789a'
#     expected: '0x9a785634'

#   Failed test 'U8TO16_LE works as expected (hex bytes:56 78)'
#   at t/hv_macro.t line 65.
#          got: '0x5678'
#     expected: '0x7856'

#   Failed test 'U8TO32_LE works as expected (hex bytes:56 78 9a bc)'
#   at t/hv_macro.t line 71.
#          got: '0x56789abc'
#     expected: '0xbc9a7856'

#   Failed test 'U8TO16_LE works as expected (hex bytes:78 9a)'
#   at t/hv_macro.t line 65.
#          got: '0x789a'
#     expected: '0x9a78'

#   Failed test 'U8TO32_LE works as expected (hex bytes:78 9a bc de)'
#   at t/hv_macro.t line 71.
#          got: '0x789abcde'
#     expected: '0xdebc9a78'

#   Failed test 'U8TO16_LE works as expected (hex bytes:9a bc)'
#   at t/hv_macro.t line 65.
#          got: '0x9abc'
#     expected: '0xbc9a'

#   Failed test 'U8TO32_LE works as expected (hex bytes:9a bc de f0)'
#   at t/hv_macro.t line 71.
#          got: '0x9abcdef0'
#     expected: '0xf0debc9a'

#   Failed test 'U8TO16_LE works as expected (hex bytes:bc de)'
#   at t/hv_macro.t line 65.
#          got: '0xbcde'
#     expected: '0xdebc'

#   Failed test 'U8TO32_LE works as expected (hex bytes:bc de f0 12)'
#   at t/hv_macro.t line 71.
#          got: '0xbcdef012'
#     expected: '0x12f0debc'

#   Failed test 'U8TO16_LE works as expected (hex bytes:de f0)'
#   at t/hv_macro.t line 65.
#          got: '0xdef0'
#     expected: '0xf0de'

#   Failed test 'U8TO32_LE works as expected (hex bytes:de f0 12 34)'
#   at t/hv_macro.t line 71.
#          got: '0xdef01234'
#     expected: '0x3412f0de'

#   Failed test 'U8TO16_LE works as expected (hex bytes:f0 12)'
#   at t/hv_macro.t line 65.
#          got: '0xf012'
#     expected: '0x12f0'

#   Failed test 'U8TO32_LE works as expected (hex bytes:f0 12 34 56)'
#   at t/hv_macro.t line 71.
#          got: '0xf0123456'
#     expected: '0x563412f0'

#   Failed test 'U8TO16_LE works as expected (hex bytes:f0 e1)'
#   at t/hv_macro.t line 65.
#          got: '0xf0e1'
#     expected: '0xe1f0'

#   Failed test 'U8TO32_LE works as expected (hex bytes:f0 e1 d2 c3)'
#   at t/hv_macro.t line 71.
#          got: '0xf0e1d2c3'
#     expected: '0xc3d2e1f0'

#   Failed test 'U8TO16_LE works as expected (hex bytes:e1 d2)'
#   at t/hv_macro.t line 65.
#          got: '0xe1d2'
#     expected: '0xd2e1'

#   Failed test 'U8TO32_LE works as expected (hex bytes:e1 d2 c3 b4)'
#   at t/hv_macro.t line 71.
#          got: '0xe1d2c3b4'
#     expected: '0xb4c3d2e1'

#   Failed test 'U8TO16_LE works as expected (hex bytes:d2 c3)'
#   at t/hv_macro.t line 65.
#          got: '0xd2c3'
#     expected: '0xc3d2'

#   Failed test 'U8TO32_LE works as expected (hex bytes:d2 c3 b4 a5)'
#   at t/hv_macro.t line 71.
#          got: '0xd2c3b4a5'
#     expected: '0xa5b4c3d2'

#   Failed test 'U8TO16_LE works as expected (hex bytes:c3 b4)'
#   at t/hv_macro.t line 65.
#          got: '0xc3b4'
#     expected: '0xb4c3'

#   Failed test 'U8TO32_LE works as expected (hex bytes:c3 b4 a5 96)'
#   at t/hv_macro.t line 71.
#          got: '0xc3b4a596'
#     expected: '0x96a5b4c3'

#   Failed test 'U8TO16_LE works as expected (hex bytes:b4 a5)'
#   at t/hv_macro.t line 65.
#          got: '0xb4a5'
#     expected: '0xa5b4'

#   Failed test 'U8TO32_LE works as expected (hex bytes:b4 a5 96 87)'
#   at t/hv_macro.t line 71.
#          got: '0xb4a59687'
#     expected: '0x8796a5b4'

#   Failed test 'U8TO16_LE works as expected (hex bytes:a5 96)'
#   at t/hv_macro.t line 65.
#          got: '0xa596'
#     expected: '0x96a5'

#   Failed test 'U8TO32_LE works as expected (hex bytes:a5 96 87 f0)'
#   at t/hv_macro.t line 71.
#          got: '0xa59687f0'
#     expected: '0xf08796a5'

#   Failed test 'U8TO16_LE works as expected (hex bytes:96 87)'
#   at t/hv_macro.t line 65.
#          got: '0x9687'
#     expected: '0x8796'

#   Failed test 'U8TO32_LE works as expected (hex bytes:96 87 f0 e1)'
#   at t/hv_macro.t line 71.
#          got: '0x9687f0e1'
#     expected: '0xe1f08796'

#   Failed test 'U8TO16_LE works as expected (hex bytes:87 f0)'
#   at t/hv_macro.t line 65.
#          got: '0x87f0'
#     expected: '0xf087'

#   Failed test 'U8TO32_LE works as expected (hex bytes:87 f0 e1 d2)'
#   at t/hv_macro.t line 71.
#          got: '0x87f0e1d2'
#     expected: '0xd2e1f087'
# Looks like you failed 32 tests of 38.
Integer overflow in hexadecimal number at t/broken_univ_can.t line 7.
# Will use Digest::MD5
# Connected to 127.0.0.1
syswrite() isn't allowed on :utf8 handles at t/Socket.t line 47.
# Looks like your test exited with 255 just after 2.
make: *** [test_harness] Error 34

error while running harness target 'test_harness': 2 at /pro/3gl/CPAN/smoke/lib/Test/Smoke/App/RunSmoke.pm line 118.
[2020-03-25 15:33:31+0100] 
[2020-03-25 15:33:31+0100] ../dist/IO/t/cachepropagate-unix.t..........................FAILED
[2020-03-25 15:33:31+0100]     2, 10
[2020-03-25 15:33:31+0100] ../dist/IO/t/cachepropagate-unix.t..........................FAILED
[2020-03-25 15:33:31+0100]     Non-zero exit status: 2
[2020-03-25 15:33:31+0100] ../dist/Net-Ping/t/450_service.t............................PASSED
[2020-03-25 15:33:31+0100]     9, 18
[2020-03-25 15:33:31+0100] ../ext/XS-APItest/t/hv_macro.t..............................FAILED
[2020-03-25 15:33:31+0100]     2-33
[2020-03-25 15:33:31+0100] ../ext/XS-APItest/t/hv_macro.t..............................FAILED
[2020-03-25 15:33:31+0100]     Non-zero exit status: 32
[2020-03-25 15:33:31+0100] ../cpan/Socket/t/Socket.t...................................FAILED
[2020-03-25 15:33:31+0100]     Non-zero exit status: 255
[2020-03-25 15:33:31+0100] ../cpan/Socket/t/Socket.t...................................FAILED
[2020-03-25 15:33:31+0100]     Bad plan.  You planned 6 tests but ran 2.
[2020-03-25 15:33:31+0100] Archived results...
[2020-03-25 15:33:31+0100] Unskip tests from '/pro/3gl/CPAN/smoke/p59.skip'
[2020-03-25 15:33:31+0100] 
[2020-03-25 15:33:31+0100] Configuration: -Dcc=gcc -Dusedevel -Duseithreads -DDEBUGGING
[2020-03-25 15:33:31+0100] ------------------------------------------------------------------------------
[2020-03-25 15:33:31+0100] make distclean ...
[2020-03-25 15:34:19+0100] 
[2020-03-25 15:34:19+0100] Copy Policy.sh ...
[2020-03-25 15:34:19+0100] 
[2020-03-25 15:34:19+0100] Configure ...
[2020-03-25 15:35:49+0100] 
[2020-03-25 15:35:49+0100] make ...
===== PROCURA Policy for hpux/ccache gcc ========================
===== PROCURA Policy results ============================
cc:         ccache gcc
ccversion:  -
gccversion: -
ccflags:    -milp32 -fPIC -DDEBUGGING
optimize:   
ld:         
ldflags:    -L/usr/lib/hpux32 -L/pro/local/lib
libswanted: cl pthread cl pthread socket bind inet nsl ndbm gdbm dbm db malloc dl ld sun m crypt sec util c cposix posix ucb bsd BSD
libsdirs:    /usr/lib/hpux32  /lib /pro/local/lib
locincpth:  /pro/local/include
loclibpth:  /usr/lib/hpux32
useshrplib: 
===== PROCURA Policy done ===============================
[2020-03-25 16:04:10+0100] Skip tests from '/pro/3gl/CPAN/smoke/p59.skip'
[2020-03-25 16:04:10+0100] 
[2020-03-25 16:04:10+0100]  Tests start here:
[2020-03-25 16:04:10+0100] TSTENV = stdio	
op.c: In function 'Perl_ck_eval':
op.c:12772:9: warning: value computed is not used [-Wunused-value]
op.c: In function 'S_pmtrans':
op.c:7444:15: warning: 't_cp' may be used uninitialized in this function [-Wmaybe-uninitialized]
op.c:7481:28: warning: 'r_cp' may be used uninitialized in this function [-Wmaybe-uninitialized]
toke.c: In function 'Perl_scan_num':
toke.c:11631:54: warning: 'b' may be used uninitialized in this function [-Wmaybe-uninitialized]
pp.c: In function 'Perl_pp_argelem':
pp.c:7025:13: warning: value computed is not used [-Wunused-value]
regexec.c: In function 'S_dump_exec_pos':
regexec.c:4170:21: warning: format '%u' expects argument of type 'unsigned int', but argument 13 has type 'U32' [-Wformat]
regexec.c: In function 'S_regtry':
regexec.c:6539:30: warning: 'fold_array' may be used uninitialized in this function [-Wmaybe-uninitialized]
regexec.c:6443:17: note: 'fold_array' was declared here
regexec.c:6545:28: warning: 'folder' may be used uninitialized in this function [-Wmaybe-uninitialized]
regexec.c:6442:16: note: 'folder' was declared here
time64.c: In function 'Perl_localtime64_r':
time64.c:573:30: warning: 'orig_year' may be used uninitialized in this function [-Wmaybe-uninitialized]
op.c: In function 'Perl_ck_eval':
op.c:12772:9: warning: value computed is not used [-Wunused-value]
op.c: In function 'S_pmtrans':
op.c:7444:15: warning: 't_cp' may be used uninitialized in this function [-Wmaybe-uninitialized]
op.c:7481:28: warning: 'r_cp' may be used uninitialized in this function [-Wmaybe-uninitialized]
RealPPPort.xs: In function 'XS_Devel__PPPort_check_HeUTF8':
RealPPPort.xs:1990:17: warning: value computed is not used [-Wunused-value]
Opcode.xs: In function 'XS_Opcode_invert_opset':
Opcode.xs:363:2: warning: overflow in implicit constant conversion [-Woverflow]
Warning (mostly harmless): No library found for -lposix
Warning (mostly harmless): No library found for -lcposix
./const-xs.inc: In function 'boot_Socket':
./const-xs.inc:986:20: warning: missing braces around initializer [-Wmissing-braces]
./const-xs.inc:986:20: warning: (near initialization for 'ip6_address._s6_un') [-Wmissing-braces]
./const-xs.inc:995:20: warning: missing braces around initializer [-Wmissing-braces]
./const-xs.inc:995:20: warning: (near initialization for 'ip6_address._s6_un') [-Wmissing-braces]
Storable.xs: In function 'store_hook':
Storable.xs:4087:17: warning: format '%d' expects argument of type 'int', but argument 3 has type 'I32' [-Wformat]
Storable.xs: In function 'store':
Storable.xs:4462:6: warning: format '%d' expects argument of type 'int', but argument 3 has type 'I32' [-Wformat]
In file included from HiRes.xs:1047:0:
const-c.inc: In function 'constant_19':
const-c.inc:351:42: warning: unused parameter 'iv_return' [-Wunused-parameter]
Making header files for XS...
APItest.xs: In function 'XS_XS__APItest__HvMacro_u8_to_u16_le':
APItest.xs:6895:13: warning: unused variable 'u64' [-Wunused-variable]
re_exec.c: In function 'S_dump_exec_pos':
re_exec.c:4170:21: warning: format '%u' expects argument of type 'unsigned int', but argument 13 has type 'U32' [-Wformat]
re_exec.c: In function 'S_regtry':
re_exec.c:6539:30: warning: 'fold_array' may be used uninitialized in this function [-Wmaybe-uninitialized]
re_exec.c:6443:17: note: 'fold_array' was declared here
re_exec.c:6545:28: warning: 'folder' may be used uninitialized in this function [-Wmaybe-uninitialized]
re_exec.c:6442:16: note: 'folder' was declared here
shared.xs: In function 'sharedsv_scalar_store':
shared.xs:830:13: warning: value computed is not used [-Wunused-value]
No saved state, selection will be empty
Cannot figure out an encoding to use at t/use-Encode-Alias.t line 5.
# Connected to 127.0.0.1
# Connected to 127.0.0.1
Integer overflow in hexadecimal number at t/broken_univ_can.t line 7.
Redefining sub xChild::foo at xChild--5208 line 2.
Redefining sub Data::ok at -e line 1.

#   Failed test 'protocol defined'
#   at t/cachepropagate-unix.t line 54.

#   Failed test 'protocol defined'
#   at t/cachepropagate-unix.t line 109.
# Looks like you failed 2 tests of 15.
# Will use Digest::MD5

#   Failed test 'U8TO16_LE works as expected (hex bytes:12 34)'
#   at t/hv_macro.t line 65.
#          got: '0x1234'
#     expected: '0x3412'

#   Failed test 'U8TO32_LE works as expected (hex bytes:12 34 56 78)'
#   at t/hv_macro.t line 71.
#          got: '0x12345678'
#     expected: '0x78563412'

#   Failed test 'U8TO16_LE works as expected (hex bytes:34 56)'
#   at t/hv_macro.t line 65.
#          got: '0x3456'
#     expected: '0x5634'

#   Failed test 'U8TO32_LE works as expected (hex bytes:34 56 78 9a)'
#   at t/hv_macro.t line 71.
#          got: '0x3456789a'
#     expected: '0x9a785634'

#   Failed test 'U8TO16_LE works as expected (hex bytes:56 78)'
#   at t/hv_macro.t line 65.
#          got: '0x5678'
#     expected: '0x7856'

#   Failed test 'U8TO32_LE works as expected (hex bytes:56 78 9a bc)'
#   at t/hv_macro.t line 71.
#          got: '0x56789abc'
#     expected: '0xbc9a7856'

#   Failed test 'U8TO16_LE works as expected (hex bytes:78 9a)'
#   at t/hv_macro.t line 65.
#          got: '0x789a'
#     expected: '0x9a78'

#   Failed test 'U8TO32_LE works as expected (hex bytes:78 9a bc de)'
#   at t/hv_macro.t line 71.
#          got: '0x789abcde'
#     expected: '0xdebc9a78'

#   Failed test 'U8TO16_LE works as expected (hex bytes:9a bc)'
#   at t/hv_macro.t line 65.
#          got: '0x9abc'
#     expected: '0xbc9a'

#   Failed test 'U8TO32_LE works as expected (hex bytes:9a bc de f0)'
#   at t/hv_macro.t line 71.
#          got: '0x9abcdef0'
#     expected: '0xf0debc9a'

#   Failed test 'U8TO16_LE works as expected (hex bytes:bc de)'
#   at t/hv_macro.t line 65.
#          got: '0xbcde'
#     expected: '0xdebc'

#   Failed test 'U8TO32_LE works as expected (hex bytes:bc de f0 12)'
#   at t/hv_macro.t line 71.
#          got: '0xbcdef012'
#     expected: '0x12f0debc'

#   Failed test 'U8TO16_LE works as expected (hex bytes:de f0)'
#   at t/hv_macro.t line 65.
#          got: '0xdef0'
#     expected: '0xf0de'

#   Failed test 'U8TO32_LE works as expected (hex bytes:de f0 12 34)'
#   at t/hv_macro.t line 71.
#          got: '0xdef01234'
#     expected: '0x3412f0de'

#   Failed test 'U8TO16_LE works as expected (hex bytes:f0 12)'
#   at t/hv_macro.t line 65.
#          got: '0xf012'
#     expected: '0x12f0'

#   Failed test 'U8TO32_LE works as expected (hex bytes:f0 12 34 56)'
#   at t/hv_macro.t line 71.
#          got: '0xf0123456'
#     expected: '0x563412f0'

#   Failed test 'U8TO16_LE works as expected (hex bytes:f0 e1)'
#   at t/hv_macro.t line 65.
#          got: '0xf0e1'
#     expected: '0xe1f0'

#   Failed test 'U8TO32_LE works as expected (hex bytes:f0 e1 d2 c3)'
#   at t/hv_macro.t line 71.
#          got: '0xf0e1d2c3'
#     expected: '0xc3d2e1f0'

#   Failed test 'U8TO16_LE works as expected (hex bytes:e1 d2)'
#   at t/hv_macro.t line 65.
#          got: '0xe1d2'
#     expected: '0xd2e1'

#   Failed test 'U8TO32_LE works as expected (hex bytes:e1 d2 c3 b4)'
#   at t/hv_macro.t line 71.
#          got: '0xe1d2c3b4'
#     expected: '0xb4c3d2e1'

#   Failed test 'U8TO16_LE works as expected (hex bytes:d2 c3)'
#   at t/hv_macro.t line 65.
#          got: '0xd2c3'
#     expected: '0xc3d2'

#   Failed test 'U8TO32_LE works as expected (hex bytes:d2 c3 b4 a5)'
#   at t/hv_macro.t line 71.
#          got: '0xd2c3b4a5'
#     expected: '0xa5b4c3d2'

#   Failed test 'U8TO16_LE works as expected (hex bytes:c3 b4)'
#   at t/hv_macro.t line 65.
#          got: '0xc3b4'
#     expected: '0xb4c3'

#   Failed test 'U8TO32_LE works as expected (hex bytes:c3 b4 a5 96)'
#   at t/hv_macro.t line 71.
#          got: '0xc3b4a596'
#     expected: '0x96a5b4c3'

#   Failed test 'U8TO16_LE works as expected (hex bytes:b4 a5)'
#   at t/hv_macro.t line 65.
#          got: '0xb4a5'
#     expected: '0xa5b4'

#   Failed test 'U8TO32_LE works as expected (hex bytes:b4 a5 96 87)'
#   at t/hv_macro.t line 71.
#          got: '0xb4a59687'
#     expected: '0x8796a5b4'

#   Failed test 'U8TO16_LE works as expected (hex bytes:a5 96)'
#   at t/hv_macro.t line 65.
#          got: '0xa596'
#     expected: '0x96a5'

#   Failed test 'U8TO32_LE works as expected (hex bytes:a5 96 87 f0)'
#   at t/hv_macro.t line 71.
#          got: '0xa59687f0'
#     expected: '0xf08796a5'

#   Failed test 'U8TO16_LE works as expected (hex bytes:96 87)'
#   at t/hv_macro.t line 65.
#          got: '0x9687'
#     expected: '0x8796'

#   Failed test 'U8TO32_LE works as expected (hex bytes:96 87 f0 e1)'
#   at t/hv_macro.t line 71.
#          got: '0x9687f0e1'
#     expected: '0xe1f08796'

#   Failed test 'U8TO16_LE works as expected (hex bytes:87 f0)'
#   at t/hv_macro.t line 65.
#          got: '0x87f0'
#     expected: '0xf087'

#   Failed test 'U8TO32_LE works as expected (hex bytes:87 f0 e1 d2)'
#   at t/hv_macro.t line 71.
#          got: '0x87f0e1d2'
#     expected: '0xd2e1f087'
# Looks like you failed 32 tests of 38.
make: *** [test_harness] Error 34

error while running harness target 'test_harness': 2 at /pro/3gl/CPAN/smoke/lib/Test/Smoke/App/RunSmoke.pm line 118.
[2020-03-25 16:39:58+0100] 
[2020-03-25 16:39:58+0100] ../dist/Devel-PPPort/t/exception.t..........................FAILED
[2020-03-25 16:39:58+0100]     Bad plan.  You planned 7 tests but ran 4.
[2020-03-25 16:39:58+0100] ../dist/IO/t/cachepropagate-unix.t..........................FAILED
[2020-03-25 16:39:58+0100]     2, 10
[2020-03-25 16:39:58+0100] ../dist/IO/t/cachepropagate-unix.t..........................FAILED
[2020-03-25 16:39:58+0100]     Non-zero exit status: 2
[2020-03-25 16:39:58+0100] ../dist/Net-Ping/t/450_service.t............................PASSED
[2020-03-25 16:39:58+0100]     9, 18
[2020-03-25 16:39:58+0100] ../ext/XS-APItest/t/exception.t.............................FAILED
[2020-03-25 16:39:58+0100]     Bad plan.  You planned 12 tests but ran 5.
[2020-03-25 16:39:58+0100] ../ext/XS-APItest/t/hv_macro.t..............................FAILED
[2020-03-25 16:39:58+0100]     2-33
[2020-03-25 16:39:58+0100] ../ext/XS-APItest/t/hv_macro.t..............................FAILED
[2020-03-25 16:39:58+0100]     Non-zero exit status: 32
[2020-03-25 16:39:58+0100] Archived results...
[2020-03-25 16:39:58+0100] TSTENV = perlio	

#   Failed test 'protocol defined'
#   at t/cachepropagate-unix.t line 54.

#   Failed test 'protocol defined'
#   at t/cachepropagate-unix.t line 109.
# Looks like you failed 2 tests of 15.

#   Failed test 'U8TO16_LE works as expected (hex bytes:12 34)'
#   at t/hv_macro.t line 65.
#          got: '0x1234'
#     expected: '0x3412'

#   Failed test 'U8TO32_LE works as expected (hex bytes:12 34 56 78)'
#   at t/hv_macro.t line 71.
#          got: '0x12345678'
#     expected: '0x78563412'

#   Failed test 'U8TO16_LE works as expected (hex bytes:34 56)'
#   at t/hv_macro.t line 65.
#          got: '0x3456'
#     expected: '0x5634'

#   Failed test 'U8TO32_LE works as expected (hex bytes:34 56 78 9a)'
#   at t/hv_macro.t line 71.
#          got: '0x3456789a'
#     expected: '0x9a785634'

#   Failed test 'U8TO16_LE works as expected (hex bytes:56 78)'
#   at t/hv_macro.t line 65.
#          got: '0x5678'
#     expected: '0x7856'

#   Failed test 'U8TO32_LE works as expected (hex bytes:56 78 9a bc)'
#   at t/hv_macro.t line 71.
#          got: '0x56789abc'
#     expected: '0xbc9a7856'

#   Failed test 'U8TO16_LE works as expected (hex bytes:78 9a)'
#   at t/hv_macro.t line 65.
#          got: '0x789a'
#     expected: '0x9a78'

#   Failed test 'U8TO32_LE works as expected (hex bytes:78 9a bc de)'
#   at t/hv_macro.t line 71.
#          got: '0x789abcde'
#     expected: '0xdebc9a78'

#   Failed test 'U8TO16_LE works as expected (hex bytes:9a bc)'
#   at t/hv_macro.t line 65.
#          got: '0x9abc'
#     expected: '0xbc9a'

#   Failed test 'U8TO32_LE works as expected (hex bytes:9a bc de f0)'
#   at t/hv_macro.t line 71.
#          got: '0x9abcdef0'
#     expected: '0xf0debc9a'

#   Failed test 'U8TO16_LE works as expected (hex bytes:bc de)'
#   at t/hv_macro.t line 65.
#          got: '0xbcde'
#     expected: '0xdebc'

#   Failed test 'U8TO32_LE works as expected (hex bytes:bc de f0 12)'
#   at t/hv_macro.t line 71.
#          got: '0xbcdef012'
#     expected: '0x12f0debc'

#   Failed test 'U8TO16_LE works as expected (hex bytes:de f0)'
#   at t/hv_macro.t line 65.
#          got: '0xdef0'
#     expected: '0xf0de'

#   Failed test 'U8TO32_LE works as expected (hex bytes:de f0 12 34)'
#   at t/hv_macro.t line 71.
#          got: '0xdef01234'
#     expected: '0x3412f0de'

#   Failed test 'U8TO16_LE works as expected (hex bytes:f0 12)'
#   at t/hv_macro.t line 65.
#          got: '0xf012'
#     expected: '0x12f0'

#   Failed test 'U8TO32_LE works as expected (hex bytes:f0 12 34 56)'
#   at t/hv_macro.t line 71.
#          got: '0xf0123456'
#     expected: '0x563412f0'

#   Failed test 'U8TO16_LE works as expected (hex bytes:f0 e1)'
#   at t/hv_macro.t line 65.
#          got: '0xf0e1'
#     expected: '0xe1f0'

#   Failed test 'U8TO32_LE works as expected (hex bytes:f0 e1 d2 c3)'
#   at t/hv_macro.t line 71.
#          got: '0xf0e1d2c3'
#     expected: '0xc3d2e1f0'

#   Failed test 'U8TO16_LE works as expected (hex bytes:e1 d2)'
#   at t/hv_macro.t line 65.
#          got: '0xe1d2'
#     expected: '0xd2e1'

#   Failed test 'U8TO32_LE works as expected (hex bytes:e1 d2 c3 b4)'
#   at t/hv_macro.t line 71.
#          got: '0xe1d2c3b4'
#     expected: '0xb4c3d2e1'

#   Failed test 'U8TO16_LE works as expected (hex bytes:d2 c3)'
#   at t/hv_macro.t line 65.
#          got: '0xd2c3'
#     expected: '0xc3d2'

#   Failed test 'U8TO32_LE works as expected (hex bytes:d2 c3 b4 a5)'
#   at t/hv_macro.t line 71.
#          got: '0xd2c3b4a5'
#     expected: '0xa5b4c3d2'

#   Failed test 'U8TO16_LE works as expected (hex bytes:c3 b4)'
#   at t/hv_macro.t line 65.
#          got: '0xc3b4'
#     expected: '0xb4c3'

#   Failed test 'U8TO32_LE works as expected (hex bytes:c3 b4 a5 96)'
#   at t/hv_macro.t line 71.
#          got: '0xc3b4a596'
#     expected: '0x96a5b4c3'

#   Failed test 'U8TO16_LE works as expected (hex bytes:b4 a5)'
#   at t/hv_macro.t line 65.
#          got: '0xb4a5'
#     expected: '0xa5b4'

#   Failed test 'U8TO32_LE works as expected (hex bytes:b4 a5 96 87)'
#   at t/hv_macro.t line 71.
#          got: '0xb4a59687'
#     expected: '0x8796a5b4'

#   Failed test 'U8TO16_LE works as expected (hex bytes:a5 96)'
#   at t/hv_macro.t line 65.
#          got: '0xa596'
#     expected: '0x96a5'

#   Failed test 'U8TO32_LE works as expected (hex bytes:a5 96 87 f0)'
#   at t/hv_macro.t line 71.
#          got: '0xa59687f0'
#     expected: '0xf08796a5'

#   Failed test 'U8TO16_LE works as expected (hex bytes:96 87)'
#   at t/hv_macro.t line 65.
#          got: '0x9687'
#     expected: '0x8796'

#   Failed test 'U8TO32_LE works as expected (hex bytes:96 87 f0 e1)'
#   at t/hv_macro.t line 71.
#          got: '0x9687f0e1'
#     expected: '0xe1f08796'

#   Failed test 'U8TO16_LE works as expected (hex bytes:87 f0)'
#   at t/hv_macro.t line 65.
#          got: '0x87f0'
#     expected: '0xf087'

#   Failed test 'U8TO32_LE works as expected (hex bytes:87 f0 e1 d2)'
#   at t/hv_macro.t line 71.
#          got: '0x87f0e1d2'
#     expected: '0xd2e1f087'
# Looks like you failed 32 tests of 38.
# Will use Digest::MD5
Cannot figure out an encoding to use at t/use-Encode-Alias.t line 5.
# Connected to 127.0.0.1
# Connected to 127.0.0.1
Integer overflow in hexadecimal number at t/broken_univ_can.t line 7.
make: *** [test_harness] Error 34

error while running harness target 'test_harness': 2 at /pro/3gl/CPAN/smoke/lib/Test/Smoke/App/RunSmoke.pm line 118.
[2020-03-25 17:10:21+0100] 
[2020-03-25 17:10:21+0100] ../dist/Devel-PPPort/t/exception.t..........................FAILED
[2020-03-25 17:10:21+0100]     Bad plan.  You planned 7 tests but ran 4.
[2020-03-25 17:10:21+0100] ../dist/IO/t/cachepropagate-unix.t..........................FAILED
[2020-03-25 17:10:21+0100]     2, 10
[2020-03-25 17:10:21+0100] ../dist/IO/t/cachepropagate-unix.t..........................FAILED
[2020-03-25 17:10:21+0100]     Non-zero exit status: 2
[2020-03-25 17:10:21+0100] ../dist/Net-Ping/t/450_service.t............................PASSED
[2020-03-25 17:10:21+0100]     9, 18
[2020-03-25 17:10:21+0100] ../ext/XS-APItest/t/exception.t.............................FAILED
[2020-03-25 17:10:21+0100]     Bad plan.  You planned 12 tests but ran 5.
[2020-03-25 17:10:21+0100] ../ext/XS-APItest/t/hv_macro.t..............................FAILED
[2020-03-25 17:10:21+0100]     2-33
[2020-03-25 17:10:21+0100] ../ext/XS-APItest/t/hv_macro.t..............................FAILED
[2020-03-25 17:10:21+0100]     Non-zero exit status: 32
[2020-03-25 17:10:21+0100] Archived results...
[2020-03-25 17:10:21+0100] TSTENV = locale:en_US.utf8	

#   Failed test 'protocol defined'
#   at t/cachepropagate-unix.t line 54.

#   Failed test 'protocol defined'
#   at t/cachepropagate-unix.t line 109.
# Looks like you failed 2 tests of 15.
Integer overflow in hexadecimal number at t/broken_univ_can.t line 7.
# Will use Digest::MD5

#   Failed test 'U8TO16_LE works as expected (hex bytes:12 34)'
#   at t/hv_macro.t line 65.
#          got: '0x1234'
#     expected: '0x3412'

#   Failed test 'U8TO32_LE works as expected (hex bytes:12 34 56 78)'
#   at t/hv_macro.t line 71.
#          got: '0x12345678'
#     expected: '0x78563412'

#   Failed test 'U8TO16_LE works as expected (hex bytes:34 56)'
#   at t/hv_macro.t line 65.
#          got: '0x3456'
#     expected: '0x5634'

#   Failed test 'U8TO32_LE works as expected (hex bytes:34 56 78 9a)'
#   at t/hv_macro.t line 71.
#          got: '0x3456789a'
#     expected: '0x9a785634'

#   Failed test 'U8TO16_LE works as expected (hex bytes:56 78)'
#   at t/hv_macro.t line 65.
#          got: '0x5678'
#     expected: '0x7856'

#   Failed test 'U8TO32_LE works as expected (hex bytes:56 78 9a bc)'
#   at t/hv_macro.t line 71.
#          got: '0x56789abc'
#     expected: '0xbc9a7856'

#   Failed test 'U8TO16_LE works as expected (hex bytes:78 9a)'
#   at t/hv_macro.t line 65.
#          got: '0x789a'
#     expected: '0x9a78'

#   Failed test 'U8TO32_LE works as expected (hex bytes:78 9a bc de)'
#   at t/hv_macro.t line 71.
#          got: '0x789abcde'
#     expected: '0xdebc9a78'

#   Failed test 'U8TO16_LE works as expected (hex bytes:9a bc)'
#   at t/hv_macro.t line 65.
#          got: '0x9abc'
#     expected: '0xbc9a'

#   Failed test 'U8TO32_LE works as expected (hex bytes:9a bc de f0)'
#   at t/hv_macro.t line 71.
#          got: '0x9abcdef0'
#     expected: '0xf0debc9a'

#   Failed test 'U8TO16_LE works as expected (hex bytes:bc de)'
#   at t/hv_macro.t line 65.
#          got: '0xbcde'
#     expected: '0xdebc'

#   Failed test 'U8TO32_LE works as expected (hex bytes:bc de f0 12)'
#   at t/hv_macro.t line 71.
#          got: '0xbcdef012'
#     expected: '0x12f0debc'

#   Failed test 'U8TO16_LE works as expected (hex bytes:de f0)'
#   at t/hv_macro.t line 65.
#          got: '0xdef0'
#     expected: '0xf0de'

#   Failed test 'U8TO32_LE works as expected (hex bytes:de f0 12 34)'
#   at t/hv_macro.t line 71.
#          got: '0xdef01234'
#     expected: '0x3412f0de'

#   Failed test 'U8TO16_LE works as expected (hex bytes:f0 12)'
#   at t/hv_macro.t line 65.
#          got: '0xf012'
#     expected: '0x12f0'

#   Failed test 'U8TO32_LE works as expected (hex bytes:f0 12 34 56)'
#   at t/hv_macro.t line 71.
#          got: '0xf0123456'
#     expected: '0x563412f0'

#   Failed test 'U8TO16_LE works as expected (hex bytes:f0 e1)'
#   at t/hv_macro.t line 65.
#          got: '0xf0e1'
#     expected: '0xe1f0'

#   Failed test 'U8TO32_LE works as expected (hex bytes:f0 e1 d2 c3)'
#   at t/hv_macro.t line 71.
#          got: '0xf0e1d2c3'
#     expected: '0xc3d2e1f0'

#   Failed test 'U8TO16_LE works as expected (hex bytes:e1 d2)'
#   at t/hv_macro.t line 65.
#          got: '0xe1d2'
#     expected: '0xd2e1'

#   Failed test 'U8TO32_LE works as expected (hex bytes:e1 d2 c3 b4)'
#   at t/hv_macro.t line 71.
#          got: '0xe1d2c3b4'
#     expected: '0xb4c3d2e1'

#   Failed test 'U8TO16_LE works as expected (hex bytes:d2 c3)'
#   at t/hv_macro.t line 65.
#          got: '0xd2c3'
#     expected: '0xc3d2'

#   Failed test 'U8TO32_LE works as expected (hex bytes:d2 c3 b4 a5)'
#   at t/hv_macro.t line 71.
#          got: '0xd2c3b4a5'
#     expected: '0xa5b4c3d2'

#   Failed test 'U8TO16_LE works as expected (hex bytes:c3 b4)'
#   at t/hv_macro.t line 65.
#          got: '0xc3b4'
#     expected: '0xb4c3'

#   Failed test 'U8TO32_LE works as expected (hex bytes:c3 b4 a5 96)'
#   at t/hv_macro.t line 71.
#          got: '0xc3b4a596'
#     expected: '0x96a5b4c3'

#   Failed test 'U8TO16_LE works as expected (hex bytes:b4 a5)'
#   at t/hv_macro.t line 65.
#          got: '0xb4a5'
#     expected: '0xa5b4'

#   Failed test 'U8TO32_LE works as expected (hex bytes:b4 a5 96 87)'
#   at t/hv_macro.t line 71.
#          got: '0xb4a59687'
#     expected: '0x8796a5b4'

#   Failed test 'U8TO16_LE works as expected (hex bytes:a5 96)'
#   at t/hv_macro.t line 65.
#          got: '0xa596'
#     expected: '0x96a5'

#   Failed test 'U8TO32_LE works as expected (hex bytes:a5 96 87 f0)'
#   at t/hv_macro.t line 71.
#          got: '0xa59687f0'
#     expected: '0xf08796a5'

#   Failed test 'U8TO16_LE works as expected (hex bytes:96 87)'
#   at t/hv_macro.t line 65.
#          got: '0x9687'
#     expected: '0x8796'

#   Failed test 'U8TO32_LE works as expected (hex bytes:96 87 f0 e1)'
#   at t/hv_macro.t line 71.
#          got: '0x9687f0e1'
#     expected: '0xe1f08796'

#   Failed test 'U8TO16_LE works as expected (hex bytes:87 f0)'
#   at t/hv_macro.t line 65.
#          got: '0x87f0'
#     expected: '0xf087'

#   Failed test 'U8TO32_LE works as expected (hex bytes:87 f0 e1 d2)'
#   at t/hv_macro.t line 71.
#          got: '0x87f0e1d2'
#     expected: '0xd2e1f087'
# Looks like you failed 32 tests of 38.
# Connected to 127.0.0.1
syswrite() isn't allowed on :utf8 handles at t/Socket.t line 47.
# Looks like your test exited with 255 just after 2.
make: *** [test_harness] Error 34

error while running harness target 'test_harness': 2 at /pro/3gl/CPAN/smoke/lib/Test/Smoke/App/RunSmoke.pm line 118.
[2020-03-25 17:40:34+0100] 
[2020-03-25 17:40:34+0100] ../dist/Devel-PPPort/t/exception.t..........................FAILED
[2020-03-25 17:40:34+0100]     Bad plan.  You planned 7 tests but ran 4.
[2020-03-25 17:40:34+0100] ../dist/IO/t/cachepropagate-unix.t..........................FAILED
[2020-03-25 17:40:34+0100]     2, 10
[2020-03-25 17:40:34+0100] ../dist/IO/t/cachepropagate-unix.t..........................FAILED
[2020-03-25 17:40:34+0100]     Non-zero exit status: 2
[2020-03-25 17:40:34+0100] ../dist/Net-Ping/t/450_service.t............................PASSED
[2020-03-25 17:40:34+0100]     9, 18
[2020-03-25 17:40:34+0100] ../ext/XS-APItest/t/exception.t.............................FAILED
[2020-03-25 17:40:34+0100]     Bad plan.  You planned 12 tests but ran 5.
[2020-03-25 17:40:34+0100] ../ext/XS-APItest/t/hv_macro.t..............................FAILED
[2020-03-25 17:40:34+0100]     2-33
[2020-03-25 17:40:34+0100] ../ext/XS-APItest/t/hv_macro.t..............................FAILED
[2020-03-25 17:40:34+0100]     Non-zero exit status: 32
[2020-03-25 17:40:34+0100] ../cpan/Socket/t/Socket.t...................................FAILED
[2020-03-25 17:40:34+0100]     Non-zero exit status: 255
[2020-03-25 17:40:34+0100] ../cpan/Socket/t/Socket.t...................................FAILED
[2020-03-25 17:40:34+0100]     Bad plan.  You planned 6 tests but ran 2.
[2020-03-25 17:40:34+0100] Archived results...
[2020-03-25 17:40:34+0100] Unskip tests from '/pro/3gl/CPAN/smoke/p59.skip'
[2020-03-25 17:40:34+0100] 
[2020-03-25 17:40:34+0100] Configuration: -Dcc=gcc -Dusedevel -Duseithreads -Duse64bitall
[2020-03-25 17:40:34+0100] ------------------------------------------------------------------------------
[2020-03-25 17:40:34+0100] make distclean ...
[2020-03-25 17:41:48+0100] 
[2020-03-25 17:41:48+0100] Copy Policy.sh ...
[2020-03-25 17:41:48+0100] 
[2020-03-25 17:41:48+0100] Configure ...
[2020-03-25 17:43:16+0100] 
[2020-03-25 17:43:16+0100] make ...
===== PROCURA Policy for hpux/ccache gcc ========================
===== PROCURA Policy results ============================
cc:         ccache gcc
ccversion:  -
gccversion: -
ccflags:    -mlp64 -fPIC 
optimize:   
ld:         
ldflags:    -mlp64 -L/pro/local/lib -L/usr/lib/hpux64
libswanted: cl pthread cl pthread socket bind inet nsl ndbm gdbm dbm db malloc dl ld sun m crypt sec util c cposix posix ucb bsd BSD
libsdirs:     /lib /pro/local/lib /usr/lib/hpux64
locincpth:  /pro/local/include
loclibpth:  /usr/lib/hpux64
useshrplib: 
===== PROCURA Policy done ===============================
[2020-03-25 17:59:24+0100] Skip tests from '/pro/3gl/CPAN/smoke/p59.skip'
[2020-03-25 17:59:24+0100] 
[2020-03-25 17:59:24+0100]  Tests start here:
[2020-03-25 17:59:24+0100] TSTENV = stdio	
op.c: In function 'Perl_ck_eval':
op.c:12772:9: warning: value computed is not used [-Wunused-value]
op.c: In function 'Perl_pmruntime':
op.c:7444:15: warning: 't_cp' may be used uninitialized in this function [-Wmaybe-uninitialized]
op.c:7038:14: note: 't_cp' was declared here
op.c:7481:28: warning: 'r_cp' may be used uninitialized in this function [-Wmaybe-uninitialized]
op.c:7038:8: note: 'r_cp' was declared here
pp.c: In function 'Perl_pp_argelem':
pp.c:7025:13: warning: value computed is not used [-Wunused-value]
time64.c: In function 'Perl_localtime64_r':
time64.c:573:30: warning: 'orig_year' may be used uninitialized in this function [-Wmaybe-uninitialized]
op.c: In function 'Perl_ck_eval':
op.c:12772:9: warning: value computed is not used [-Wunused-value]
op.c: In function 'Perl_pmruntime':
op.c:7444:15: warning: 't_cp' may be used uninitialized in this function [-Wmaybe-uninitialized]
op.c:7038:14: note: 't_cp' was declared here
op.c:7481:28: warning: 'r_cp' may be used uninitialized in this function [-Wmaybe-uninitialized]
op.c:7038:8: note: 'r_cp' was declared here
RealPPPort.xs: In function 'XS_Devel__PPPort_check_HeUTF8':
RealPPPort.xs:1990:17: warning: value computed is not used [-Wunused-value]
Opcode.xs: In function 'XS_Opcode_invert_opset':
Opcode.xs:363:2: warning: overflow in implicit constant conversion [-Woverflow]
Warning (mostly harmless): No library found for -lposix
Warning (mostly harmless): No library found for -lcposix
./const-xs.inc: In function 'boot_Socket':
./const-xs.inc:986:20: warning: missing braces around initializer [-Wmissing-braces]
./const-xs.inc:986:20: warning: (near initialization for 'ip6_address._s6_un') [-Wmissing-braces]
./const-xs.inc:995:20: warning: missing braces around initializer [-Wmissing-braces]
./const-xs.inc:995:20: warning: (near initialization for 'ip6_address._s6_un') [-Wmissing-braces]
In file included from HiRes.xs:1047:0:
const-c.inc: In function 'constant_19':
const-c.inc:351:42: warning: unused parameter 'iv_return' [-Wunused-parameter]
Making header files for XS...
re_exec.c: In function 'S_regtry':
re_exec.c:6539:30: warning: 'fold_array' may be used uninitialized in this function [-Wmaybe-uninitialized]
re_exec.c:6443:17: note: 'fold_array' was declared here
re_exec.c:6545:28: warning: 'folder' may be used uninitialized in this function [-Wmaybe-uninitialized]
re_exec.c:6442:16: note: 'folder' was declared here
shared.xs: In function 'sharedsv_scalar_store':
shared.xs:830:13: warning: value computed is not used [-Wunused-value]
No saved state, selection will be empty
Cannot figure out an encoding to use at t/use-Encode-Alias.t line 5.
# Connected to 127.0.0.1
# Connected to 127.0.0.1
Redefining sub xChild::foo at xChild--11458 line 2.
Redefining sub Data::ok at -e line 1.

#   Failed test 'protocol defined'
#   at t/cachepropagate-unix.t line 54.

#   Failed test 'protocol defined'
#   at t/cachepropagate-unix.t line 109.
# Looks like you failed 2 tests of 15.
# Will use Digest::MD5

#   Failed test 'U8TO16_LE works as expected (hex bytes:12 34)'
#   at t/hv_macro.t line 65.
#          got: '0x1234'
#     expected: '0x3412'

#   Failed test 'U8TO32_LE works as expected (hex bytes:12 34 56 78)'
#   at t/hv_macro.t line 71.
#          got: '0x12345678'
#     expected: '0x78563412'

#   Failed test 'U8TO64_LE works as expected (hex bytes:12 34 56 78 9a bc de f0)'
#   at t/hv_macro.t line 78.
#          got: '0x123456789abcdef0'
#     expected: '0xf0debc9a78563412'

#   Failed test 'U8TO16_LE works as expected (hex bytes:34 56)'
#   at t/hv_macro.t line 65.
#          got: '0x3456'
#     expected: '0x5634'

#   Failed test 'U8TO32_LE works as expected (hex bytes:34 56 78 9a)'
#   at t/hv_macro.t line 71.
#          got: '0x3456789a'
#     expected: '0x9a785634'

#   Failed test 'U8TO64_LE works as expected (hex bytes:34 56 78 9a bc de f0 12)'
#   at t/hv_macro.t line 78.
#          got: '0x3456789abcdef012'
#     expected: '0x12f0debc9a785634'

#   Failed test 'U8TO16_LE works as expected (hex bytes:56 78)'
#   at t/hv_macro.t line 65.
#          got: '0x5678'
#     expected: '0x7856'

#   Failed test 'U8TO32_LE works as expected (hex bytes:56 78 9a bc)'
#   at t/hv_macro.t line 71.
#          got: '0x56789abc'
#     expected: '0xbc9a7856'

#   Failed test 'U8TO64_LE works as expected (hex bytes:56 78 9a bc de f0 12 34)'
#   at t/hv_macro.t line 78.
#          got: '0x56789abcdef01234'
#     expected: '0x3412f0debc9a7856'

#   Failed test 'U8TO16_LE works as expected (hex bytes:78 9a)'
#   at t/hv_macro.t line 65.
#          got: '0x789a'
#     expected: '0x9a78'

#   Failed test 'U8TO32_LE works as expected (hex bytes:78 9a bc de)'
#   at t/hv_macro.t line 71.
#          got: '0x789abcde'
#     expected: '0xdebc9a78'

#   Failed test 'U8TO64_LE works as expected (hex bytes:78 9a bc de f0 12 34 56)'
#   at t/hv_macro.t line 78.
#          got: '0x789abcdef0123456'
#     expected: '0x563412f0debc9a78'

#   Failed test 'U8TO16_LE works as expected (hex bytes:9a bc)'
#   at t/hv_macro.t line 65.
#          got: '0x9abc'
#     expected: '0xbc9a'

#   Failed test 'U8TO32_LE works as expected (hex bytes:9a bc de f0)'
#   at t/hv_macro.t line 71.
#          got: '0x9abcdef0'
#     expected: '0xf0debc9a'

#   Failed test 'U8TO64_LE works as expected (hex bytes:9a bc de f0 12 34 56 78)'
#   at t/hv_macro.t line 78.
#          got: '0x9abcdef012345678'
#     expected: '0x78563412f0debc9a'

#   Failed test 'U8TO16_LE works as expected (hex bytes:bc de)'
#   at t/hv_macro.t line 65.
#          got: '0xbcde'
#     expected: '0xdebc'

#   Failed test 'U8TO32_LE works as expected (hex bytes:bc de f0 12)'
#   at t/hv_macro.t line 71.
#          got: '0xbcdef012'
#     expected: '0x12f0debc'

#   Failed test 'U8TO64_LE works as expected (hex bytes:bc de f0 12 34 56 78 9a)'
#   at t/hv_macro.t line 78.
#          got: '0xbcdef0123456789a'
#     expected: '0x9a78563412f0debc'

#   Failed test 'U8TO16_LE works as expected (hex bytes:de f0)'
#   at t/hv_macro.t line 65.
#          got: '0xdef0'
#     expected: '0xf0de'

#   Failed test 'U8TO32_LE works as expected (hex bytes:de f0 12 34)'
#   at t/hv_macro.t line 71.
#          got: '0xdef01234'
#     expected: '0x3412f0de'

#   Failed test 'U8TO64_LE works as expected (hex bytes:de f0 12 34 56 78 9a bc)'
#   at t/hv_macro.t line 78.
#          got: '0xdef0123456789abc'
#     expected: '0xbc9a78563412f0de'

#   Failed test 'U8TO16_LE works as expected (hex bytes:f0 12)'
#   at t/hv_macro.t line 65.
#          got: '0xf012'
#     expected: '0x12f0'

#   Failed test 'U8TO32_LE works as expected (hex bytes:f0 12 34 56)'
#   at t/hv_macro.t line 71.
#          got: '0xf0123456'
#     expected: '0x563412f0'

#   Failed test 'U8TO64_LE works as expected (hex bytes:f0 12 34 56 78 9a bc de)'
#   at t/hv_macro.t line 78.
#          got: '0xf0123456789abcde'
#     expected: '0xdebc9a78563412f0'

#   Failed test 'U8TO16_LE works as expected (hex bytes:f0 e1)'
#   at t/hv_macro.t line 65.
#          got: '0xf0e1'
#     expected: '0xe1f0'

#   Failed test 'U8TO32_LE works as expected (hex bytes:f0 e1 d2 c3)'
#   at t/hv_macro.t line 71.
#          got: '0xf0e1d2c3'
#     expected: '0xc3d2e1f0'

#   Failed test 'U8TO64_LE works as expected (hex bytes:f0 e1 d2 c3 b4 a5 96 87)'
#   at t/hv_macro.t line 78.
#          got: '0xf0e1d2c3b4a59687'
#     expected: '0x8796a5b4c3d2e1f0'

#   Failed test 'U8TO16_LE works as expected (hex bytes:e1 d2)'
#   at t/hv_macro.t line 65.
#          got: '0xe1d2'
#     expected: '0xd2e1'

#   Failed test 'U8TO32_LE works as expected (hex bytes:e1 d2 c3 b4)'
#   at t/hv_macro.t line 71.
#          got: '0xe1d2c3b4'
#     expected: '0xb4c3d2e1'

#   Failed test 'U8TO64_LE works as expected (hex bytes:e1 d2 c3 b4 a5 96 87 f0)'
#   at t/hv_macro.t line 78.
#          got: '0xe1d2c3b4a59687f0'
#     expected: '0xf08796a5b4c3d2e1'

#   Failed test 'U8TO16_LE works as expected (hex bytes:d2 c3)'
#   at t/hv_macro.t line 65.
#          got: '0xd2c3'
#     expected: '0xc3d2'

#   Failed test 'U8TO32_LE works as expected (hex bytes:d2 c3 b4 a5)'
#   at t/hv_macro.t line 71.
#          got: '0xd2c3b4a5'
#     expected: '0xa5b4c3d2'

#   Failed test 'U8TO64_LE works as expected (hex bytes:d2 c3 b4 a5 96 87 f0 e1)'
#   at t/hv_macro.t line 78.
#          got: '0xd2c3b4a59687f0e1'
#     expected: '0xe1f08796a5b4c3d2'

#   Failed test 'U8TO16_LE works as expected (hex bytes:c3 b4)'
#   at t/hv_macro.t line 65.
#          got: '0xc3b4'
#     expected: '0xb4c3'

#   Failed test 'U8TO32_LE works as expected (hex bytes:c3 b4 a5 96)'
#   at t/hv_macro.t line 71.
#          got: '0xc3b4a596'
#     expected: '0x96a5b4c3'

#   Failed test 'U8TO64_LE works as expected (hex bytes:c3 b4 a5 96 87 f0 e1 d2)'
#   at t/hv_macro.t line 78.
#          got: '0xc3b4a59687f0e1d2'
#     expected: '0xd2e1f08796a5b4c3'

#   Failed test 'U8TO16_LE works as expected (hex bytes:b4 a5)'
#   at t/hv_macro.t line 65.
#          got: '0xb4a5'
#     expected: '0xa5b4'

#   Failed test 'U8TO32_LE works as expected (hex bytes:b4 a5 96 87)'
#   at t/hv_macro.t line 71.
#          got: '0xb4a59687'
#     expected: '0x8796a5b4'

#   Failed test 'U8TO64_LE works as expected (hex bytes:b4 a5 96 87 f0 e1 d2 c3)'
#   at t/hv_macro.t line 78.
#          got: '0xb4a59687f0e1d2c3'
#     expected: '0xc3d2e1f08796a5b4'

#   Failed test 'U8TO16_LE works as expected (hex bytes:a5 96)'
#   at t/hv_macro.t line 65.
#          got: '0xa596'
#     expected: '0x96a5'

#   Failed test 'U8TO32_LE works as expected (hex bytes:a5 96 87 f0)'
#   at t/hv_macro.t line 71.
#          got: '0xa59687f0'
#     expected: '0xf08796a5'

#   Failed test 'U8TO64_LE works as expected (hex bytes:a5 96 87 f0 e1 d2 c3 b4)'
#   at t/hv_macro.t line 78.
#          got: '0xa59687f0e1d2c3b4'
#     expected: '0xb4c3d2e1f08796a5'

#   Failed test 'U8TO16_LE works as expected (hex bytes:96 87)'
#   at t/hv_macro.t line 65.
#          got: '0x9687'
#     expected: '0x8796'

#   Failed test 'U8TO32_LE works as expected (hex bytes:96 87 f0 e1)'
#   at t/hv_macro.t line 71.
#          got: '0x9687f0e1'
#     expected: '0xe1f08796'

#   Failed test 'U8TO64_LE works as expected (hex bytes:96 87 f0 e1 d2 c3 b4 a5)'
#   at t/hv_macro.t line 78.
#          got: '0x9687f0e1d2c3b4a5'
#     expected: '0xa5b4c3d2e1f08796'

#   Failed test 'U8TO16_LE works as expected (hex bytes:87 f0)'
#   at t/hv_macro.t line 65.
#          got: '0x87f0'
#     expected: '0xf087'

#   Failed test 'U8TO32_LE works as expected (hex bytes:87 f0 e1 d2)'
#   at t/hv_macro.t line 71.
#          got: '0x87f0e1d2'
#     expected: '0xd2e1f087'

#   Failed test 'U8TO64_LE works as expected (hex bytes:87 f0 e1 d2 c3 b4 a5 96)'
#   at t/hv_macro.t line 78.
#          got: '0x87f0e1d2c3b4a596'
#     expected: '0x96a5b4c3d2e1f087'

#   Failed test 'Siphash24 seems to work'
#   at t/hv_macro.t line 207.
#          got: '6c021bba2aad2555'
#     expected: '71a11e065cefc12c'

#   Failed test 'Siphash13 seems to work'
#   at t/hv_macro.t line 213.
#          got: 'e33b5015709212d2'
#     expected: 'adee71f47e49757a'

#   Failed test 'siphash24 test vectors check'
#   at t/hv_macro.t line 219.
#          got: '128'
#     expected: '0'

#   Failed test 'siphash13 test vectors check'
#   at t/hv_macro.t line 220.
#          got: '128'
#     expected: '0'
# Looks like you failed 52 tests of 63.
make: *** [test_harness] Error 52

error while running harness target 'test_harness': 2 at /pro/3gl/CPAN/smoke/lib/Test/Smoke/App/RunSmoke.pm line 118.
[2020-03-25 18:19:32+0100] 
[2020-03-25 18:19:32+0100] ../dist/IO/t/cachepropagate-unix.t..........................FAILED
[2020-03-25 18:19:32+0100]     2, 10
[2020-03-25 18:19:32+0100] ../dist/IO/t/cachepropagate-unix.t..........................FAILED
[2020-03-25 18:19:32+0100]     Non-zero exit status: 2
[2020-03-25 18:19:32+0100] ../dist/Net-Ping/t/450_service.t............................PASSED
[2020-03-25 18:19:32+0100]     9, 18
[2020-03-25 18:19:32+0100] ../ext/XS-APItest/t/hv_macro.t..............................FAILED
[2020-03-25 18:19:32+0100]     2-49, 60-61
[2020-03-25 18:19:32+0100] ../ext/XS-APItest/t/hv_macro.t..............................FAILED
[2020-03-25 18:19:32+0100]     Non-zero exit status: 52
[2020-03-25 18:19:32+0100] ../ext/XS-APItest/t/hv_macro.t..............................FAILED
[2020-03-25 18:19:32+0100]     Bad plan.  You planned 63 tests but ran 61.
[2020-03-25 18:19:32+0100] Archived results...
[2020-03-25 18:19:32+0100] TSTENV = perlio	

#   Failed test 'protocol defined'
#   at t/cachepropagate-unix.t line 54.

#   Failed test 'protocol defined'
#   at t/cachepropagate-unix.t line 109.
# Looks like you failed 2 tests of 15.

#   Failed test 'U8TO16_LE works as expected (hex bytes:12 34)'
#   at t/hv_macro.t line 65.
#          got: '0x1234'
#     expected: '0x3412'

#   Failed test 'U8TO32_LE works as expected (hex bytes:12 34 56 78)'
#   at t/hv_macro.t line 71.
#          got: '0x12345678'
#     expected: '0x78563412'

#   Failed test 'U8TO64_LE works as expected (hex bytes:12 34 56 78 9a bc de f0)'
#   at t/hv_macro.t line 78.
#          got: '0x123456789abcdef0'
#     expected: '0xf0debc9a78563412'

#   Failed test 'U8TO16_LE works as expected (hex bytes:34 56)'
#   at t/hv_macro.t line 65.
#          got: '0x3456'
#     expected: '0x5634'

#   Failed test 'U8TO32_LE works as expected (hex bytes:34 56 78 9a)'
#   at t/hv_macro.t line 71.
#          got: '0x3456789a'
#     expected: '0x9a785634'

#   Failed test 'U8TO64_LE works as expected (hex bytes:34 56 78 9a bc de f0 12)'
#   at t/hv_macro.t line 78.
#          got: '0x3456789abcdef012'
#     expected: '0x12f0debc9a785634'

#   Failed test 'U8TO16_LE works as expected (hex bytes:56 78)'
#   at t/hv_macro.t line 65.
#          got: '0x5678'
#     expected: '0x7856'

#   Failed test 'U8TO32_LE works as expected (hex bytes:56 78 9a bc)'
#   at t/hv_macro.t line 71.
#          got: '0x56789abc'
#     expected: '0xbc9a7856'

#   Failed test 'U8TO64_LE works as expected (hex bytes:56 78 9a bc de f0 12 34)'
#   at t/hv_macro.t line 78.
#          got: '0x56789abcdef01234'
#     expected: '0x3412f0debc9a7856'

#   Failed test 'U8TO16_LE works as expected (hex bytes:78 9a)'
#   at t/hv_macro.t line 65.
#          got: '0x789a'
#     expected: '0x9a78'

#   Failed test 'U8TO32_LE works as expected (hex bytes:78 9a bc de)'
#   at t/hv_macro.t line 71.
#          got: '0x789abcde'
#     expected: '0xdebc9a78'

#   Failed test 'U8TO64_LE works as expected (hex bytes:78 9a bc de f0 12 34 56)'
#   at t/hv_macro.t line 78.
#          got: '0x789abcdef0123456'
#     expected: '0x563412f0debc9a78'

#   Failed test 'U8TO16_LE works as expected (hex bytes:9a bc)'
#   at t/hv_macro.t line 65.
#          got: '0x9abc'
#     expected: '0xbc9a'

#   Failed test 'U8TO32_LE works as expected (hex bytes:9a bc de f0)'
#   at t/hv_macro.t line 71.
#          got: '0x9abcdef0'
#     expected: '0xf0debc9a'

#   Failed test 'U8TO64_LE works as expected (hex bytes:9a bc de f0 12 34 56 78)'
#   at t/hv_macro.t line 78.
#          got: '0x9abcdef012345678'
#     expected: '0x78563412f0debc9a'

#   Failed test 'U8TO16_LE works as expected (hex bytes:bc de)'
#   at t/hv_macro.t line 65.
#          got: '0xbcde'
#     expected: '0xdebc'

#   Failed test 'U8TO32_LE works as expected (hex bytes:bc de f0 12)'
#   at t/hv_macro.t line 71.
#          got: '0xbcdef012'
#     expected: '0x12f0debc'

#   Failed test 'U8TO64_LE works as expected (hex bytes:bc de f0 12 34 56 78 9a)'
#   at t/hv_macro.t line 78.
#          got: '0xbcdef0123456789a'
#     expected: '0x9a78563412f0debc'

#   Failed test 'U8TO16_LE works as expected (hex bytes:de f0)'
#   at t/hv_macro.t line 65.
#          got: '0xdef0'
#     expected: '0xf0de'

#   Failed test 'U8TO32_LE works as expected (hex bytes:de f0 12 34)'
#   at t/hv_macro.t line 71.
#          got: '0xdef01234'
#     expected: '0x3412f0de'

#   Failed test 'U8TO64_LE works as expected (hex bytes:de f0 12 34 56 78 9a bc)'
#   at t/hv_macro.t line 78.
#          got: '0xdef0123456789abc'
#     expected: '0xbc9a78563412f0de'

#   Failed test 'U8TO16_LE works as expected (hex bytes:f0 12)'
#   at t/hv_macro.t line 65.
#          got: '0xf012'
#     expected: '0x12f0'

#   Failed test 'U8TO32_LE works as expected (hex bytes:f0 12 34 56)'
#   at t/hv_macro.t line 71.
#          got: '0xf0123456'
#     expected: '0x563412f0'

#   Failed test 'U8TO64_LE works as expected (hex bytes:f0 12 34 56 78 9a bc de)'
#   at t/hv_macro.t line 78.
#          got: '0xf0123456789abcde'
#     expected: '0xdebc9a78563412f0'

#   Failed test 'U8TO16_LE works as expected (hex bytes:f0 e1)'
#   at t/hv_macro.t line 65.
#          got: '0xf0e1'
#     expected: '0xe1f0'

#   Failed test 'U8TO32_LE works as expected (hex bytes:f0 e1 d2 c3)'
#   at t/hv_macro.t line 71.
#          got: '0xf0e1d2c3'
#     expected: '0xc3d2e1f0'

#   Failed test 'U8TO64_LE works as expected (hex bytes:f0 e1 d2 c3 b4 a5 96 87)'
#   at t/hv_macro.t line 78.
#          got: '0xf0e1d2c3b4a59687'
#     expected: '0x8796a5b4c3d2e1f0'

#   Failed test 'U8TO16_LE works as expected (hex bytes:e1 d2)'
#   at t/hv_macro.t line 65.
#          got: '0xe1d2'
#     expected: '0xd2e1'

#   Failed test 'U8TO32_LE works as expected (hex bytes:e1 d2 c3 b4)'
#   at t/hv_macro.t line 71.
#          got: '0xe1d2c3b4'
#     expected: '0xb4c3d2e1'

#   Failed test 'U8TO64_LE works as expected (hex bytes:e1 d2 c3 b4 a5 96 87 f0)'
#   at t/hv_macro.t line 78.
#          got: '0xe1d2c3b4a59687f0'
#     expected: '0xf08796a5b4c3d2e1'

#   Failed test 'U8TO16_LE works as expected (hex bytes:d2 c3)'
#   at t/hv_macro.t line 65.
#          got: '0xd2c3'
#     expected: '0xc3d2'

#   Failed test 'U8TO32_LE works as expected (hex bytes:d2 c3 b4 a5)'
#   at t/hv_macro.t line 71.
#          got: '0xd2c3b4a5'
#     expected: '0xa5b4c3d2'

#   Failed test 'U8TO64_LE works as expected (hex bytes:d2 c3 b4 a5 96 87 f0 e1)'
#   at t/hv_macro.t line 78.
#          got: '0xd2c3b4a59687f0e1'
#     expected: '0xe1f08796a5b4c3d2'

#   Failed test 'U8TO16_LE works as expected (hex bytes:c3 b4)'
#   at t/hv_macro.t line 65.
#          got: '0xc3b4'
#     expected: '0xb4c3'

#   Failed test 'U8TO32_LE works as expected (hex bytes:c3 b4 a5 96)'
#   at t/hv_macro.t line 71.
#          got: '0xc3b4a596'
#     expected: '0x96a5b4c3'

#   Failed test 'U8TO64_LE works as expected (hex bytes:c3 b4 a5 96 87 f0 e1 d2)'
#   at t/hv_macro.t line 78.
#          got: '0xc3b4a59687f0e1d2'
#     expected: '0xd2e1f08796a5b4c3'

#   Failed test 'U8TO16_LE works as expected (hex bytes:b4 a5)'
#   at t/hv_macro.t line 65.
#          got: '0xb4a5'
#     expected: '0xa5b4'

#   Failed test 'U8TO32_LE works as expected (hex bytes:b4 a5 96 87)'
#   at t/hv_macro.t line 71.
#          got: '0xb4a59687'
#     expected: '0x8796a5b4'

#   Failed test 'U8TO64_LE works as expected (hex bytes:b4 a5 96 87 f0 e1 d2 c3)'
#   at t/hv_macro.t line 78.
#          got: '0xb4a59687f0e1d2c3'
#     expected: '0xc3d2e1f08796a5b4'

#   Failed test 'U8TO16_LE works as expected (hex bytes:a5 96)'
#   at t/hv_macro.t line 65.
#          got: '0xa596'
#     expected: '0x96a5'

#   Failed test 'U8TO32_LE works as expected (hex bytes:a5 96 87 f0)'
#   at t/hv_macro.t line 71.
#          got: '0xa59687f0'
#     expected: '0xf08796a5'

#   Failed test 'U8TO64_LE works as expected (hex bytes:a5 96 87 f0 e1 d2 c3 b4)'
#   at t/hv_macro.t line 78.
#          got: '0xa59687f0e1d2c3b4'
#     expected: '0xb4c3d2e1f08796a5'

#   Failed test 'U8TO16_LE works as expected (hex bytes:96 87)'
#   at t/hv_macro.t line 65.
#          got: '0x9687'
#     expected: '0x8796'

#   Failed test 'U8TO32_LE works as expected (hex bytes:96 87 f0 e1)'
#   at t/hv_macro.t line 71.
#          got: '0x9687f0e1'
#     expected: '0xe1f08796'

#   Failed test 'U8TO64_LE works as expected (hex bytes:96 87 f0 e1 d2 c3 b4 a5)'
#   at t/hv_macro.t line 78.
#          got: '0x9687f0e1d2c3b4a5'
#     expected: '0xa5b4c3d2e1f08796'

#   Failed test 'U8TO16_LE works as expected (hex bytes:87 f0)'
#   at t/hv_macro.t line 65.
#          got: '0x87f0'
#     expected: '0xf087'

#   Failed test 'U8TO32_LE works as expected (hex bytes:87 f0 e1 d2)'
#   at t/hv_macro.t line 71.
#          got: '0x87f0e1d2'
#     expected: '0xd2e1f087'

#   Failed test 'U8TO64_LE works as expected (hex bytes:87 f0 e1 d2 c3 b4 a5 96)'
#   at t/hv_macro.t line 78.
#          got: '0x87f0e1d2c3b4a596'
#     expected: '0x96a5b4c3d2e1f087'

#   Failed test 'Siphash24 seems to work'
#   at t/hv_macro.t line 207.
#          got: '6c021bba2aad2555'
#     expected: '71a11e065cefc12c'

#   Failed test 'Siphash13 seems to work'
#   at t/hv_macro.t line 213.
#          got: 'e33b5015709212d2'
#     expected: 'adee71f47e49757a'

#   Failed test 'siphash24 test vectors check'
#   at t/hv_macro.t line 219.
#          got: '128'
#     expected: '0'

#   Failed test 'siphash13 test vectors check'
#   at t/hv_macro.t line 220.
#          got: '128'
#     expected: '0'
# Looks like you failed 52 tests of 63.
# Will use Digest::MD5
# Connected to 127.0.0.1
# Connected to 127.0.0.1
Cannot figure out an encoding to use at t/use-Encode-Alias.t line 5.
make: *** [test_harness] Error 52

error while running harness target 'test_harness': 2 at /pro/3gl/CPAN/smoke/lib/Test/Smoke/App/RunSmoke.pm line 118.
[2020-03-25 18:36:57+0100] 
[2020-03-25 18:36:57+0100] ../dist/IO/t/cachepropagate-unix.t..........................FAILED
[2020-03-25 18:36:57+0100]     2, 10
[2020-03-25 18:36:57+0100] ../dist/IO/t/cachepropagate-unix.t..........................FAILED
[2020-03-25 18:36:57+0100]     Non-zero exit status: 2
[2020-03-25 18:36:57+0100] ../dist/Net-Ping/t/450_service.t............................PASSED
[2020-03-25 18:36:57+0100]     9, 18
[2020-03-25 18:36:57+0100] ../ext/XS-APItest/t/hv_macro.t..............................FAILED
[2020-03-25 18:36:57+0100]     2-49, 60-61
[2020-03-25 18:36:57+0100] ../ext/XS-APItest/t/hv_macro.t..............................FAILED
[2020-03-25 18:36:57+0100]     Non-zero exit status: 52
[2020-03-25 18:36:57+0100] ../ext/XS-APItest/t/hv_macro.t..............................FAILED
[2020-03-25 18:36:57+0100]     Bad plan.  You planned 63 tests but ran 61.
[2020-03-25 18:36:57+0100] Archived results...
[2020-03-25 18:36:57+0100] TSTENV = locale:en_US.utf8	

#   Failed test 'protocol defined'
#   at t/cachepropagate-unix.t line 54.

#   Failed test 'protocol defined'
#   at t/cachepropagate-unix.t line 109.
# Looks like you failed 2 tests of 15.

#   Failed test 'U8TO16_LE works as expected (hex bytes:12 34)'
#   at t/hv_macro.t line 65.
#          got: '0x1234'
#     expected: '0x3412'

#   Failed test 'U8TO32_LE works as expected (hex bytes:12 34 56 78)'
#   at t/hv_macro.t line 71.
#          got: '0x12345678'
#     expected: '0x78563412'

#   Failed test 'U8TO64_LE works as expected (hex bytes:12 34 56 78 9a bc de f0)'
#   at t/hv_macro.t line 78.
#          got: '0x123456789abcdef0'
#     expected: '0xf0debc9a78563412'

#   Failed test 'U8TO16_LE works as expected (hex bytes:34 56)'
#   at t/hv_macro.t line 65.
#          got: '0x3456'
#     expected: '0x5634'

#   Failed test 'U8TO32_LE works as expected (hex bytes:34 56 78 9a)'
#   at t/hv_macro.t line 71.
#          got: '0x3456789a'
#     expected: '0x9a785634'

#   Failed test 'U8TO64_LE works as expected (hex bytes:34 56 78 9a bc de f0 12)'
#   at t/hv_macro.t line 78.
#          got: '0x3456789abcdef012'
#     expected: '0x12f0debc9a785634'

#   Failed test 'U8TO16_LE works as expected (hex bytes:56 78)'
#   at t/hv_macro.t line 65.
#          got: '0x5678'
#     expected: '0x7856'

#   Failed test 'U8TO32_LE works as expected (hex bytes:56 78 9a bc)'
#   at t/hv_macro.t line 71.
#          got: '0x56789abc'
#     expected: '0xbc9a7856'

#   Failed test 'U8TO64_LE works as expected (hex bytes:56 78 9a bc de f0 12 34)'
#   at t/hv_macro.t line 78.
#          got: '0x56789abcdef01234'
#     expected: '0x3412f0debc9a7856'

#   Failed test 'U8TO16_LE works as expected (hex bytes:78 9a)'
#   at t/hv_macro.t line 65.
#          got: '0x789a'
#     expected: '0x9a78'

#   Failed test 'U8TO32_LE works as expected (hex bytes:78 9a bc de)'
#   at t/hv_macro.t line 71.
#          got: '0x789abcde'
#     expected: '0xdebc9a78'

#   Failed test 'U8TO64_LE works as expected (hex bytes:78 9a bc de f0 12 34 56)'
#   at t/hv_macro.t line 78.
#          got: '0x789abcdef0123456'
#     expected: '0x563412f0debc9a78'

#   Failed test 'U8TO16_LE works as expected (hex bytes:9a bc)'
#   at t/hv_macro.t line 65.
#          got: '0x9abc'
#     expected: '0xbc9a'

#   Failed test 'U8TO32_LE works as expected (hex bytes:9a bc de f0)'
#   at t/hv_macro.t line 71.
#          got: '0x9abcdef0'
#     expected: '0xf0debc9a'

#   Failed test 'U8TO64_LE works as expected (hex bytes:9a bc de f0 12 34 56 78)'
#   at t/hv_macro.t line 78.
#          got: '0x9abcdef012345678'
#     expected: '0x78563412f0debc9a'

#   Failed test 'U8TO16_LE works as expected (hex bytes:bc de)'
#   at t/hv_macro.t line 65.
#          got: '0xbcde'
#     expected: '0xdebc'

#   Failed test 'U8TO32_LE works as expected (hex bytes:bc de f0 12)'
#   at t/hv_macro.t line 71.
#          got: '0xbcdef012'
#     expected: '0x12f0debc'

#   Failed test 'U8TO64_LE works as expected (hex bytes:bc de f0 12 34 56 78 9a)'
#   at t/hv_macro.t line 78.
#          got: '0xbcdef0123456789a'
#     expected: '0x9a78563412f0debc'

#   Failed test 'U8TO16_LE works as expected (hex bytes:de f0)'
#   at t/hv_macro.t line 65.
#          got: '0xdef0'
#     expected: '0xf0de'

#   Failed test 'U8TO32_LE works as expected (hex bytes:de f0 12 34)'
#   at t/hv_macro.t line 71.
#          got: '0xdef01234'
#     expected: '0x3412f0de'

#   Failed test 'U8TO64_LE works as expected (hex bytes:de f0 12 34 56 78 9a bc)'
#   at t/hv_macro.t line 78.
#          got: '0xdef0123456789abc'
#     expected: '0xbc9a78563412f0de'

#   Failed test 'U8TO16_LE works as expected (hex bytes:f0 12)'
#   at t/hv_macro.t line 65.
#          got: '0xf012'
#     expected: '0x12f0'

#   Failed test 'U8TO32_LE works as expected (hex bytes:f0 12 34 56)'
#   at t/hv_macro.t line 71.
#          got: '0xf0123456'
#     expected: '0x563412f0'

#   Failed test 'U8TO64_LE works as expected (hex bytes:f0 12 34 56 78 9a bc de)'
#   at t/hv_macro.t line 78.
#          got: '0xf0123456789abcde'
#     expected: '0xdebc9a78563412f0'

#   Failed test 'U8TO16_LE works as expected (hex bytes:f0 e1)'
#   at t/hv_macro.t line 65.
#          got: '0xf0e1'
#     expected: '0xe1f0'

#   Failed test 'U8TO32_LE works as expected (hex bytes:f0 e1 d2 c3)'
#   at t/hv_macro.t line 71.
#          got: '0xf0e1d2c3'
#     expected: '0xc3d2e1f0'

#   Failed test 'U8TO64_LE works as expected (hex bytes:f0 e1 d2 c3 b4 a5 96 87)'
#   at t/hv_macro.t line 78.
#          got: '0xf0e1d2c3b4a59687'
#     expected: '0x8796a5b4c3d2e1f0'

#   Failed test 'U8TO16_LE works as expected (hex bytes:e1 d2)'
#   at t/hv_macro.t line 65.
#          got: '0xe1d2'
#     expected: '0xd2e1'

#   Failed test 'U8TO32_LE works as expected (hex bytes:e1 d2 c3 b4)'
#   at t/hv_macro.t line 71.
#          got: '0xe1d2c3b4'
#     expected: '0xb4c3d2e1'

#   Failed test 'U8TO64_LE works as expected (hex bytes:e1 d2 c3 b4 a5 96 87 f0)'
#   at t/hv_macro.t line 78.
#          got: '0xe1d2c3b4a59687f0'
#     expected: '0xf08796a5b4c3d2e1'

#   Failed test 'U8TO16_LE works as expected (hex bytes:d2 c3)'
#   at t/hv_macro.t line 65.
#          got: '0xd2c3'
#     expected: '0xc3d2'

#   Failed test 'U8TO32_LE works as expected (hex bytes:d2 c3 b4 a5)'
#   at t/hv_macro.t line 71.
#          got: '0xd2c3b4a5'
#     expected: '0xa5b4c3d2'

#   Failed test 'U8TO64_LE works as expected (hex bytes:d2 c3 b4 a5 96 87 f0 e1)'
#   at t/hv_macro.t line 78.
#          got: '0xd2c3b4a59687f0e1'
#     expected: '0xe1f08796a5b4c3d2'

#   Failed test 'U8TO16_LE works as expected (hex bytes:c3 b4)'
#   at t/hv_macro.t line 65.
#          got: '0xc3b4'
#     expected: '0xb4c3'

#   Failed test 'U8TO32_LE works as expected (hex bytes:c3 b4 a5 96)'
#   at t/hv_macro.t line 71.
#          got: '0xc3b4a596'
#     expected: '0x96a5b4c3'

#   Failed test 'U8TO64_LE works as expected (hex bytes:c3 b4 a5 96 87 f0 e1 d2)'
#   at t/hv_macro.t line 78.
#          got: '0xc3b4a59687f0e1d2'
#     expected: '0xd2e1f08796a5b4c3'

#   Failed test 'U8TO16_LE works as expected (hex bytes:b4 a5)'
#   at t/hv_macro.t line 65.
#          got: '0xb4a5'
#     expected: '0xa5b4'

#   Failed test 'U8TO32_LE works as expected (hex bytes:b4 a5 96 87)'
#   at t/hv_macro.t line 71.
#          got: '0xb4a59687'
#     expected: '0x8796a5b4'

#   Failed test 'U8TO64_LE works as expected (hex bytes:b4 a5 96 87 f0 e1 d2 c3)'
#   at t/hv_macro.t line 78.
#          got: '0xb4a59687f0e1d2c3'
#     expected: '0xc3d2e1f08796a5b4'

#   Failed test 'U8TO16_LE works as expected (hex bytes:a5 96)'
#   at t/hv_macro.t line 65.
#          got: '0xa596'
#     expected: '0x96a5'

#   Failed test 'U8TO32_LE works as expected (hex bytes:a5 96 87 f0)'
#   at t/hv_macro.t line 71.
#          got: '0xa59687f0'
#     expected: '0xf08796a5'

#   Failed test 'U8TO64_LE works as expected (hex bytes:a5 96 87 f0 e1 d2 c3 b4)'
#   at t/hv_macro.t line 78.
#          got: '0xa59687f0e1d2c3b4'
#     expected: '0xb4c3d2e1f08796a5'

#   Failed test 'U8TO16_LE works as expected (hex bytes:96 87)'
#   at t/hv_macro.t line 65.
#          got: '0x9687'
#     expected: '0x8796'

#   Failed test 'U8TO32_LE works as expected (hex bytes:96 87 f0 e1)'
#   at t/hv_macro.t line 71.
#          got: '0x9687f0e1'
#     expected: '0xe1f08796'

#   Failed test 'U8TO64_LE works as expected (hex bytes:96 87 f0 e1 d2 c3 b4 a5)'
#   at t/hv_macro.t line 78.
#          got: '0x9687f0e1d2c3b4a5'
#     expected: '0xa5b4c3d2e1f08796'

#   Failed test 'U8TO16_LE works as expected (hex bytes:87 f0)'
#   at t/hv_macro.t line 65.
#          got: '0x87f0'
#     expected: '0xf087'

#   Failed test 'U8TO32_LE works as expected (hex bytes:87 f0 e1 d2)'
#   at t/hv_macro.t line 71.
#          got: '0x87f0e1d2'
#     expected: '0xd2e1f087'

#   Failed test 'U8TO64_LE works as expected (hex bytes:87 f0 e1 d2 c3 b4 a5 96)'
#   at t/hv_macro.t line 78.
#          got: '0x87f0e1d2c3b4a596'
#     expected: '0x96a5b4c3d2e1f087'

#   Failed test 'Siphash24 seems to work'
#   at t/hv_macro.t line 207.
#          got: '6c021bba2aad2555'
#     expected: '71a11e065cefc12c'

#   Failed test 'Siphash13 seems to work'
#   at t/hv_macro.t line 213.
#          got: 'e33b5015709212d2'
#     expected: 'adee71f47e49757a'

#   Failed test 'siphash24 test vectors check'
#   at t/hv_macro.t line 219.
#          got: '128'
#     expected: '0'

#   Failed test 'siphash13 test vectors check'
#   at t/hv_macro.t line 220.
#          got: '128'
#     expected: '0'
# Looks like you failed 52 tests of 63.
# Will use Digest::MD5
# Connected to 127.0.0.1
syswrite() isn't allowed on :utf8 handles at t/Socket.t line 47.
# Looks like your test exited with 255 just after 2.
make: *** [test_harness] Error 52

error while running harness target 'test_harness': 2 at /pro/3gl/CPAN/smoke/lib/Test/Smoke/App/RunSmoke.pm line 118.
[2020-03-25 18:54:32+0100] 
[2020-03-25 18:54:32+0100] ../dist/IO/t/cachepropagate-unix.t..........................FAILED
[2020-03-25 18:54:32+0100]     2, 10
[2020-03-25 18:54:32+0100] ../dist/IO/t/cachepropagate-unix.t..........................FAILED
[2020-03-25 18:54:32+0100]     Non-zero exit status: 2
[2020-03-25 18:54:32+0100] ../dist/Net-Ping/t/450_service.t............................PASSED
[2020-03-25 18:54:32+0100]     9, 18
[2020-03-25 18:54:32+0100] ../ext/XS-APItest/t/hv_macro.t..............................FAILED
[2020-03-25 18:54:32+0100]     2-49, 60-61
[2020-03-25 18:54:32+0100] ../ext/XS-APItest/t/hv_macro.t..............................FAILED
[2020-03-25 18:54:32+0100]     Non-zero exit status: 52
[2020-03-25 18:54:32+0100] ../ext/XS-APItest/t/hv_macro.t..............................FAILED
[2020-03-25 18:54:32+0100]     Bad plan.  You planned 63 tests but ran 61.
[2020-03-25 18:54:32+0100] ../cpan/Socket/t/Socket.t...................................FAILED
[2020-03-25 18:54:32+0100]     Non-zero exit status: 255
[2020-03-25 18:54:32+0100] ../cpan/Socket/t/Socket.t...................................FAILED
[2020-03-25 18:54:32+0100]     Bad plan.  You planned 6 tests but ran 2.
[2020-03-25 18:54:32+0100] Archived results...
[2020-03-25 18:54:32+0100] Unskip tests from '/pro/3gl/CPAN/smoke/p59.skip'
[2020-03-25 18:54:32+0100] 
[2020-03-25 18:54:32+0100] Configuration: -Dcc=gcc -Dusedevel -Duseithreads -Duse64bitall -DDEBUGGING
[2020-03-25 18:54:32+0100] ------------------------------------------------------------------------------
[2020-03-25 18:54:32+0100] make distclean ...
[2020-03-25 18:55:20+0100] 
[2020-03-25 18:55:20+0100] Copy Policy.sh ...
[2020-03-25 18:55:20+0100] 
[2020-03-25 18:55:20+0100] Configure ...
[2020-03-25 18:56:50+0100] 
[2020-03-25 18:56:50+0100] make ...
===== PROCURA Policy for hpux/ccache gcc ========================
===== PROCURA Policy results ============================
cc:         ccache gcc
ccversion:  -
gccversion: -
ccflags:    -mlp64 -fPIC -DDEBUGGING
optimize:   
ld:         
ldflags:    -mlp64 -L/pro/local/lib -L/usr/lib/hpux64
libswanted: cl pthread cl pthread socket bind inet nsl ndbm gdbm dbm db malloc dl ld sun m crypt sec util c cposix posix ucb bsd BSD
libsdirs:     /lib /pro/local/lib /usr/lib/hpux64
locincpth:  /pro/local/include
loclibpth:  /usr/lib/hpux64
useshrplib: 
===== PROCURA Policy done ===============================
[2020-03-25 19:24:21+0100] Skip tests from '/pro/3gl/CPAN/smoke/p59.skip'
[2020-03-25 19:24:21+0100] 
[2020-03-25 19:24:21+0100]  Tests start here:
[2020-03-25 19:24:21+0100] TSTENV = stdio	
op.c: In function 'Perl_ck_eval':
op.c:12772:9: warning: value computed is not used [-Wunused-value]
op.c: In function 'S_pmtrans':
op.c:7444:15: warning: 't_cp' may be used uninitialized in this function [-Wmaybe-uninitialized]
op.c:7481:28: warning: 'r_cp' may be used uninitialized in this function [-Wmaybe-uninitialized]
toke.c: In function 'Perl_scan_num':
toke.c:11631:54: warning: 'b' may be used uninitialized in this function [-Wmaybe-uninitialized]
pp.c: In function 'Perl_pp_argelem':
pp.c:7025:13: warning: value computed is not used [-Wunused-value]
regexec.c: In function 'S_regtry':
regexec.c:6539:30: warning: 'fold_array' may be used uninitialized in this function [-Wmaybe-uninitialized]
regexec.c:6443:17: note: 'fold_array' was declared here
regexec.c:6545:28: warning: 'folder' may be used uninitialized in this function [-Wmaybe-uninitialized]
regexec.c:6442:16: note: 'folder' was declared here
time64.c: In function 'Perl_localtime64_r':
time64.c:573:30: warning: 'orig_year' may be used uninitialized in this function [-Wmaybe-uninitialized]
op.c: In function 'Perl_ck_eval':
op.c:12772:9: warning: value computed is not used [-Wunused-value]
op.c: In function 'S_pmtrans':
op.c:7444:15: warning: 't_cp' may be used uninitialized in this function [-Wmaybe-uninitialized]
op.c:7481:28: warning: 'r_cp' may be used uninitialized in this function [-Wmaybe-uninitialized]
RealPPPort.xs: In function 'XS_Devel__PPPort_check_HeUTF8':
RealPPPort.xs:1990:17: warning: value computed is not used [-Wunused-value]
Opcode.xs: In function 'XS_Opcode_invert_opset':
Opcode.xs:363:2: warning: overflow in implicit constant conversion [-Woverflow]
Warning (mostly harmless): No library found for -lposix
Warning (mostly harmless): No library found for -lcposix
./const-xs.inc: In function 'boot_Socket':
./const-xs.inc:986:20: warning: missing braces around initializer [-Wmissing-braces]
./const-xs.inc:986:20: warning: (near initialization for 'ip6_address._s6_un') [-Wmissing-braces]
./const-xs.inc:995:20: warning: missing braces around initializer [-Wmissing-braces]
./const-xs.inc:995:20: warning: (near initialization for 'ip6_address._s6_un') [-Wmissing-braces]
In file included from HiRes.xs:1047:0:
const-c.inc: In function 'constant_19':
const-c.inc:351:42: warning: unused parameter 'iv_return' [-Wunused-parameter]
Making header files for XS...
re_exec.c: In function 'S_regtry':
re_exec.c:6539:30: warning: 'fold_array' may be used uninitialized in this function [-Wmaybe-uninitialized]
re_exec.c:6443:17: note: 'fold_array' was declared here
re_exec.c:6545:28: warning: 'folder' may be used uninitialized in this function [-Wmaybe-uninitialized]
re_exec.c:6442:16: note: 'folder' was declared here
shared.xs: In function 'sharedsv_scalar_store':
shared.xs:830:13: warning: value computed is not used [-Wunused-value]
No saved state, selection will be empty
Cannot figure out an encoding to use at t/use-Encode-Alias.t line 5.
# Connected to 127.0.0.1
# Connected to 127.0.0.1
Redefining sub xChild::foo at xChild--17792 line 2.
Redefining sub Data::ok at -e line 1.

#   Failed test 'protocol defined'
#   at t/cachepropagate-unix.t line 54.

#   Failed test 'protocol defined'
#   at t/cachepropagate-unix.t line 109.
# Looks like you failed 2 tests of 15.
# Will use Digest::MD5

#   Failed test 'U8TO16_LE works as expected (hex bytes:12 34)'
#   at t/hv_macro.t line 65.
#          got: '0x1234'
#     expected: '0x3412'

#   Failed test 'U8TO32_LE works as expected (hex bytes:12 34 56 78)'
#   at t/hv_macro.t line 71.
#          got: '0x12345678'
#     expected: '0x78563412'

#   Failed test 'U8TO64_LE works as expected (hex bytes:12 34 56 78 9a bc de f0)'
#   at t/hv_macro.t line 78.
#          got: '0x123456789abcdef0'
#     expected: '0xf0debc9a78563412'

#   Failed test 'U8TO16_LE works as expected (hex bytes:34 56)'
#   at t/hv_macro.t line 65.
#          got: '0x3456'
#     expected: '0x5634'

#   Failed test 'U8TO32_LE works as expected (hex bytes:34 56 78 9a)'
#   at t/hv_macro.t line 71.
#          got: '0x3456789a'
#     expected: '0x9a785634'

#   Failed test 'U8TO64_LE works as expected (hex bytes:34 56 78 9a bc de f0 12)'
#   at t/hv_macro.t line 78.
#          got: '0x3456789abcdef012'
#     expected: '0x12f0debc9a785634'

#   Failed test 'U8TO16_LE works as expected (hex bytes:56 78)'
#   at t/hv_macro.t line 65.
#          got: '0x5678'
#     expected: '0x7856'

#   Failed test 'U8TO32_LE works as expected (hex bytes:56 78 9a bc)'
#   at t/hv_macro.t line 71.
#          got: '0x56789abc'
#     expected: '0xbc9a7856'

#   Failed test 'U8TO64_LE works as expected (hex bytes:56 78 9a bc de f0 12 34)'
#   at t/hv_macro.t line 78.
#          got: '0x56789abcdef01234'
#     expected: '0x3412f0debc9a7856'

#   Failed test 'U8TO16_LE works as expected (hex bytes:78 9a)'
#   at t/hv_macro.t line 65.
#          got: '0x789a'
#     expected: '0x9a78'

#   Failed test 'U8TO32_LE works as expected (hex bytes:78 9a bc de)'
#   at t/hv_macro.t line 71.
#          got: '0x789abcde'
#     expected: '0xdebc9a78'

#   Failed test 'U8TO64_LE works as expected (hex bytes:78 9a bc de f0 12 34 56)'
#   at t/hv_macro.t line 78.
#          got: '0x789abcdef0123456'
#     expected: '0x563412f0debc9a78'

#   Failed test 'U8TO16_LE works as expected (hex bytes:9a bc)'
#   at t/hv_macro.t line 65.
#          got: '0x9abc'
#     expected: '0xbc9a'

#   Failed test 'U8TO32_LE works as expected (hex bytes:9a bc de f0)'
#   at t/hv_macro.t line 71.
#          got: '0x9abcdef0'
#     expected: '0xf0debc9a'

#   Failed test 'U8TO64_LE works as expected (hex bytes:9a bc de f0 12 34 56 78)'
#   at t/hv_macro.t line 78.
#          got: '0x9abcdef012345678'
#     expected: '0x78563412f0debc9a'

#   Failed test 'U8TO16_LE works as expected (hex bytes:bc de)'
#   at t/hv_macro.t line 65.
#          got: '0xbcde'
#     expected: '0xdebc'

#   Failed test 'U8TO32_LE works as expected (hex bytes:bc de f0 12)'
#   at t/hv_macro.t line 71.
#          got: '0xbcdef012'
#     expected: '0x12f0debc'

#   Failed test 'U8TO64_LE works as expected (hex bytes:bc de f0 12 34 56 78 9a)'
#   at t/hv_macro.t line 78.
#          got: '0xbcdef0123456789a'
#     expected: '0x9a78563412f0debc'

#   Failed test 'U8TO16_LE works as expected (hex bytes:de f0)'
#   at t/hv_macro.t line 65.
#          got: '0xdef0'
#     expected: '0xf0de'

#   Failed test 'U8TO32_LE works as expected (hex bytes:de f0 12 34)'
#   at t/hv_macro.t line 71.
#          got: '0xdef01234'
#     expected: '0x3412f0de'

#   Failed test 'U8TO64_LE works as expected (hex bytes:de f0 12 34 56 78 9a bc)'
#   at t/hv_macro.t line 78.
#          got: '0xdef0123456789abc'
#     expected: '0xbc9a78563412f0de'

#   Failed test 'U8TO16_LE works as expected (hex bytes:f0 12)'
#   at t/hv_macro.t line 65.
#          got: '0xf012'
#     expected: '0x12f0'

#   Failed test 'U8TO32_LE works as expected (hex bytes:f0 12 34 56)'
#   at t/hv_macro.t line 71.
#          got: '0xf0123456'
#     expected: '0x563412f0'

#   Failed test 'U8TO64_LE works as expected (hex bytes:f0 12 34 56 78 9a bc de)'
#   at t/hv_macro.t line 78.
#          got: '0xf0123456789abcde'
#     expected: '0xdebc9a78563412f0'

#   Failed test 'U8TO16_LE works as expected (hex bytes:f0 e1)'
#   at t/hv_macro.t line 65.
#          got: '0xf0e1'
#     expected: '0xe1f0'

#   Failed test 'U8TO32_LE works as expected (hex bytes:f0 e1 d2 c3)'
#   at t/hv_macro.t line 71.
#          got: '0xf0e1d2c3'
#     expected: '0xc3d2e1f0'

#   Failed test 'U8TO64_LE works as expected (hex bytes:f0 e1 d2 c3 b4 a5 96 87)'
#   at t/hv_macro.t line 78.
#          got: '0xf0e1d2c3b4a59687'
#     expected: '0x8796a5b4c3d2e1f0'

#   Failed test 'U8TO16_LE works as expected (hex bytes:e1 d2)'
#   at t/hv_macro.t line 65.
#          got: '0xe1d2'
#     expected: '0xd2e1'

#   Failed test 'U8TO32_LE works as expected (hex bytes:e1 d2 c3 b4)'
#   at t/hv_macro.t line 71.
#          got: '0xe1d2c3b4'
#     expected: '0xb4c3d2e1'

#   Failed test 'U8TO64_LE works as expected (hex bytes:e1 d2 c3 b4 a5 96 87 f0)'
#   at t/hv_macro.t line 78.
#          got: '0xe1d2c3b4a59687f0'
#     expected: '0xf08796a5b4c3d2e1'

#   Failed test 'U8TO16_LE works as expected (hex bytes:d2 c3)'
#   at t/hv_macro.t line 65.
#          got: '0xd2c3'
#     expected: '0xc3d2'

#   Failed test 'U8TO32_LE works as expected (hex bytes:d2 c3 b4 a5)'
#   at t/hv_macro.t line 71.
#          got: '0xd2c3b4a5'
#     expected: '0xa5b4c3d2'

#   Failed test 'U8TO64_LE works as expected (hex bytes:d2 c3 b4 a5 96 87 f0 e1)'
#   at t/hv_macro.t line 78.
#          got: '0xd2c3b4a59687f0e1'
#     expected: '0xe1f08796a5b4c3d2'

#   Failed test 'U8TO16_LE works as expected (hex bytes:c3 b4)'
#   at t/hv_macro.t line 65.
#          got: '0xc3b4'
#     expected: '0xb4c3'

#   Failed test 'U8TO32_LE works as expected (hex bytes:c3 b4 a5 96)'
#   at t/hv_macro.t line 71.
#          got: '0xc3b4a596'
#     expected: '0x96a5b4c3'

#   Failed test 'U8TO64_LE works as expected (hex bytes:c3 b4 a5 96 87 f0 e1 d2)'
#   at t/hv_macro.t line 78.
#          got: '0xc3b4a59687f0e1d2'
#     expected: '0xd2e1f08796a5b4c3'

#   Failed test 'U8TO16_LE works as expected (hex bytes:b4 a5)'
#   at t/hv_macro.t line 65.
#          got: '0xb4a5'
#     expected: '0xa5b4'

#   Failed test 'U8TO32_LE works as expected (hex bytes:b4 a5 96 87)'
#   at t/hv_macro.t line 71.
#          got: '0xb4a59687'
#     expected: '0x8796a5b4'

#   Failed test 'U8TO64_LE works as expected (hex bytes:b4 a5 96 87 f0 e1 d2 c3)'
#   at t/hv_macro.t line 78.
#          got: '0xb4a59687f0e1d2c3'
#     expected: '0xc3d2e1f08796a5b4'

#   Failed test 'U8TO16_LE works as expected (hex bytes:a5 96)'
#   at t/hv_macro.t line 65.
#          got: '0xa596'
#     expected: '0x96a5'

#   Failed test 'U8TO32_LE works as expected (hex bytes:a5 96 87 f0)'
#   at t/hv_macro.t line 71.
#          got: '0xa59687f0'
#     expected: '0xf08796a5'

#   Failed test 'U8TO64_LE works as expected (hex bytes:a5 96 87 f0 e1 d2 c3 b4)'
#   at t/hv_macro.t line 78.
#          got: '0xa59687f0e1d2c3b4'
#     expected: '0xb4c3d2e1f08796a5'

#   Failed test 'U8TO16_LE works as expected (hex bytes:96 87)'
#   at t/hv_macro.t line 65.
#          got: '0x9687'
#     expected: '0x8796'

#   Failed test 'U8TO32_LE works as expected (hex bytes:96 87 f0 e1)'
#   at t/hv_macro.t line 71.
#          got: '0x9687f0e1'
#     expected: '0xe1f08796'

#   Failed test 'U8TO64_LE works as expected (hex bytes:96 87 f0 e1 d2 c3 b4 a5)'
#   at t/hv_macro.t line 78.
#          got: '0x9687f0e1d2c3b4a5'
#     expected: '0xa5b4c3d2e1f08796'

#   Failed test 'U8TO16_LE works as expected (hex bytes:87 f0)'
#   at t/hv_macro.t line 65.
#          got: '0x87f0'
#     expected: '0xf087'

#   Failed test 'U8TO32_LE works as expected (hex bytes:87 f0 e1 d2)'
#   at t/hv_macro.t line 71.
#          got: '0x87f0e1d2'
#     expected: '0xd2e1f087'

#   Failed test 'U8TO64_LE works as expected (hex bytes:87 f0 e1 d2 c3 b4 a5 96)'
#   at t/hv_macro.t line 78.
#          got: '0x87f0e1d2c3b4a596'
#     expected: '0x96a5b4c3d2e1f087'

#   Failed test 'Siphash24 seems to work'
#   at t/hv_macro.t line 207.
#          got: '6c021bba2aad2555'
#     expected: '71a11e065cefc12c'

#   Failed test 'Siphash13 seems to work'
#   at t/hv_macro.t line 213.
#          got: 'e33b5015709212d2'
#     expected: 'adee71f47e49757a'

#   Failed test 'siphash24 test vectors check'
#   at t/hv_macro.t line 219.
#          got: '128'
#     expected: '0'

#   Failed test 'siphash13 test vectors check'
#   at t/hv_macro.t line 220.
#          got: '128'
#     expected: '0'
# Looks like you failed 52 tests of 63.
make: *** [test_harness] Error 52

error while running harness target 'test_harness': 2 at /pro/3gl/CPAN/smoke/lib/Test/Smoke/App/RunSmoke.pm line 118.
[2020-03-25 19:58:50+0100] 
[2020-03-25 19:58:50+0100] ../dist/Devel-PPPort/t/exception.t..........................FAILED
[2020-03-25 19:58:50+0100]     Bad plan.  You planned 7 tests but ran 4.
[2020-03-25 19:58:50+0100] ../dist/IO/t/cachepropagate-unix.t..........................FAILED
[2020-03-25 19:58:50+0100]     2, 10
[2020-03-25 19:58:50+0100] ../dist/IO/t/cachepropagate-unix.t..........................FAILED
[2020-03-25 19:58:50+0100]     Non-zero exit status: 2
[2020-03-25 19:58:50+0100] ../dist/Net-Ping/t/450_service.t............................PASSED
[2020-03-25 19:58:50+0100]     9, 18
[2020-03-25 19:58:50+0100] ../ext/XS-APItest/t/exception.t.............................FAILED
[2020-03-25 19:58:50+0100]     Bad plan.  You planned 12 tests but ran 5.
[2020-03-25 19:58:50+0100] ../ext/XS-APItest/t/hv_macro.t..............................FAILED
[2020-03-25 19:58:50+0100]     2-49, 60-61
[2020-03-25 19:58:50+0100] ../ext/XS-APItest/t/hv_macro.t..............................FAILED
[2020-03-25 19:58:50+0100]     Non-zero exit status: 52
[2020-03-25 19:58:50+0100] ../ext/XS-APItest/t/hv_macro.t..............................FAILED
[2020-03-25 19:58:50+0100]     Bad plan.  You planned 63 tests but ran 61.
[2020-03-25 19:58:50+0100] Archived results...
[2020-03-25 19:58:50+0100] TSTENV = perlio	

#   Failed test 'protocol defined'
#   at t/cachepropagate-unix.t line 54.

#   Failed test 'protocol defined'
#   at t/cachepropagate-unix.t line 109.
# Looks like you failed 2 tests of 15.

#   Failed test 'U8TO16_LE works as expected (hex bytes:12 34)'
#   at t/hv_macro.t line 65.
#          got: '0x1234'
#     expected: '0x3412'

#   Failed test 'U8TO32_LE works as expected (hex bytes:12 34 56 78)'
#   at t/hv_macro.t line 71.
#          got: '0x12345678'
#     expected: '0x78563412'

#   Failed test 'U8TO64_LE works as expected (hex bytes:12 34 56 78 9a bc de f0)'
#   at t/hv_macro.t line 78.
#          got: '0x123456789abcdef0'
#     expected: '0xf0debc9a78563412'

#   Failed test 'U8TO16_LE works as expected (hex bytes:34 56)'
#   at t/hv_macro.t line 65.
#          got: '0x3456'
#     expected: '0x5634'

#   Failed test 'U8TO32_LE works as expected (hex bytes:34 56 78 9a)'
#   at t/hv_macro.t line 71.
#          got: '0x3456789a'
#     expected: '0x9a785634'

#   Failed test 'U8TO64_LE works as expected (hex bytes:34 56 78 9a bc de f0 12)'
#   at t/hv_macro.t line 78.
#          got: '0x3456789abcdef012'
#     expected: '0x12f0debc9a785634'

#   Failed test 'U8TO16_LE works as expected (hex bytes:56 78)'
#   at t/hv_macro.t line 65.
#          got: '0x5678'
#     expected: '0x7856'

#   Failed test 'U8TO32_LE works as expected (hex bytes:56 78 9a bc)'
#   at t/hv_macro.t line 71.
#          got: '0x56789abc'
#     expected: '0xbc9a7856'

#   Failed test 'U8TO64_LE works as expected (hex bytes:56 78 9a bc de f0 12 34)'
#   at t/hv_macro.t line 78.
#          got: '0x56789abcdef01234'
#     expected: '0x3412f0debc9a7856'

#   Failed test 'U8TO16_LE works as expected (hex bytes:78 9a)'
#   at t/hv_macro.t line 65.
#          got: '0x789a'
#     expected: '0x9a78'

#   Failed test 'U8TO32_LE works as expected (hex bytes:78 9a bc de)'
#   at t/hv_macro.t line 71.
#          got: '0x789abcde'
#     expected: '0xdebc9a78'

#   Failed test 'U8TO64_LE works as expected (hex bytes:78 9a bc de f0 12 34 56)'
#   at t/hv_macro.t line 78.
#          got: '0x789abcdef0123456'
#     expected: '0x563412f0debc9a78'

#   Failed test 'U8TO16_LE works as expected (hex bytes:9a bc)'
#   at t/hv_macro.t line 65.
#          got: '0x9abc'
#     expected: '0xbc9a'

#   Failed test 'U8TO32_LE works as expected (hex bytes:9a bc de f0)'
#   at t/hv_macro.t line 71.
#          got: '0x9abcdef0'
#     expected: '0xf0debc9a'

#   Failed test 'U8TO64_LE works as expected (hex bytes:9a bc de f0 12 34 56 78)'
#   at t/hv_macro.t line 78.
#          got: '0x9abcdef012345678'
#     expected: '0x78563412f0debc9a'

#   Failed test 'U8TO16_LE works as expected (hex bytes:bc de)'
#   at t/hv_macro.t line 65.
#          got: '0xbcde'
#     expected: '0xdebc'

#   Failed test 'U8TO32_LE works as expected (hex bytes:bc de f0 12)'
#   at t/hv_macro.t line 71.
#          got: '0xbcdef012'
#     expected: '0x12f0debc'

#   Failed test 'U8TO64_LE works as expected (hex bytes:bc de f0 12 34 56 78 9a)'
#   at t/hv_macro.t line 78.
#          got: '0xbcdef0123456789a'
#     expected: '0x9a78563412f0debc'

#   Failed test 'U8TO16_LE works as expected (hex bytes:de f0)'
#   at t/hv_macro.t line 65.
#          got: '0xdef0'
#     expected: '0xf0de'

#   Failed test 'U8TO32_LE works as expected (hex bytes:de f0 12 34)'
#   at t/hv_macro.t line 71.
#          got: '0xdef01234'
#     expected: '0x3412f0de'

#   Failed test 'U8TO64_LE works as expected (hex bytes:de f0 12 34 56 78 9a bc)'
#   at t/hv_macro.t line 78.
#          got: '0xdef0123456789abc'
#     expected: '0xbc9a78563412f0de'

#   Failed test 'U8TO16_LE works as expected (hex bytes:f0 12)'
#   at t/hv_macro.t line 65.
#          got: '0xf012'
#     expected: '0x12f0'

#   Failed test 'U8TO32_LE works as expected (hex bytes:f0 12 34 56)'
#   at t/hv_macro.t line 71.
#          got: '0xf0123456'
#     expected: '0x563412f0'

#   Failed test 'U8TO64_LE works as expected (hex bytes:f0 12 34 56 78 9a bc de)'
#   at t/hv_macro.t line 78.
#          got: '0xf0123456789abcde'
#     expected: '0xdebc9a78563412f0'

#   Failed test 'U8TO16_LE works as expected (hex bytes:f0 e1)'
#   at t/hv_macro.t line 65.
#          got: '0xf0e1'
#     expected: '0xe1f0'

#   Failed test 'U8TO32_LE works as expected (hex bytes:f0 e1 d2 c3)'
#   at t/hv_macro.t line 71.
#          got: '0xf0e1d2c3'
#     expected: '0xc3d2e1f0'

#   Failed test 'U8TO64_LE works as expected (hex bytes:f0 e1 d2 c3 b4 a5 96 87)'
#   at t/hv_macro.t line 78.
#          got: '0xf0e1d2c3b4a59687'
#     expected: '0x8796a5b4c3d2e1f0'

#   Failed test 'U8TO16_LE works as expected (hex bytes:e1 d2)'
#   at t/hv_macro.t line 65.
#          got: '0xe1d2'
#     expected: '0xd2e1'

#   Failed test 'U8TO32_LE works as expected (hex bytes:e1 d2 c3 b4)'
#   at t/hv_macro.t line 71.
#          got: '0xe1d2c3b4'
#     expected: '0xb4c3d2e1'

#   Failed test 'U8TO64_LE works as expected (hex bytes:e1 d2 c3 b4 a5 96 87 f0)'
#   at t/hv_macro.t line 78.
#          got: '0xe1d2c3b4a59687f0'
#     expected: '0xf08796a5b4c3d2e1'

#   Failed test 'U8TO16_LE works as expected (hex bytes:d2 c3)'
#   at t/hv_macro.t line 65.
#          got: '0xd2c3'
#     expected: '0xc3d2'

#   Failed test 'U8TO32_LE works as expected (hex bytes:d2 c3 b4 a5)'
#   at t/hv_macro.t line 71.
#          got: '0xd2c3b4a5'
#     expected: '0xa5b4c3d2'

#   Failed test 'U8TO64_LE works as expected (hex bytes:d2 c3 b4 a5 96 87 f0 e1)'
#   at t/hv_macro.t line 78.
#          got: '0xd2c3b4a59687f0e1'
#     expected: '0xe1f08796a5b4c3d2'

#   Failed test 'U8TO16_LE works as expected (hex bytes:c3 b4)'
#   at t/hv_macro.t line 65.
#          got: '0xc3b4'
#     expected: '0xb4c3'

#   Failed test 'U8TO32_LE works as expected (hex bytes:c3 b4 a5 96)'
#   at t/hv_macro.t line 71.
#          got: '0xc3b4a596'
#     expected: '0x96a5b4c3'

#   Failed test 'U8TO64_LE works as expected (hex bytes:c3 b4 a5 96 87 f0 e1 d2)'
#   at t/hv_macro.t line 78.
#          got: '0xc3b4a59687f0e1d2'
#     expected: '0xd2e1f08796a5b4c3'

#   Failed test 'U8TO16_LE works as expected (hex bytes:b4 a5)'
#   at t/hv_macro.t line 65.
#          got: '0xb4a5'
#     expected: '0xa5b4'

#   Failed test 'U8TO32_LE works as expected (hex bytes:b4 a5 96 87)'
#   at t/hv_macro.t line 71.
#          got: '0xb4a59687'
#     expected: '0x8796a5b4'

#   Failed test 'U8TO64_LE works as expected (hex bytes:b4 a5 96 87 f0 e1 d2 c3)'
#   at t/hv_macro.t line 78.
#          got: '0xb4a59687f0e1d2c3'
#     expected: '0xc3d2e1f08796a5b4'

#   Failed test 'U8TO16_LE works as expected (hex bytes:a5 96)'
#   at t/hv_macro.t line 65.
#          got: '0xa596'
#     expected: '0x96a5'

#   Failed test 'U8TO32_LE works as expected (hex bytes:a5 96 87 f0)'
#   at t/hv_macro.t line 71.
#          got: '0xa59687f0'
#     expected: '0xf08796a5'

#   Failed test 'U8TO64_LE works as expected (hex bytes:a5 96 87 f0 e1 d2 c3 b4)'
#   at t/hv_macro.t line 78.
#          got: '0xa59687f0e1d2c3b4'
#     expected: '0xb4c3d2e1f08796a5'

#   Failed test 'U8TO16_LE works as expected (hex bytes:96 87)'
#   at t/hv_macro.t line 65.
#          got: '0x9687'
#     expected: '0x8796'

#   Failed test 'U8TO32_LE works as expected (hex bytes:96 87 f0 e1)'
#   at t/hv_macro.t line 71.
#          got: '0x9687f0e1'
#     expected: '0xe1f08796'

#   Failed test 'U8TO64_LE works as expected (hex bytes:96 87 f0 e1 d2 c3 b4 a5)'
#   at t/hv_macro.t line 78.
#          got: '0x9687f0e1d2c3b4a5'
#     expected: '0xa5b4c3d2e1f08796'

#   Failed test 'U8TO16_LE works as expected (hex bytes:87 f0)'
#   at t/hv_macro.t line 65.
#          got: '0x87f0'
#     expected: '0xf087'

#   Failed test 'U8TO32_LE works as expected (hex bytes:87 f0 e1 d2)'
#   at t/hv_macro.t line 71.
#          got: '0x87f0e1d2'
#     expected: '0xd2e1f087'

#   Failed test 'U8TO64_LE works as expected (hex bytes:87 f0 e1 d2 c3 b4 a5 96)'
#   at t/hv_macro.t line 78.
#          got: '0x87f0e1d2c3b4a596'
#     expected: '0x96a5b4c3d2e1f087'

#   Failed test 'Siphash24 seems to work'
#   at t/hv_macro.t line 207.
#          got: '6c021bba2aad2555'
#     expected: '71a11e065cefc12c'

#   Failed test 'Siphash13 seems to work'
#   at t/hv_macro.t line 213.
#          got: 'e33b5015709212d2'
#     expected: 'adee71f47e49757a'

#   Failed test 'siphash24 test vectors check'
#   at t/hv_macro.t line 219.
#          got: '128'
#     expected: '0'

#   Failed test 'siphash13 test vectors check'
#   at t/hv_macro.t line 220.
#          got: '128'
#     expected: '0'
# Looks like you failed 52 tests of 63.
# Connected to 127.0.0.1
# Connected to 127.0.0.1
Cannot figure out an encoding to use at t/use-Encode-Alias.t line 5.
# Will use Digest::MD5
make: *** [test_harness] Error 52

error while running harness target 'test_harness': 2 at /pro/3gl/CPAN/smoke/lib/Test/Smoke/App/RunSmoke.pm line 118.
[2020-03-25 20:28:33+0100] 
[2020-03-25 20:28:33+0100] ../dist/Devel-PPPort/t/exception.t..........................FAILED
[2020-03-25 20:28:33+0100]     Bad plan.  You planned 7 tests but ran 4.
[2020-03-25 20:28:33+0100] ../dist/IO/t/cachepropagate-unix.t..........................FAILED
[2020-03-25 20:28:33+0100]     2, 10
[2020-03-25 20:28:33+0100] ../dist/IO/t/cachepropagate-unix.t..........................FAILED
[2020-03-25 20:28:33+0100]     Non-zero exit status: 2
[2020-03-25 20:28:33+0100] ../ext/XS-APItest/t/hv_macro.t..............................FAILED
[2020-03-25 20:28:33+0100]     2-49, 60-61
[2020-03-25 20:28:33+0100] ../ext/XS-APItest/t/hv_macro.t..............................FAILED
[2020-03-25 20:28:33+0100]     Non-zero exit status: 52
[2020-03-25 20:28:33+0100] ../ext/XS-APItest/t/hv_macro.t..............................FAILED
[2020-03-25 20:28:33+0100]     Bad plan.  You planned 63 tests but ran 61.
[2020-03-25 20:28:33+0100] ../dist/Net-Ping/t/450_service.t............................PASSED
[2020-03-25 20:28:33+0100]     9, 18
[2020-03-25 20:28:33+0100] ../ext/XS-APItest/t/exception.t.............................FAILED
[2020-03-25 20:28:33+0100]     Bad plan.  You planned 12 tests but ran 5.
[2020-03-25 20:28:33+0100] Archived results...
[2020-03-25 20:28:33+0100] TSTENV = locale:en_US.utf8	

#   Failed test 'protocol defined'
#   at t/cachepropagate-unix.t line 54.

#   Failed test 'protocol defined'
#   at t/cachepropagate-unix.t line 109.
# Looks like you failed 2 tests of 15.

#   Failed test 'U8TO16_LE works as expected (hex bytes:12 34)'
#   at t/hv_macro.t line 65.
#          got: '0x1234'
#     expected: '0x3412'

#   Failed test 'U8TO32_LE works as expected (hex bytes:12 34 56 78)'
#   at t/hv_macro.t line 71.
#          got: '0x12345678'
#     expected: '0x78563412'

#   Failed test 'U8TO64_LE works as expected (hex bytes:12 34 56 78 9a bc de f0)'
#   at t/hv_macro.t line 78.
#          got: '0x123456789abcdef0'
#     expected: '0xf0debc9a78563412'

#   Failed test 'U8TO16_LE works as expected (hex bytes:34 56)'
#   at t/hv_macro.t line 65.
#          got: '0x3456'
#     expected: '0x5634'

#   Failed test 'U8TO32_LE works as expected (hex bytes:34 56 78 9a)'
#   at t/hv_macro.t line 71.
#          got: '0x3456789a'
#     expected: '0x9a785634'

#   Failed test 'U8TO64_LE works as expected (hex bytes:34 56 78 9a bc de f0 12)'
#   at t/hv_macro.t line 78.
#          got: '0x3456789abcdef012'
#     expected: '0x12f0debc9a785634'

#   Failed test 'U8TO16_LE works as expected (hex bytes:56 78)'
#   at t/hv_macro.t line 65.
#          got: '0x5678'
#     expected: '0x7856'

#   Failed test 'U8TO32_LE works as expected (hex bytes:56 78 9a bc)'
#   at t/hv_macro.t line 71.
#          got: '0x56789abc'
#     expected: '0xbc9a7856'

#   Failed test 'U8TO64_LE works as expected (hex bytes:56 78 9a bc de f0 12 34)'
#   at t/hv_macro.t line 78.
#          got: '0x56789abcdef01234'
#     expected: '0x3412f0debc9a7856'

#   Failed test 'U8TO16_LE works as expected (hex bytes:78 9a)'
#   at t/hv_macro.t line 65.
#          got: '0x789a'
#     expected: '0x9a78'

#   Failed test 'U8TO32_LE works as expected (hex bytes:78 9a bc de)'
#   at t/hv_macro.t line 71.
#          got: '0x789abcde'
#     expected: '0xdebc9a78'

#   Failed test 'U8TO64_LE works as expected (hex bytes:78 9a bc de f0 12 34 56)'
#   at t/hv_macro.t line 78.
#          got: '0x789abcdef0123456'
#     expected: '0x563412f0debc9a78'

#   Failed test 'U8TO16_LE works as expected (hex bytes:9a bc)'
#   at t/hv_macro.t line 65.
#          got: '0x9abc'
#     expected: '0xbc9a'

#   Failed test 'U8TO32_LE works as expected (hex bytes:9a bc de f0)'
#   at t/hv_macro.t line 71.
#          got: '0x9abcdef0'
#     expected: '0xf0debc9a'

#   Failed test 'U8TO64_LE works as expected (hex bytes:9a bc de f0 12 34 56 78)'
#   at t/hv_macro.t line 78.
#          got: '0x9abcdef012345678'
#     expected: '0x78563412f0debc9a'

#   Failed test 'U8TO16_LE works as expected (hex bytes:bc de)'
#   at t/hv_macro.t line 65.
#          got: '0xbcde'
#     expected: '0xdebc'

#   Failed test 'U8TO32_LE works as expected (hex bytes:bc de f0 12)'
#   at t/hv_macro.t line 71.
#          got: '0xbcdef012'
#     expected: '0x12f0debc'

#   Failed test 'U8TO64_LE works as expected (hex bytes:bc de f0 12 34 56 78 9a)'
#   at t/hv_macro.t line 78.
#          got: '0xbcdef0123456789a'
#     expected: '0x9a78563412f0debc'

#   Failed test 'U8TO16_LE works as expected (hex bytes:de f0)'
#   at t/hv_macro.t line 65.
#          got: '0xdef0'
#     expected: '0xf0de'

#   Failed test 'U8TO32_LE works as expected (hex bytes:de f0 12 34)'
#   at t/hv_macro.t line 71.
#          got: '0xdef01234'
#     expected: '0x3412f0de'

#   Failed test 'U8TO64_LE works as expected (hex bytes:de f0 12 34 56 78 9a bc)'
#   at t/hv_macro.t line 78.
#          got: '0xdef0123456789abc'
#     expected: '0xbc9a78563412f0de'

#   Failed test 'U8TO16_LE works as expected (hex bytes:f0 12)'
#   at t/hv_macro.t line 65.
#          got: '0xf012'
#     expected: '0x12f0'

#   Failed test 'U8TO32_LE works as expected (hex bytes:f0 12 34 56)'
#   at t/hv_macro.t line 71.
#          got: '0xf0123456'
#     expected: '0x563412f0'

#   Failed test 'U8TO64_LE works as expected (hex bytes:f0 12 34 56 78 9a bc de)'
#   at t/hv_macro.t line 78.
#          got: '0xf0123456789abcde'
#     expected: '0xdebc9a78563412f0'

#   Failed test 'U8TO16_LE works as expected (hex bytes:f0 e1)'
#   at t/hv_macro.t line 65.
#          got: '0xf0e1'
#     expected: '0xe1f0'

#   Failed test 'U8TO32_LE works as expected (hex bytes:f0 e1 d2 c3)'
#   at t/hv_macro.t line 71.
#          got: '0xf0e1d2c3'
#     expected: '0xc3d2e1f0'

#   Failed test 'U8TO64_LE works as expected (hex bytes:f0 e1 d2 c3 b4 a5 96 87)'
#   at t/hv_macro.t line 78.
#          got: '0xf0e1d2c3b4a59687'
#     expected: '0x8796a5b4c3d2e1f0'

#   Failed test 'U8TO16_LE works as expected (hex bytes:e1 d2)'
#   at t/hv_macro.t line 65.
#          got: '0xe1d2'
#     expected: '0xd2e1'

#   Failed test 'U8TO32_LE works as expected (hex bytes:e1 d2 c3 b4)'
#   at t/hv_macro.t line 71.
#          got: '0xe1d2c3b4'
#     expected: '0xb4c3d2e1'

#   Failed test 'U8TO64_LE works as expected (hex bytes:e1 d2 c3 b4 a5 96 87 f0)'
#   at t/hv_macro.t line 78.
#          got: '0xe1d2c3b4a59687f0'
#     expected: '0xf08796a5b4c3d2e1'

#   Failed test 'U8TO16_LE works as expected (hex bytes:d2 c3)'
#   at t/hv_macro.t line 65.
#          got: '0xd2c3'
#     expected: '0xc3d2'

#   Failed test 'U8TO32_LE works as expected (hex bytes:d2 c3 b4 a5)'
#   at t/hv_macro.t line 71.
#          got: '0xd2c3b4a5'
#     expected: '0xa5b4c3d2'

#   Failed test 'U8TO64_LE works as expected (hex bytes:d2 c3 b4 a5 96 87 f0 e1)'
#   at t/hv_macro.t line 78.
#          got: '0xd2c3b4a59687f0e1'
#     expected: '0xe1f08796a5b4c3d2'

#   Failed test 'U8TO16_LE works as expected (hex bytes:c3 b4)'
#   at t/hv_macro.t line 65.
#          got: '0xc3b4'
#     expected: '0xb4c3'

#   Failed test 'U8TO32_LE works as expected (hex bytes:c3 b4 a5 96)'
#   at t/hv_macro.t line 71.
#          got: '0xc3b4a596'
#     expected: '0x96a5b4c3'

#   Failed test 'U8TO64_LE works as expected (hex bytes:c3 b4 a5 96 87 f0 e1 d2)'
#   at t/hv_macro.t line 78.
#          got: '0xc3b4a59687f0e1d2'
#     expected: '0xd2e1f08796a5b4c3'

#   Failed test 'U8TO16_LE works as expected (hex bytes:b4 a5)'
#   at t/hv_macro.t line 65.
#          got: '0xb4a5'
#     expected: '0xa5b4'

#   Failed test 'U8TO32_LE works as expected (hex bytes:b4 a5 96 87)'
#   at t/hv_macro.t line 71.
#          got: '0xb4a59687'
#     expected: '0x8796a5b4'

#   Failed test 'U8TO64_LE works as expected (hex bytes:b4 a5 96 87 f0 e1 d2 c3)'
#   at t/hv_macro.t line 78.
#          got: '0xb4a59687f0e1d2c3'
#     expected: '0xc3d2e1f08796a5b4'

#   Failed test 'U8TO16_LE works as expected (hex bytes:a5 96)'
#   at t/hv_macro.t line 65.
#          got: '0xa596'
#     expected: '0x96a5'

#   Failed test 'U8TO32_LE works as expected (hex bytes:a5 96 87 f0)'
#   at t/hv_macro.t line 71.
#          got: '0xa59687f0'
#     expected: '0xf08796a5'

#   Failed test 'U8TO64_LE works as expected (hex bytes:a5 96 87 f0 e1 d2 c3 b4)'
#   at t/hv_macro.t line 78.
#          got: '0xa59687f0e1d2c3b4'
#     expected: '0xb4c3d2e1f08796a5'

#   Failed test 'U8TO16_LE works as expected (hex bytes:96 87)'
#   at t/hv_macro.t line 65.
#          got: '0x9687'
#     expected: '0x8796'

#   Failed test 'U8TO32_LE works as expected (hex bytes:96 87 f0 e1)'
#   at t/hv_macro.t line 71.
#          got: '0x9687f0e1'
#     expected: '0xe1f08796'

#   Failed test 'U8TO64_LE works as expected (hex bytes:96 87 f0 e1 d2 c3 b4 a5)'
#   at t/hv_macro.t line 78.
#          got: '0x9687f0e1d2c3b4a5'
#     expected: '0xa5b4c3d2e1f08796'

#   Failed test 'U8TO16_LE works as expected (hex bytes:87 f0)'
#   at t/hv_macro.t line 65.
#          got: '0x87f0'
#     expected: '0xf087'

#   Failed test 'U8TO32_LE works as expected (hex bytes:87 f0 e1 d2)'
#   at t/hv_macro.t line 71.
#          got: '0x87f0e1d2'
#     expected: '0xd2e1f087'

#   Failed test 'U8TO64_LE works as expected (hex bytes:87 f0 e1 d2 c3 b4 a5 96)'
#   at t/hv_macro.t line 78.
#          got: '0x87f0e1d2c3b4a596'
#     expected: '0x96a5b4c3d2e1f087'

#   Failed test 'Siphash24 seems to work'
#   at t/hv_macro.t line 207.
#          got: '6c021bba2aad2555'
#     expected: '71a11e065cefc12c'

#   Failed test 'Siphash13 seems to work'
#   at t/hv_macro.t line 213.
#          got: 'e33b5015709212d2'
#     expected: 'adee71f47e49757a'

#   Failed test 'siphash24 test vectors check'
#   at t/hv_macro.t line 219.
#          got: '128'
#     expected: '0'

#   Failed test 'siphash13 test vectors check'
#   at t/hv_macro.t line 220.
#          got: '128'
#     expected: '0'
# Looks like you failed 52 tests of 63.
# Will use Digest::MD5
# Connected to 127.0.0.1
syswrite() isn't allowed on :utf8 handles at t/Socket.t line 47.
# Looks like your test exited with 255 just after 2.
make: *** [test_harness] Error 52

error while running harness target 'test_harness': 2 at /pro/3gl/CPAN/smoke/lib/Test/Smoke/App/RunSmoke.pm line 118.
[2020-03-25 20:58:11+0100] 
[2020-03-25 20:58:11+0100] ../dist/Devel-PPPort/t/exception.t..........................FAILED
[2020-03-25 20:58:11+0100]     Bad plan.  You planned 7 tests but ran 4.
[2020-03-25 20:58:11+0100] ../dist/IO/t/cachepropagate-unix.t..........................FAILED
[2020-03-25 20:58:11+0100]     2, 10
[2020-03-25 20:58:11+0100] ../dist/IO/t/cachepropagate-unix.t..........................FAILED
[2020-03-25 20:58:11+0100]     Non-zero exit status: 2
[2020-03-25 20:58:11+0100] ../dist/Net-Ping/t/450_service.t............................PASSED
[2020-03-25 20:58:11+0100]     9, 18
[2020-03-25 20:58:11+0100] ../ext/XS-APItest/t/exception.t.............................FAILED
[2020-03-25 20:58:11+0100]     Bad plan.  You planned 12 tests but ran 5.
[2020-03-25 20:58:11+0100] ../ext/XS-APItest/t/hv_macro.t..............................FAILED
[2020-03-25 20:58:11+0100]     2-49, 60-61
[2020-03-25 20:58:11+0100] ../ext/XS-APItest/t/hv_macro.t..............................FAILED
[2020-03-25 20:58:11+0100]     Non-zero exit status: 52
[2020-03-25 20:58:11+0100] ../ext/XS-APItest/t/hv_macro.t..............................FAILED
[2020-03-25 20:58:11+0100]     Bad plan.  You planned 63 tests but ran 61.
[2020-03-25 20:58:11+0100] ../cpan/Socket/t/Socket.t...................................FAILED
[2020-03-25 20:58:11+0100]     Non-zero exit status: 255
[2020-03-25 20:58:11+0100] ../cpan/Socket/t/Socket.t...................................FAILED
[2020-03-25 20:58:11+0100]     Bad plan.  You planned 6 tests but ran 2.
[2020-03-25 20:58:11+0100] Archived results...
[2020-03-25 20:58:11+0100] Unskip tests from '/pro/3gl/CPAN/smoke/p59.skip'
[2020-03-25 20:58:11+0100] Finished smoking afd41ae4e769eb6f4f106977edabdca9ab36b497 v5.31.10-14-gafd41ae blead
[2020-03-25 20:58:11+0100] Reading smokeresult from /pro/3gl/CPAN/perl-current/mktest.out
[2020-03-25 20:58:11+0100] Processing [-Dcc=gcc]
[2020-03-25 20:58:11+0100] Processing [-DDEBUGGING -Dcc=gcc]
[2020-03-25 20:58:11+0100] Processing [-Dcc=gcc -Duse64bitall]
[2020-03-25 20:58:11+0100] Processing [-DDEBUGGING -Dcc=gcc -Duse64bitall]
[2020-03-25 20:58:11+0100] Processing [-Dcc=gcc -Duseithreads]
[2020-03-25 20:58:11+0100] Processing [-DDEBUGGING -Dcc=gcc -Duseithreads]
[2020-03-25 20:58:11+0100] Processing [-Dcc=gcc -Duseithreads -Duse64bitall]
[2020-03-25 20:58:11+0100] Processing [-DDEBUGGING -Dcc=gcc -Duseithreads -Duse64bitall]
[2020-03-25 20:58:11+0100] ==> Starting reporter
[2020-03-25 20:58:11+0100] Writing report to '/pro/3gl/CPAN/perl-current/mktest.rpt'
[2020-03-25 20:58:11+0100] Locally applied patches from '/pro/3gl/CPAN/perl-current/patchlevel.h'
[2020-03-25 20:58:11+0100] Patches: 'RC0;uncommitted-changes;SMOKEafd41ae4e769eb6f4f106977edabdca9ab36b497'
[2020-03-25 20:58:11+0100] Looking for cc messages: 'gcc'
-- 
Report generated by Test::Smoke::Gateway v0.09_01